[comment encoding = UTF-8 /]
[module generate_resource_factory('http://www.eclipse.org/uml2/5.0.0/UML')]
[import uml::to::vmj::services::additional_services /]
[import uml::to::vmj::util::util /]

[template public generateResourceFactory(pkg : Package)]
[file (pkg.corePackageName() + '/' + splName() + '/' + pkg.umlPkgName() + '/' + pkg.name.substring(2).concat('ResourceFactory.java'), false)]
package [splName()/].[pkg.umlPkgName()/];

import [splName()/].[pkg.umlPkgName()/].core.[pkg.name.substring(2)/]Resource;
import java.lang.reflect.Constructor;
import java.util.logging.Logger;

public class [pkg.name.substring(2)/]ResourceFactory{
    private static final Logger LOGGER = Logger.getLogger([pkg.name.substring(2)/]Factory.class.getName());

    public [pkg.name.substring(2)/]ResourceFactory()
    {

    }

    public static [pkg.name.substring(2)/]Resource create[pkg.name.substring(2)/]Resource(String fullyQualifiedName, Object ... base)
    {
        [pkg.name.substring(2)/]Resource record = null;
        try {
            Class<?> clz = Class.forName(fullyQualifiedName);
            Constructor<?> constructor = clz.getDeclaredConstructors()['['/]0[']'/];
            record = ([pkg.name.substring(2)/]Resource) constructor.newInstance(base);
        } 
        catch (IllegalArgumentException e)
        {
            LOGGER.severe("Failed to create instance of [pkg.name.substring(2)/].");
            LOGGER.severe("Given FQN: " + fullyQualifiedName);
            LOGGER.severe("Failed to run: Check your constructor argument");
            System.exit(20);
        }
        catch (ClassCastException e)
        {   LOGGER.severe("Failed to create instance of [pkg.name.substring(2)/].");
            LOGGER.severe("Given FQN: " + fullyQualifiedName);
            LOGGER.severe("Failed to cast the object");
            System.exit(30);
        }
        catch (ClassNotFoundException e)
        {
            LOGGER.severe("Failed to create instance of [pkg.name.substring(2)/].");
            LOGGER.severe("Given FQN: " + fullyQualifiedName);
            LOGGER.severe("Decorator can't be applied to the object");
            System.exit(40);
        }
        catch (Exception e)
        {
            LOGGER.severe("Failed to create instance of [pkg.name.substring(2)/].");
            LOGGER.severe("Given FQN: " + fullyQualifiedName);
            System.exit(50);
        }
        return record;
    }

}
[/file]
[/template]

[comment small hack on this query, need better type checking/]
[comment][query public getAllRelations(c : Classifier) : Set(Classifier) = 
    if (c.oclIsKindOf(Class)) then
        c.oclAsType(Class).getAllClassRelations()
    else if (c.oclIsKindOf(Interface)) then
        c.oclAsType(Interface).getAllInterfaceRelations()
        else 
            Set{c}->excluding(c) 
        endif
    endif
/]

[query public getAllClassRelations(c : Class) : Set(Classifier) =
    c.getAllImplementedInterfaces()->union(c.getGenerals())
/]

[query public getAllInterfaceRelations(c : Interface) : Set(Classifier) =
    c.getGenerals()
/]

[query public getType(t : Type) : String = t.name /][/comment]