[comment encoding = UTF-8 /]
[module generate_component('http://www.eclipse.org/uml2/5.0.0/UML')]
[import uml::to::vmj::services::additional_services /]
[import uml::to::vmj::util::util /]

[template public generateAbstractComponent(aClass : Class)]
[file (aClass.coreDirectory() + aClass.classComponent().concat('.java'), false)]
package [aClass.corePackageName()/];

import java.util.*;
import vmj.routing.route.Route;
import vmj.routing.route.VMJExchange;

import javax.persistence.Entity;
import javax.persistence.Id;
import javax.persistence.Inheritance;
import javax.persistence.InheritanceType;
import javax.persistence.Table;

@Entity
@Table(name="[aClass.interfaceRealization.contract.name.toLower()/]_comp")
@Inheritance(strategy = InheritanceType.JOINED)
public abstract class [aClass.classComponent()/] implements [aClass.interfaceRealization.contract.name/]{
	@Id
	[aClass.getPrimaryKey()/]
	[for (p: Property | aClass.attribute)]
	[if (p.type.oclIsKindOf(Class))]
	@ManyToOne(targetEntity=[aClass.splName()/].[p.getTypeAssocAttributes().toLower()/].core.[p.getTypeAssocAttributes()/]Component.class)
	[p.visibility/] [p.getTypeAssocAttributes()/] [p.name/];
	[elseif (not (p.name.contains('id')))]
	[p.visibility/] [p.type.standarizedName()/] [p.name/];
	[/if]
	[/for]

	public [aClass.classComponent()/]() {

	} 

	[for (p: Property | aClass.attribute)]
	[if ((p.visibility.toString() = 'private' or p.visibility.toString() = 'protected'))]
	[p.getterMethodHeader()/] {
		return this.[p.name/];
	}

	[p.setterMethodHeader()/] {
		this.[p.name/] = [p.name/];
	}
	[else]
	public abstract [p.type.standarizedName()/] get[p.name.toUpperFirst()/]();
	public abstract void set[p.name.toUpperFirst()/]([p.type.standarizedName()/] [p.name/]);
	
	[/if]
	[/for]
 
	[for (o: Operation | aClass.ownedOperation) separator('\n')]
	[o.visibility/] abstract [o.minMethodHeader()/];
	[/for]

	@Override
    public String toString() {
        return "{" +
		[for (p: Property | aClass.attribute)]
            " [p.name/]='" + get[p.name.toUpperFirst()/]() + "'" +
		[/for]
            "}";
    }
	
    public HashMap<String, Object> toHashMap() {
        HashMap<String, Object> [aClass.interfaceRealization.contract.name.toLower()/]Map = new HashMap<String,Object>();
		[for (p: Property | aClass.attribute)]
		[aClass.interfaceRealization.contract.name.toLower()/]Map.put("[p.name/]",get[p.name.toUpperFirst()/]());
		[/for]

        return [aClass.interfaceRealization.contract.name.toLower()/]Map;
    }
}
[/file]
[/template]
