[comment encoding = UTF-8 /]
[module component_generator('http://www.eclipse.org/uml2/5.0.0/UML')]
[import uml::to::vmj::services::additional_services /]
[import uml::to::vmj::util::util /]

[import uml::to::vmj::deltaclassgenerator::generate_extends_class /]
[import uml::to::vmj::componentgenerator::generate_feature_mapping /]
[import uml::to::vmj::componentgenerator::generate_factory_constraint /]
[import uml::to::vmj::componentgenerator::generate_product_class /]
[import uml::to::vmj::componentgenerator::generate_product_module_info /]
[import uml::to::vmj::componentgenerator::generate_combined_module_info /]

[template public genComponent(cmp : Component)]
[if (cmp.hasStereotype('feature'))]
[file ('ck.properties', true)]
[cmp.generateFeatureMapping().trim()/]
[/file]

[if ( not (cmp.getRelatedPackage() -> at(2)).oclIsUndefined() )] 
[file (splName() + '.' + cmp.getClientPackage().getDeltaFeatureName() + '.' + cmp.name.toLower() + '/' + splName() + '/' + cmp.getClientPackage().getDeltaFeatureName() + '/' + cmp.name.toLower() + '/' + cmp.getClientModifiedClass().name + '.java', false)]
package [splName()/].[cmp.getClientPackage().getDeltaFeatureName()/].[cmp.name.toLower()/];

[cmp.getClientModifiedClass().generateExtendsClassNoPkg()/]
[/file]

[file (splName() + '.' + cmp.getClientPackage().getDeltaFeatureName() + '.' + cmp.name.toLower() + '/module-info.java', false)]
[cmp.generateCombinedModuleInfo()/]
[/file]

[deleteLastCurlyBracket(splName() + '.' + cmp.getClientPackage().getDeltaFeatureName() + '.core/' + splName() + '/' + cmp.getClientPackage().getDeltaFeatureName() + '/' + cmp.getClientPackage().getDeltaFeatureNameCamel() + 'Factory.java')/]
[file (splName() + '.' + cmp.getClientPackage().getDeltaFeatureName() + '.core/' + splName() + '/' + cmp.getClientPackage().getDeltaFeatureName() + '/' + cmp.getClientPackage().getDeltaFeatureNameCamel() + 'Factory.java' , true)]
[cmp.generateFactoryConstraint()/]
[/file]
[/if]

[/if]


[comment] -- product module is generated by feature IDE
[elseif (cmp.hasStereotype('product'))]
[file (splName() + '.product.' + cmp.name.toLower() + '/module-info.java', false)]
[cmp.generateProductModuleInfo()/]
[/file]

[file (splName() + '.product.' + cmp.name.toLower() + '/' + splName() + '/product/' + cmp.name.toLower() + '/' + cmp.name.concat('.java'), false)]
[cmp.generateProductClass().trim()/]
[/file]
[/if]

[/comment]
[/template]