[comment encoding = UTF-8 /]
[module generate_concrete_component('http://www.eclipse.org/uml2/5.0.0/UML')]
[import uml::to::vmj::services::additional_services /]
[import uml::to::vmj::util::util /]

[template public generateConcreteComponent(aClass : Class)]
[file (aClass.deltaPackageNameAdd() + '/' + splName() + '/' + aClass.eContainer(Package).getCoreModuleName() + '/' + aClass.umlPkgName()  + '/model/' + aClass.name.concat('.java'), false)]
package [aClass.deltaPackageNameAdd()/];

import java.lang.Math;
import java.util.*;
import vmj.routing.route.Route;
import vmj.routing.route.VMJExchange;

import javax.persistence.Entity;
import javax.persistence.Table;
import javax.persistence.Column;
import javax.persistence.ForeignKey;
import javax.persistence.Id;
import javax.persistence.JoinColumn;
import javax.persistence.ManyToOne;
import javax.persistence.OneToMany;


@Entity(name="[aClass.interfaceRealization.contract.name.toLower()/]_impl")
@Table(name="[aClass.interfaceRealization.contract.name.toLower()/]_impl")
public class [aClass.name.toUpperFirst()/] extends [aClass.classComponent()/] {

	public [aClass.name/]([aClass.constructorArgs()/]) {
		[for (p: Property | aClass.attribute)]
		this.[p.name/] = [p.name/];
		[/for]
	}

	[for (o: Operation | aClass.ownedOperation) separator('\n')]
	[o.visibility/] [o.minMethodHeader()/] {
		// TODO: implement this method
	}
	[/for]

}
[/file]
[/template]