[comment encoding = UTF-8 /]
[module generate_combined_module_info('http://www.eclipse.org/uml2/5.0.0/UML')]
[import uml::to::vmj::services::additional_services /]
[import uml::to::vmj::util::util /]

[template public generateCombinedModuleInfo(cmp: Component)]
module [splName()/].[cmp.getClientPackage().getDeltaFeatureName()/].[cmp.name.toLower()/] {
	exports [splName()/].[cmp.getClientPackage().getDeltaFeatureName()/].[cmp.name.toLower()/];
	requires [splName()/].[cmp.getClientPackage().getDeltaFeatureName()/].core;
	[for (relPkg : Package | cmp.getRelatedPackage())]
	requires [splName()/].[cmp.getClientPackage().getDeltaFeatureName()/].[relPkg.umlPkgName()/];
	[/for]
}
[/template]
