[comment encoding = UTF-8 /]
[module generate_feature_mapping('http://www.eclipse.org/ocl/1.1.0/UML', 'http://www.eclipse.org/uml2/5.0.0/UML')]
[import uml::to::vmj::services::additional_services /]
[import uml::to::vmj::util::util /]

[template public generateFeatureMapping(cmp : Component)]
[for (pkg: Package | cmp.getClientDependencies().supplier.oclAsType(Package))]
[if (pkg.hasStereotype('module'))]
[splName()/].[pkg.umlPkgName()/].[cmp.name.toLower()/]=[pkg.corePackageName()/]
[elseif (pkg.hasStereotype('delta'))]
[splName()/].[pkg.getDeltaFeatureName()/].[cmp.name.toLower()/]=[for (relPkg: Package | pkg.getRelatedPackage()) separator(', ')][relPkg.deltaPackageName()/][/for]
[/if]
[/for]
[/template]
