[comment encoding = UTF-8 /]
[module Utils('http://www.eclipse.org/uml2/5.0.0/UML', 'http://www.omg.org/spec/20130218/core', 'http://www.omg.org/spec/20130218/ext','http://www.w3.org/XML/1998/namespace', 'http://amanah.cs.ui.ac.id/ifml/dop')]

[template public toCamelCase(string : String)][string.toLowerFirst().replaceAll(' ', '') /][/template]
[template public toPascalCase(string : String)][string.replaceAll(' ', '') /][/template]
[template public selectListType(string : String)][if (self.startsWith('List'))]Card[else]Table[/if][/template]
[query public isType(element: InteractionFlowModelElement, typeName : String) : Boolean = self.eClass().name.equalsIgnoreCase(typeName) /]
[query public isInType(element: InteractionFlowModelElement, typeName : String) : Boolean = self.eClass().name.contains(typeName) /]
[query public isInDeltaModule(element: InteractionFlowModelElement) : Boolean = self.isInType('Modified') or self.isInType('Added') or self.isInType('Removed') /]
[query public hasParameter(element : ViewElement) : Boolean = 
if self.oclIsTypeOf(List) then self.oclAsType(List).getParameter()->exists(p | p.isType('IFMLParameter'))
else 
	if self.oclIsTypeOf(Details) then self.oclAsType(Details).getParameter()->exists(p | p.isType('IFMLParameter'))
	else self.oclAsType(Form).getParameter()->exists(p | p.isType('IFMLParameter')) 
	endif
endif /]

[query public getSimpleFields(form: Form) : Sequence(SimpleField) = 
if self.oclIsTypeOf(ModifiedForm) then
Sequence{
	form.oclAsType(ModifiedForm).modifies.eAllContents(SimpleField),
	form.eAllContents(AddedSimpleField)
}
->flatten()
->select(field | form.eAllContents(RemovedSimpleField).removes->excludes(field))
else
self.eAllContents(SimpleField)
endif /]

[query public getSimpleFields(list: List) : Sequence(SimpleField) = 
if self.oclIsTypeOf(ModifiedList) then
Sequence{
	list.oclAsType(ModifiedList).modifies.eAllContents(SimpleField),
	list.eAllContents(AddedSimpleField)
}
->flatten()
->select(field | list.eAllContents(RemovedSimpleField).removes->excludes(field))
else
self.eAllContents(SimpleField)
endif /]

[comment][query public getAction(arg : Type) : OclAny = self /][/comment]


[query public getSelectionFields(form: Form) : Sequence(SelectionField) = 
if self.oclIsTypeOf(ModifiedForm) then
Sequence{
	form.oclAsType(ModifiedForm).modifies.eAllContents(SelectionField),
	form.eAllContents(AddedSelectionField)
}
->flatten()
->select(field | form.eAllContents(RemovedSelectionField).removes->excludes(field))
else
self.eAllContents(SelectionField)
endif /]

[query public getSelectionFields(list: List) : Sequence(SelectionField) = 
if self.oclIsTypeOf(ModifiedList) then
Sequence{
	list.oclAsType(ModifiedList).modifies.eAllContents(SelectionField),
	list.eAllContents(AddedSelectionField)
}
->flatten()
->select(field | list.eAllContents(RemovedSelectionField).removes->excludes(field))
else
self.eAllContents(SelectionField)
endif /]

[query public getVizAttrs(dataBinding : DataBinding) : Sequence(VisualizationAttribute) =
if self.oclIsTypeOf(ModifiedDataBinding) then 
Sequence{
	self.oclAsType(ModifiedDataBinding).modifies.eAllContents(VisualizationAttribute),
	self.eAllContents(AddedVisualizationAttribute)->select(va | not va.oclIsTypeOf(RemovedVisualizationAttribute))
}
->flatten()
->select(va | self.eContents(RemovedVisualizationAttribute)->collect(rva | rva.removes)->excludes(va)) 
else self.eAllContents(VisualizationAttribute)
endif /]

[query public getDataBindings(viewContainer: ViewContainer) : Sequence(DataBinding) = 
if self.isInType('Delta') then
Sequence{
	self.oclAsType(Delta).uses.eAllContents(DataBinding),
	self.eAllContents(DataBinding)
}
->flatten()
->filterDataBinding(self)
else self.eAllContents(DataBinding) endif /]

[comment] new implementation of getDataBindings for List [/comment]
[query public getDataBindings(list: List) : Sequence(DataBinding) = 
if self.oclIsTypeOf(ModifiedList) then
Sequence{
	self.oclAsType(ModifiedList).modifies.eAllContents(DataBinding),
	self.eAllContents(DataBinding)
}
->flatten()
->filterDataBinding(self)
else self.eAllContents(DataBinding) endif /]

[comment] new implementation of getDataBindings for Details [/comment]
[query public getDataBindings(detail: Details) : Sequence(DataBinding) = 
if self.oclIsTypeOf(ModifiedDetail) then
Sequence{
	self.oclAsType(ModifiedDetail).modifies.eAllContents(DataBinding),
	self.eAllContents(DataBinding)
}
->flatten()
->filterDataBinding(self)
else self.eAllContents(DataBinding) endif /]

[query public getDataBindings(form: Form) : Sequence(DataBinding) = 
if self.oclIsTypeOf(ModifiedForm) then
Sequence{
	self.oclAsType(ModifiedForm).modifies.eAllContents(DataBinding),
	self.eAllContents(DataBinding)
}
->flatten()
->filterDataBinding(self)
else self.eAllContents(DataBinding) endif /]

[query public getViewElementEvents(viewCont: ViewContainer) : Sequence(ViewElementEvent) = 
if self.isInType('Delta') then
Sequence{
	self.eContents(ModifiedViewElementEvent),
	self.eContents(AddedViewElementEvent),
	self.oclAsType(Delta).uses.eContents(ViewElementEvent)
}
->flatten()
->filterVEE(self)
else 
self.eContents(ViewElementEvent)
endif/]

[query public getViewElementEvents(window: IFMLWindow) : Sequence(ViewElementEvent) = 
if self.viewContainer.isInType('Delta') then
Sequence{
	self.eContents(ModifiedViewElementEvent),
	self.eContents(AddedViewElementEvent),
	self.viewContainer.oclAsType(Delta).uses.eContents(ViewContainer).eContents(ViewElementEvent)
}
->flatten()
->filterVEE(self)
else
self.eContents(ViewElementEvent)
endif/]

[query public getViewElementEvents(list: List) : Sequence(ViewElementEvent) = 
if self.oclIsTypeOf(ModifiedList) then
Sequence{
	self.eContents(ModifiedViewElementEvent),
	self.eContents(AddedViewElementEvent),
	self.oclAsType(ModifiedList).modifies.eContents(ViewElementEvent)
}
->flatten()
->filterVEE(self)
else 
self.eContents(ViewElementEvent)
endif/]

[query public getViewElementEvents(detail: Details) : Sequence(ViewElementEvent) = 
if self.oclIsTypeOf(ModifiedDetail) then
Sequence{
	self.eContents(ModifiedViewElementEvent),
	self.eContents(AddedViewElementEvent),
	self.oclAsType(ModifiedDetail).modifies.eContents(ViewElementEvent)
}
->flatten()
->filterVEE(self)
else 
self.eContents(ViewElementEvent)
endif/]

[query public getViewElementEvents(form: Form) : Sequence(ViewElementEvent) = 
if self.oclIsTypeOf(ModifiedForm) then
Sequence{
	self.eContents(ModifiedViewElementEvent),
	self.eContents(AddedViewElementEvent),
	self.oclAsType(ModifiedForm).modifies.eContents(ViewElementEvent)
}
->flatten()
->filterVEE(self)
else 
self.eContents(ViewElementEvent)
endif/]

[comment] use ->first() due to should only have one NavigationFlow to navigate user to a certain page [/comment]
[query public getNavFlow(event: ViewElementEvent) : NavigationFlow = 
if self.oclIsTypeOf(ModifiedViewElementEvent) then 
Sequence{
	self.eContents(ModifiedNavigationFlow),
	self.eContents(AddedNavigationFlow),
	self.oclAsType(ModifiedViewElementEvent).modifies.eContents(NavigationFlow)
}
->flatten()
->filterNavFlow(self)
->first()
else 
	self.eContents(NavigationFlow)->first() 
endif/]

[query public getNavFlow(actionEvent: ActionEvent) : NavigationFlow = 
if self.oclIsTypeOf(ModifiedActionEvent) then 
Sequence{
	self.eContents(ModifiedNavigationFlow),
	self.eContents(AddedNavigationFlow),
	self.oclAsType(ModifiedActionEvent).modifies.eContents(NavigationFlow)
}
->flatten()
->filterNavFlow(self)
->first()
else 
	self.eContents(NavigationFlow)->first() 
endif/]

[query public getParamBinding(nav: NavigationFlow) : Sequence(ParameterBinding) = 
if self.oclIsTypeOf(ModifiedNavigationFlow) then 
Sequence{
	self.oclAsType(ModifiedNavigationFlow).modifies.eAllContents(ParameterBinding),
	self.eAllContents(ParameterBinding)
}
->flatten()
else 
	self.eAllContents(ParameterBinding)
endif/]

[query public getAction(element: InteractionFlowModelElement) : Sequence(IFMLAction) = 
if self.isInType('Delta') then
Sequence{
	self.eContents(ModifiedAction),
	self.eContents(AddedAction),
	self.oclAsType(Delta).uses.eContents(IFMLAction)
}
->flatten()
->filterAction(self)
else 
self.eContents(IFMLAction)
endif/]

[comment] use ->first() due to should only have one ActionEvent to navigate user to a certain page [/comment]
[query public getActionEvent(action: IFMLAction) : ActionEvent = 
if self.oclIsTypeOf(ModifiedAction) then 
Sequence{
	self.actionEvents,
	self.oclAsType(ModifiedAction).modifies.actionEvents
}
->flatten()
->filterActionEvent(self)
->first()
else 
	self.actionEvents->asSequence()->first() 
endif/]

[query public getViewElements(element: InteractionFlowModelElement) : Sequence(ViewElement) = 
if self.isInType('Delta') then
Sequence{
	self.eContents(ViewElement),
	self.oclAsType(Delta).uses.eContents(ViewElement)
}
->flatten()
->filterViewElement(self)
else 
self.eContents(ViewElement)
endif/]

[query public getParameter(list: List) : Sequence(IFMLParameter) = 
if self.oclIsTypeOf(ModifiedList) then
Sequence{
	self.oclAsType(ModifiedList).modifies.parameters,
	self.parameters
}
->flatten()
else self.parameters->asSequence() endif/]

[query public getParameter(detail: Details) : Sequence(IFMLParameter) = 
if self.oclIsTypeOf(ModifiedDetail) then
Sequence{
	self.oclAsType(ModifiedDetail).modifies.parameters,
	self.parameters
}
->flatten()
else self.parameters->asSequence() endif/]

[query public getParameter(form: Form) : Sequence(IFMLParameter) = 
if self.oclIsTypeOf(ModifiedForm) then
Sequence{
	self.oclAsType(ModifiedForm).modifies.parameters,
	self.parameters
}
->flatten()
else self.parameters->asSequence() endif/]

[comment] new implementation of filterDataBinding query [/comment]
[query public filterDataBinding(dataBindings: Sequence(DataBinding), element: InteractionFlowModelElement) : Sequence(DataBinding) =
self
->select(x| element.eAllContents(ModifiedDataBinding)->collect(mdb | mdb.modifies)->excludes(x))
->select(x| element.eAllContents(RemovedDataBinding)->collect(rdb | rdb.removes)->excludes(x))
->select(x| not x.isInType('Removed'))
->select(x | x.oclAsType(DataBinding).uniformResourceIdentifier->notEmpty()) /]
[query public filterVEE(events: Sequence(ViewElementEvent), element: InteractionFlowModelElement) : Sequence(ViewElementEvent) = 
self
->select(x| element.eContents(ModifiedViewElementEvent)->collect(mvee | mvee.modifies)->excludes(x))
->select(x| element.eContents(RemovedViewElementEvent)->collect(rvee | rvee.removes)->excludes(x)) /]
[query public filterAction(actions: Sequence(IFMLAction), element: InteractionFlowModelElement) : Sequence(IFMLAction) = 
self
->select(x| element.eContents(ModifiedAction)->collect(ma | ma.modifies)->excludes(x))
->select(x| element.eContents(RemovedAction)->collect(ra | ra.removes)->excludes(x)) /]
[query public filterActionEvent(actionEvents: Sequence(ActionEvent), element: InteractionFlowModelElement) : Sequence(ActionEvent) = 
self
->select(x| element.eContents(ModifiedActionEvent)->collect(mae | mae.oclAsType(ModifiedActionEvent).modifies)->excludes(x))
->select(x| element.eContents(RemovedActionEvent)->collect(rae | rae.oclAsType(RemovedActionEvent).removes)->excludes(x)) /]
[query public filterNavFlow(navFlows: Sequence(NavigationFlow), element: InteractionFlowModelElement) : Sequence(NavigationFlow) = 
self
->select(x| element.eContents(ModifiedNavigationFlow)->collect(mnf | mnf.modifies)->excludes(x))
->select(x| element.eContents(RemovedNavigationFlow)->collect(rnf | rnf.removes)->excludes(x)) /]
[query public filterViewElement(viewElements: Sequence(ViewElement), element: InteractionFlowModelElement) : Sequence(ViewElement) = 
self
->select(x| element.eContents(ModifiedList)->collect(ml | ml.modifies)->excludes(x))
->select(x| element.eContents(ModifiedDetail)->collect(md | md.modifies)->excludes(x))
->select(x| element.eContents(ModifiedForm)->collect(mf | mf.modifies)->excludes(x))
->select(x| element.eContents(RemovedList)->collect(rl | rl.removes)->excludes(x))
->select(x| element.eContents(RemovedDetail)->collect(rd | rd.removes)->excludes(x))
->select(x| element.eContents(RemovedForm)->collect(rf | rf.removes)->excludes(x))
->select(x| not x.isInType('Removed')) /]
[query public filterParameterType(params: Sequence(IFMLParameter), type: String) : Sequence(IFMLParameter) = self->select(x|x.direction.toString() = type) /]
[query public filterDataBinding(vc : ViewComponent) : Sequence(DataBinding) =
self.eAllContents(DataBinding)->select(uniformResourceIdentifier->notEmpty())->collect(db | db.oclAsType(DataBinding)) /]
[query public getFieldsOfType(element: ViewElement, typeName: String) : Sequence(ViewComponentPart) = self.eAllContents(ViewComponentPart)->select(x | x.isInType(typeName)) /]
[query public isAnnotationTextIncludes(event : ViewElementEvent, expectedName: String) : Boolean = 
if self.oclIsTypeOf(ModifiedViewElementEvent) then self.oclAsType(ModifiedViewElementEvent).modifies.eAllContents(Annotation).text.contains(expectedName)->any(true)
else self.eAllContents(Annotation).text.contains(expectedName)->any(true) endif /]

[query public hasAnnotationWithText(element: InteractionFlowModelElement, input: String) : Boolean = self.eContents(Annotation)->exists(a| a.oclAsType(Annotation).text.contains(input)) /]
[query public getAnnotationWithText(element: InteractionFlowModelElement, input: String) : Annotation = self.eContents(Annotation)->select(a| a.oclAsType(Annotation).text.contains(input))->first() /]
[query public hasActivationExpProp(element: InteractionFlowModelElement) : Boolean = self.eClass().getEStructuralFeature('activationExpression')->notEmpty() /]
[query public isActivationExpNotEmpty(exp: ActivationExpression) : Boolean = not self._body->oclIsUndefined() and not self.language->oclIsUndefined() /]
[query public isActivationExpLang(exp: ActivationExpression, type: String) : Boolean = self.language.equalsIgnoreCase(type)/]
[query public isConditionalRender(event: ViewElementEvent) : Boolean = self.hasActivationExpProp() and isActivationExpNotEmpty(self.activationExpression) and self.activationExpression.isActivationExpLang('javascript')/]
[query public getFeatureName(element: InteractionFlowModelElement) : String = self.ancestors(ViewContainer)->select(x | isType(x, 'ViewContainer'))->first().name/]

