[comment encoding = Cp1252 /]
[**
 * The documentation of the module.
 */]
[module Watermark('http://www.eclipse.org/uml2/5.0.0/UML', 'http://www.omg.org/spec/20130218/data')/]

[query public generateWatermark() : String = 
	invoke('ifml.ui.generator.services.Watermark', 'generateWatermark()', Sequence{})
/]
