[comment encoding = UTF-8 /]
[module BottomNavigationMenuGenerator('http://www.eclipse.org/uml2/5.0.0/UML', 'http://www.omg.org/spec/20130218/core', 'http://www.w3.org/XML/1998/namespace')]

[import ifml::ui::generator::reactgenerator::Utils /]

[template public generateBottomNavigationMenu(model : InteractionFlowModel)]
[generateImport() /]
[for (menu : ViewContainer | self.eAllContents(ViewContainer))]
	[if (menu.isLandmark and menu.annotations->notEmpty() and menu.annotations->asSequence()->first().text.equalsIgnoreCase('isMobileFirst'))]
		[menu.generateMenu()/]
	[/if]
[/for]
[generateExport() /]
[/template]

[template private generateImport(model : InteractionFlowModel) post (trim())]
[file ('src/commons/components/BottomNavigationMenu/index.js', false)]
import React from 'react'
import { Link } from 'react-router-dom'
import { MdLogout, MdLogin } from 'react-icons/md'
import Button from '../Button'
import useAppearanceStore from 'commons/appearance/store'
import { useAuth } from 'commons/auth'
import Icon from '../Icon'
import Modal from '../Modal'

const BottomNavigationMenu = (props) => {
	const { isAuth, logout, checkPermission } = useAuth();
	const { colorTheme } = useAppearanceStore()

	const handleLogout = () => {
		logout()
		setIsShowModal(false)
	}

	const ['[isShowModal, setIsShowModal]'/] = React.useState(false)
	return <div data-theme={colorTheme} className="fixed bottom-0 bg-primary left-0 
	right-0 p-4 pt-3 pb-3 flex justify-around max-w-md mx-auto">[/file]
[/template]


[template private generateMenu(menu : ViewContainer)]
[file ('src/commons/components/BottomNavigationMenu/index.js', true)]
	<Link to='/mobile[menu.eAllContents(NavigationFlow)->first().targetInteractionFlowElement.annotations.text /]' className='no-underline flex flex-col items-center' replace>
		<Icon name='[menu.name/]' />
		<span className="text-white text-xs">[menu.name/]</span>
	</Link>[/file]
[/template]


[template private generateExport(model : InteractionFlowModel) post (trim()) {
	firstMenu: ViewContainer = model.eContents(ViewContainer)->select(v | v.isLandmark and v.annotations->notEmpty() 
			and v.annotations->asSequence()->first().text.equalsIgnoreCase('isMobileFirst'))->first();
}]
[file ('src/commons/components/BottomNavigationMenu/index.js', true)]
	{isAuth ?
	<Link className='no-underline flex flex-col items-center' onClick={() => setIsShowModal(true)}>
		<MdLogout className="w-8 h-8 mb-1" color='white' />
		<span className="text-white text-xs">Keluar</span>
	</Link>
	:
	<Link to='/mobile/login?homeUrl=/mobile[firstMenu.eAllContents(NavigationFlow)->first().targetInteractionFlowElement.annotations.text/]' className='no-underline flex flex-col items-center'>
		<MdLogin className="w-8 h-8 mb-1" color='white' />
		<span className="text-white text-xs">Masuk</span>
	</Link>
	}
	<Modal isShow={isShowModal} text='Apakah anda yakin ingin keluar?' >
		<div className="flex justify-around gap-4">
			<Button onClick={() => handleLogout()} variant='primary'>Ya</Button>
			<Button onClick={() => setIsShowModal(false)} variant='secondary'>Tidak</Button>
		</div>
	</Modal>
	</div>
}

export default BottomNavigationMenu
[/file]
[/template]
