[comment encoding = Cp1252 /]
[**
 * The documentation of the module.
 */]
[module SelectionName('http://www.eclipse.org/uml2/5.0.0/UML', 'http://www.omg.org/spec/20130218/data')/]

[**
 * The documentation of the query
 * @param arg0
 */]
[query public getType(arg0 : String) : String
	= invoke('ifml.ui.generator.services.SelectionName', 'getType(java.lang.String)', Sequence{arg0})
/]

