[comment encoding = Cp1252 /]
[**
 * The documentation of the module.
 */]
[module tokenizeAction('http://org/eclipse/emf/ecp/view/categorization/model', 'http://www.eclipse.org/uml2/5.0.0/UML', 'http://www.omg.org/spec/20130218/data')/]

[**
 * The documentation of the query
 * @param arg0
 */]
[query public getMethod(arg0 : String) : String
	= invoke('ifml.ui.generator.services.tokenizeAction', 'getMethod(java.lang.String)', Sequence{arg0})
/]

[**
 * The documentation of the query
 * @param arg0
 */]
[query public getNameService(arg0 : String) : String
	= invoke('ifml.ui.generator.services.tokenizeAction', 'getNameService(java.lang.String)', Sequence{arg0})
/] 

[query public concatStringBag(bag: Bag(String)) : String 
= invoke('ifml.ui.generator.services.tokenizeAction','concatTokens(org.eclipse.ocl.util.Bag)',Sequence{bag}) 
/]

