[comment encoding = UTF-8 /]
[module DetailContainer('http://www.eclipse.org/uml2/5.0.0/UML', 'http://www.omg.org/spec/20130218/core', 'http://www.omg.org/spec/20130218/ext', 'http://www.w3.org/XML/1998/namespace', 'http://amanah.cs.ui.ac.id/ifml/dop')]
[import ifml::ui::generator::services::tokenizeAction/]
[import ifml::ui::generator::reactgenerator::Utils /]
[import ifml::ui::generator::reactgenerator::transformations::Detail /]
[import ifml::ui::generator::reactgenerator::components::DetailComponent /]

[template public generateDetailContainerImport(detail : Details, selectedTemplate:String) 
post (trim()) {componentName : String = self.name.toPascalCase();}]
import [componentName/] from '../components/[componentName /]'
[self.generateServiceImport() /]
[/template]

[template public generateDetailContainerHooks(detail : Details, selectedTemplate:String) 
post (trim())
{
	dataBindings: Sequence(DataBinding) = self.getDataBindings();
	queryParam: String = self.getParameter()->any(x|x.direction.toString()='inout').name
}]
	[for (db : DataBinding | dataBindings)]
const ['[' + db.name.toCamelCase() + ', set' + db.name.toPascalCase() +  ']' /] = useState()
	[/for]
[comment] 
	inInteractionFlows will detect whether a container have multiple ViewComponent or not.
	Also will detect whether a ViewComponent correlates with another ViewComponent or not
[/comment]
[if (self.inInteractionFlows->isEmpty())]
const { [queryParam.toCamelCase() /] } = useParams()
[else]
const ['[selected' + self.name.toPascalCase() + 'Id, setSelected' + self.name.toPascalCase() +  'Id]' /] = useState(null)
[/if]
[self.generateUseEffectHooks(dataBindings, queryParam) /]
[/template]

[template public generateDetailContainerJSX(detail : Details, page : ViewContainer, directoryName: String, selectedTemplate:String, isMobileFirst: Boolean) 
post (trim())]
[self.generateContainerJSX(page, selectedTemplate, isMobileFirst) /]
[self.generateDetailComponent(page, directoryName, selectedTemplate, isMobileFirst) /]
[/template]

[template protected generateServiceImport(detail: Details)
{
	dataBindings: Sequence(DataBinding) = self.getDataBindings();
}]
[for (db : DataBinding | dataBindings)]
import get[db.name.toPascalCase() /] from '../services/get[db.name.toPascalCase() /]'
[/for]
[/template]

[template protected generateUseEffectHooks(detail: Details, dataBindings: Sequence(DataBinding), queryParam: String)
{
	isCorrelatedWithAnotherComponent: Boolean = self.inInteractionFlows->notEmpty();
}]
[comment] if a ViewComponent's inInteractionFlows property isn't empty, it means that ViewComponent correlates with another ViewComponent  [/comment]
[comment][if (self.inInteractionFlows->notEmpty())][/comment]
[if (dataBindings->notEmpty())]
[let dependency: String = if isCorrelatedWithAnotherComponent then '[selected' + self.name.toPascalCase() + 'Id]' else '[]' endif ]
useEffect(() => {
	const fetchData = async () => {
		try {
			setIsLoading(prev => ({...prev, [self.name.toCamelCase()/]: true}))
			[for (db : DataBinding | dataBindings)]
			const { data: [db.name.toCamelCase() /] } = await get[db.name.toPascalCase() /]({ [if (isCorrelatedWithAnotherComponent)]id: selected[detail.name.toPascalCase()/]Id [else][queryParam.toCamelCase()/][/if] })
			[/for]
			[for (db : DataBinding | dataBindings)]
			set[db.name.toPascalCase() /]([db.name.toCamelCase() /].data)
			[/for]
		} finally {
			setIsLoading(prev => ({...prev, [self.name.toCamelCase()/]: false}))
		}
	}
	[if isCorrelatedWithAnotherComponent]selected[self.name.toPascalCase()/]Id &&[/if] fetchData()
}, [dependency/])
[/let]
[/if]
[/template]