[comment encoding = UTF-8 /]
[module ListContainer('http://www.eclipse.org/uml2/5.0.0/UML', 'http://www.omg.org/spec/20130218/core', 'http://www.omg.org/spec/20130218/ext','http://www.w3.org/XML/1998/namespace', 'http://amanah.cs.ui.ac.id/ifml/dop')]

[import ifml::ui::generator::reactgenerator::Utils /]
[import ifml::ui::generator::reactgenerator::variations::ListVariations /]
[import ifml::ui::generator::reactgenerator::components::ListComponent /]
[import ifml::ui::generator::reactgenerator::variations::EventVariations /]

[template public generateListContainerImport(list : List, page: ViewContainer, selectedTemplate:String) 
post (trim())]
[self.generateVariationImport()/]
[self.generateServiceImport(page)/]
[/template]

[template public generateListContainerHooks(list : List, page: ViewContainer, selectedTemplate:String) 
post (trim())
{
	dataBindings: Sequence(DataBinding) = self.getDataBindings();
	params: Sequence(IFMLParameter) = self.getParameter();
	events: Sequence(ViewElementEvent) = page.getViewElementEvents();
}]
	[for (db : DataBinding | dataBindings)]
const ['[' + db.name.toCamelCase() + ', set' + db.name.toPascalCase() +  ']' /] = useState()
	[/for]
	[if (self.name.startsWith('Report'))]
const { [for (p : IFMLParameter | params->filterParameterType('inout')) after (', ')]
		[p.name.toCamelCase()/][/for] } = useParams()
	[/if]
	[for (event : ViewElementEvent | events)]
[event.generateActionHooks()/]
	[/for]
[self.generateUseEffectHooks(dataBindings, params) /]
[/template]

[template public generateListContainerJSX(list : List, page : ViewContainer, directoryName: String, selectedTemplate:String, isMobileFirst: Boolean) 
post (trim())]
[self.generateContainerJSX(page, selectedTemplate, isMobileFirst) /]
[self.generateListComponent(page, directoryName, selectedTemplate, isMobileFirst) /]
[/template]

[template protected generateServiceImport(list: List, page: ViewContainer)
{
	dataBindings: Sequence(DataBinding) = self.getDataBindings();
	events: Sequence(ViewElementEvent) = page.getViewElementEvents()
}]
[for (db : DataBinding | dataBindings)]
import get[db.name.toPascalCase() /] from '../services/get[db.name.toPascalCase() /]'
[/for]
[if (events->notEmpty())]
[for (event : ViewElementEvent | events) after ('\n')]
[event.generateImport()/]
[/for]
[/if]
[/template]

[template protected generateUseEffectHooks(list: List, dataBindings: Sequence(DataBinding), params: Sequence(IFMLParameter))]
[if (not dataBindings->oclIsUndefined())]
useEffect(() => {
		const fetchData = async () => {
			try {
				setIsLoading(prev => ({...prev, [self.name.toCamelCase()/]: true}))
				[for (db : DataBinding | dataBindings)]
				const { data: [db.name.toCamelCase() /] } = await get[db.name.toPascalCase() /]([if (list.name.startsWith('Report'))]{ [params->filterParameterType('inout')->first().name.toCamelCase() /] }[/if])
				[/for]
				[for (db : DataBinding | dataBindings)]
				set[db.name.toPascalCase() /]([db.name.toCamelCase() /].data)
				[/for]
			} finally {
				setIsLoading(prev => ({...prev, [self.name.toCamelCase()/]: false}))
			}
		}
		fetchData()	
  	}, ['[]' /])
[/if]
[/template]

