{
    "name": "RfWebserver",
    "keywords": "pwm, led",
    "description": "Helper library for ESP32 Webserver with version infos",
    "authors": {
        "name": "Marcus Schneider",
        "email": "schnake24@gmail.com"
    },
    "repository": {
        "type": "git",
        "url": "https://gitlab.com/RFsmarthome/libs/rfwebserver.git"
    },
    "frameworks": "arduino",
    "platforms": "espressif32"
}
