{
    "name": "RfTouch",
    "keywords": "touch",
    "description": "Helper library for ESP32 touch button",
    "authors": {
        "name": "Marcus Schneider",
        "email": "schnake24@gmail.com"
    },
    "repository": {
        "type": "git",
        "url": "https://gitlab.com/RFsmarthome/libs/rftoucg.git"
    },
    "frameworks": "arduino",
    "platforms": "espressif32"
}
