{
  "url": "https://github.com/NixOS/nixpkgs.git",
  "rev": "1fc591f9a5bd1b016b5d66dfab29560073955a14",
  "date": "2019-03-03T22:12:45+00:00",
  "sha256": "1ij5x1qw486rbih7xh2c01s60c3zblj6ad1isf5y99sh47jcq76c",
  "fetchSubmodules": false
}
