,0
0,0.0941849464078531
1,-0.4601258807396948
2,0.3409670954763346
3,0.16152952715352634
4,-0.07571301957838639
5,0.1470084184652877
6,-0.6113848132062797
7,-0.6248894157904362
8,0.41498537197324925
9,-0.7155667634979892
10,0.09462187112251617
11,-0.2801224364378565
12,-0.633417583176345
13,0.4629882871333038
14,-0.34351278257509577
15,0.3691449092504134
16,0.062375733752075974
17,-0.3403021295757473
18,-0.3348103519176386
19,0.3803193224035666
20,-0.409149578570113
21,0.4433647376926541
22,-0.38957858303391857
23,0.8803652517126237
24,-0.8137821412290364
25,-0.8351862061967618
26,0.45944298805941214
27,0.2844295738584911
28,0.8594404254866643
29,-0.4840734585615905
30,0.5533798871442994
31,-0.40219997720800715
32,0.5937052967008971
33,0.37239837107950846
34,-0.7396091497760421
35,-0.7046773017696817
36,0.6579690943921649
37,0.17836753738121783
38,0.5173289322940632
39,0.37902725986287134
40,0.49195680653390944
41,-0.8399699759101356
42,0.2690231253236136
43,0.43767702267664704
44,0.04806447631117419
45,-0.5402955516500715
46,0.8152796875291137
47,-0.7951483764919727
48,0.4629882871333038
49,-0.4571738788916937
50,0.12886170322691592
51,-0.293131885665935
52,0.5825128951457842
53,0.6436338404127876
54,0.3045591040782784
55,0.07237212732003237
56,0.8345032837816406
57,0.8085344554177862
58,0.7088926660256322
59,-0.8305590441945901
60,-0.9384094089896249
61,0.3872078695966385
62,0.08368512221809676
63,0.3116592513480763
64,0.49615681503134856
65,-0.07966240884380033
66,-0.40861457074577157
67,0.414985386747827
68,-0.30088579270696286
69,0.11276740713733732
70,0.4412267980239378
71,-0.1950406574687987
72,0.5725939059718069
73,-0.8130992774972395
74,0.09687335368663327
75,-0.5239471692030976
76,-0.16811192824138077
77,-0.8234602679455152
78,-0.6804188243512085
79,0.48762567533822143
80,-0.01744421372012398
81,0.7866102912169195
82,-0.6502380113492421
83,-0.36248095797587165
84,0.9800932436225139
85,-0.021177400863492755
86,-0.2732253774345586
87,0.42335385013545995
88,0.459246365585588
89,-0.9025094903721451
90,-0.8706057789498214
91,-0.6216321118151689
92,-0.6323996237713537
93,0.36994347796514626
94,-0.5995827547465911
95,-0.32504542937517195
96,-0.24476496757877408
97,-0.33059481317119105
98,0.42773977357892956
99,-0.7696812572748233
100,0.6401818914207207
101,0.5140487727531817
102,-0.3258915106653604
103,-0.028696309343247073
104,0.534828776529052
105,-0.46574078751318343
106,-0.5783051111791101
107,0.16263095674709777
108,0.866184604815799
109,0.8518614478570723
110,-0.1504865113174021
111,0.37932183718099777
112,-0.2030413672051857
113,0.18050535340341572
114,0.3618945098628483
115,0.5960747594368472
116,0.10458679368000413
117,0.6409153982661384
118,-0.4260283311540902
119,-0.6867696852835479
120,0.8560060012425965
121,0.2828290612637376
122,-0.21009539957009604
123,0.7652599672060737
124,0.6791052022589277
125,-0.4608251666952956
126,-0.7477897592185594
127,-0.23923510912566384
128,0.7909885838587711
129,-0.12640594041749995
130,-0.8560558385719687
131,0.8129203348466232
132,0.6900293230905374
133,0.5493133429010522
134,-0.16331384363728788
135,0.060348713631472976
136,-0.9015603285019474
137,0.904422734895557
138,-0.6359148538805733
139,0.9516328347799948
140,0.10488897449566134
141,0.2189588942129419
142,-0.7786527348079763
143,-0.27264435938223835
144,0.33024948714096974
145,-0.6018858132555372
146,-0.1419986926181569
147,-0.70450675765468
148,0.5348288593269466
149,0.025725247741333414
150,0.552938917795066
151,0.16006639900689384
152,-0.0021826342402163426
153,-0.1597685502515795
154,-0.9025903363300036
155,0.21895890200845763
156,0.1940203735264126
157,0.36329488263177845
158,-0.21098938576229298
159,0.4422171678321001
160,0.5416305029551641
161,0.08957905459512355
162,0.635778156855734
163,0.787293079199206
164,0.16806785181436823
165,0.07881039333919276
166,-0.6885994340849761
167,0.5389180543067281
168,-0.4267112804896568
169,0.31468437246510206
170,-0.612928900842057
171,0.661317952317371
172,0.13882780902277175
173,-0.4853374192593125
174,0.1504865113174018
175,0.21077829227469075
176,-0.8270055670194071
177,0.07068650747824709
178,-0.47048600389553685
179,0.38792795840524047
180,-0.24544785154477622
181,-0.23246795386469532
182,-0.4216771171908742
183,0.083415143156157
184,-0.06444164535371828
185,-0.05403945884826459
186,-0.5043374247651148
187,-0.43993472194286726
188,-0.02823339227276471
189,-0.6035990788205131
190,-0.8737932270062103
191,0.912603344338073
192,0.2666429378272949
193,-0.6669757813481069
194,-0.07557689717893463
195,-0.1416230091946033
196,0.207232993074577
197,0.8907254065806471
198,-0.6579394426573767
199,-0.8238445091872193
200,0.8399700058152906
201,-0.07751462576082238
202,-0.9093048389637152
203,-0.20615868749382038
204,-0.3589510112467951
205,-0.803328850794591
206,-0.1974952863934583
207,0.2577794262113021
208,-0.0869404192603915
209,0.8594701006468932
210,-0.5652556501142376
211,0.5105970690770625
212,0.4102614512706834
213,-0.3208149858998679
214,0.8726638517478232
215,0.10172349104547579
216,-0.6996424254051383
217,-0.42162249472506697
218,-0.6392125505014468
219,-0.7278831544891837
220,-0.40957855856608755
221,0.4665929717218927
222,-0.43649470106901656
223,-0.6469436566945632
224,0.04035843360627472
225,0.3945913406982127
226,-0.7011068231001403
227,-0.3749089772096573
228,0.002182634240216016
229,-0.255855002967431
230,0.14980362397052527
231,-0.09244146109064279
232,0.026449075789004156
233,0.7217092855381299
234,0.7950474309727781
235,-0.30295851224812786
236,0.09708870983279777
237,0.17871213969021024
238,-0.11367844746320045
239,0.27433249313105473
240,0.3332118344944945
241,0.25559991249797576
242,0.8228576128864561
243,-0.3666523836138162
244,0.8642363145116116
245,0.9324092426975911
246,0.8746896322818314
247,-0.5061930891961277
248,-0.29663957180114714
249,-0.5632892691827309
250,0.5508592001688707
251,-0.8306398580207222
252,-0.029961850477932775
253,-0.725659831710025
254,-0.00722545051036331
255,-0.6934637167362507
256,0.7476268775962042
257,-0.5668826244312144
258,0.6037937473874735
259,0.045349390259315094
260,0.2944601650431782
261,0.23831116438323802
262,-0.15395049490969714
263,-0.23970878516873906
264,0.33481572029882406
265,0.9568795274335217
266,-0.7444042527446825
267,-0.22792928967840537
268,0.28687376992421776
269,-0.24676061584600273
270,0.8926968581615209
271,0.3865249631307306
272,0.29563156238334654
273,0.8832276895514755
274,0.5138944518899294
275,-0.7554769706369594
276,-0.5096275009859287
277,0.18618426812156497
278,-0.7696811275162586
279,-0.48864721826179136
280,-0.16152952715352648
281,-0.24937146844315858
282,-0.2912350748107138
283,0.34129251512801134
284,-0.5689145138672964
285,0.2386041465801226
286,-0.435895570079266
287,-0.9889567457453121
288,0.7763029557969183
289,-0.8129202379389584
290,-0.3336838926667126
291,-0.49615681503134823
292,-0.437859741308499
293,-0.8649193102169137
294,-0.21009539957009513
295,0.16220400834321588
296,0.19532174375127054
297,-0.6885994340849758
298,-0.004970919914197342
299,-0.5750151576445496
300,0.5748706969442048
301,-0.589360224429476
302,-0.12666242878052084
303,0.66128762376468
304,-0.5707261638780412
305,-0.8416317056197885
306,0.9246149251068073
307,0.6723098294894149
308,-0.7189452711062984
309,-0.09886108465186627
310,-0.26094475268685374
311,-0.7220469237150153
312,0.8914082992852433
313,-0.7477897592185588
314,0.7731156510428109
315,-0.5529389374811551
316,0.19687197330893635
317,-0.5036545141290858
318,0.17568033247320414
319,-0.5858961346418059
320,0.170902496190917
321,-0.29903170110321603
322,-0.6512249076500058
323,-0.7202166705345335
324,0.6804188243512086
325,-0.8109197637063171
326,-0.8636466160525457
327,0.43878277418638634
328,-0.29462941342948484
329,-0.5645240620396197
330,-0.07427075426986188
331,0.4852926994257021
332,0.05579717080130962
333,-0.10990410048799158
334,0.9390923351040806
335,0.9060247300979901
336,-0.38652497689204274
337,0.7283674935052725
338,-0.1968719662997732
339,0.6292407340055801
340,-0.17864466752163385
341,0.35976792683339853
342,0.08196236010363374
343,-0.35079563245737266
344,0.316864819932656
345,-0.5244687171297813
346,0.736063762956495
347,-0.8272789029552059
348,0.5284872482865024
349,-0.1960287719922745
350,-0.7113366742413556
351,0.41498517686391795
352,-0.18651184978424562
353,0.48840588082105635
354,-0.3727505972454985
355,0.37902725986287084
356,-0.13473805449756007
357,-0.15736852286133635
358,0.10211958815168763
359,-0.3231416761456871
360,0.1515909753877008
361,0.6179222142895158
362,-0.5428104875713214
363,-0.8241431606257976
364,-0.8594402924350217
365,-0.7367028479393098
366,-0.03371440904251976
367,0.4954739046865701
368,0.29703750264202544
369,-0.8627502111700853
370,0.41462136033186225
371,-0.5351848754959998
372,-0.866184604815799
373,0.5252748893514718
374,-0.6428135772284167
375,0.5926402739210531
376,0.14918793217861412
377,-0.501526751525631
378,0.20687082430064466
379,-0.8238444798561746
380,0.8272788735018878
381,-0.5662413223722521
382,-0.34426058232326373
383,0.4487200389059321
384,-0.16748312035057078
385,-0.20047843689178413
386,-0.33024948714096974
387,-0.9280492858337825
388,-0.05293803500557267
389,-0.7872931838972013
390,0.8881863334134175
391,-0.6004960495055965
392,0.028233392272765064
393,-0.36451999322244355
394,0.3617359270932343
395,-0.5237858244494994
396,0.8305590146244913
397,-0.9855223520995988
398,-0.6472982244655603
399,-0.9102917352293425
400,0.38652491705336034
401,0.15044534625906236
402,-0.5462448618915452
403,-0.023814952916911082
404,0.5817515812562813
405,0.4344314491904352
406,0.043679335323574354
407,0.7188468791445215
408,-0.8406528985198862
409,-0.01758557429229849
410,-0.8020562327126289
411,0.3768849287578535
412,-0.04550139995865029
413,0.6214374438833009
414,-0.8484270844176075
415,0.4704860206460833
416,-0.7043870478012066
417,0.5111187208205998
418,0.9807761712210225
419,-0.736746769612569
420,-0.10178491703880305
421,0.7807242735041096
422,-0.24731743923677066
423,0.42653137688371745
424,-0.22554134161572156
425,0.24253632724814614
426,-0.9309117253703126
427,-0.2997144472248512
428,-0.3433537894887939
429,0.3250454409476495
430,-0.27892270087812526
431,-0.2922882904223767
432,-0.7155667380219182
433,-0.3841551330641473
434,-0.8406528985198867
435,-0.672292275286276
436,0.5782875124513941
437,0.021042120269794608
438,0.13280306682984577
439,-0.23637495571508324
440,-0.9855223520995979
441,-0.627650968802188
442,0.1470084184652878
443,-0.36386597432812406
444,0.14632553099458118
445,0.004362148031139755
446,-0.5355117329659063
447,-0.3890554571668323
448,-0.5030646998073305
449,-0.021065007157250158
450,0.40563437097599425
451,-0.6437777818414632
452,-0.7123270597936197
453,-0.262496291867189
454,0.03775936242438908
455,0.47460420993924074
456,0.611539065734882
457,0.939092176784941
458,-0.9356579413360924
459,-0.2670003853631717
460,-0.8053117413274404
461,0.24363711962045148
462,0.3594415615964029
463,0.8219627799356032
464,0.043717083474889035
465,-0.6357605787172106
466,-0.39975433254404785
467,-0.9889567457453122
468,-0.5894706114154606
469,0.5814359781613602
470,-0.5715729776830794
471,0.6921447332850889
472,-0.8435153050154054
473,0.39131121350732473
474,-0.7732345218736146
475,0.5639819537104407
476,0.02883650177221702
477,0.3435801301614914
478,-0.01432707431219317
479,-0.13996929416210382
480,-0.7837478848233107
481,-0.6545226037258012
482,0.12803471519470638
483,-0.8821873493110033
484,-0.5926579438080088
485,0.5632892491281433
486,-0.420710200531461
487,0.9889567457453122
488,0.03445838534933509
489,0.3216290202339879
490,0.03107921035745843
491,-0.2677484779568651
492,0.1721869205590396
493,0.05897796231137156
494,0.07521900918910825
495,0.43420901271088025
496,0.2936758062955868
497,0.25630219708284796
498,-0.7493946999207682
499,0.10745237360609958
