,0
0,-0.9748795667317098
1,0.058858017449649705
2,-0.6669562113173991
3,0.9999993887498997
4,-0.6296207210810716
5,-0.7234420728120223
6,0.04951514586776859
7,0.5073975913045996
8,-0.28186736868526546
9,0.014733036345236268
10,0.1344037833123503
11,-0.4072538414424198
12,0.05047069241252908
13,0.7483659045025925
14,-0.4712876533710333
15,0.6483975231897932
16,-0.09029183463428633
17,-0.06366588670709296
18,0.14390542690469654
19,-0.21870212926244587
20,-0.8442080370766867
21,-0.22623453262415472
22,0.0988941472928479
23,0.4133018845751047
24,0.7232887089441805
25,-0.1065695271761765
26,-0.7234622501524108
27,-0.5339450866118969
28,0.05046575468883627
29,0.16186433062255606
30,-0.1439054217812828
31,0.8724252064743857
32,-0.2627958883882048
33,0.9999993531498721
34,-0.9063267416025392
35,-0.09388718576498468
36,0.22646787155569342
37,-0.06283701014452497
38,-0.4028319601607973
39,-0.7354127157089866
40,0.5015661862743082
41,0.016103266585502412
42,0.3970005585872868
43,-0.42797241087482113
44,-0.07286383688921927
45,0.43840141293205076
46,0.9688315147366039
47,-0.15583699629028108
48,-0.8721918594908963
49,-0.09555443187897633
