,0
0,-0.08673985259674373
1,-0.7651247384809814
2,0.009252307633296424
3,0.4817617524123236
4,-0.0472366237593756
5,-0.14183431732922563
6,-0.5834441921489252
7,-0.5305846049240687
8,-0.23365533374732247
9,-0.760357104954596
10,0.24119682611593296
11,-0.17887835415961412
12,-0.5341186349193429
13,0.7522141157901581
14,-0.2526072191846206
15,0.5432043148089921
16,0.19977439573121847
17,-0.16888890257355765
18,-0.4555801952714266
19,0.5208375501415745
20,-0.5861458531348525
21,0.6102501969569234
22,-0.2242369780433322
23,0.8194728162745514
24,-0.1774924218648758
25,-0.20151859482257933
26,0.7348983597380063
27,0.07189904922767332
28,0.8913204487282207
29,0.1249234713045192
30,-0.0011906632652544363
31,-0.2976998405437759
32,0.5346934755151377
33,0.41442233257875677
34,-0.033002716194479975
35,-0.34246112018307334
36,0.6042739260472464
37,0.4482591429048588
38,0.315340358804414
39,-0.21666035828257435
40,0.09443017555577109
41,-0.7898211954189517
42,0.6244365061723907
43,0.2310079498722036
44,-0.1163209393817067
45,-0.5645050874102843
46,0.015432975678129226
47,-0.6922048962651526
48,0.7522141157901573
49,-0.3340723185669172
50,0.5082255804218595
51,-0.09847663254075484
52,0.030681782998119904
53,0.5905700533067769
54,0.009915133321102776
55,0.4254512884115389
56,0.1712922089050087
57,0.5899504846506082
58,0.8316781286277237
59,-0.5819788300833163
60,-0.9454264441816321
61,-0.13227542704466816
62,-0.0811437843633389
63,0.26394608914717327
64,0.4971151399558744
65,-0.3409540378422359
66,-0.06005489508151453
67,-0.23365534206607108
68,-0.13527648433965017
69,0.4551029254700071
70,0.5451845082084158
71,0.04020499982340685
72,0.5725481155683935
73,-0.14726604836496138
74,-0.006766789749242493
75,-0.22825478230009782
76,-0.3065611416772755
77,-0.09981790336225314
78,-0.5885980419112328
79,0.049216298496346456
80,-0.21026138674921468
81,0.08748203855880518
82,-0.6795418801339584
83,-0.2829702480528062
84,0.8139141490621268
85,0.17498070181586445
86,0.08760898309766701
87,0.22749075766135796
88,0.44393127713406616
89,-0.6778000535629151
90,-0.8701482556043743
91,-0.7299672717644888
92,-0.4416745538516999
93,0.179319491430141
94,-0.5210539398438913
95,-0.5962880941537558
96,0.016455447895378453
97,-0.23303929834826986
98,0.5240783124223852
99,-0.4938527966655767
100,0.6104399711983476
101,0.3832974691338665
102,-0.08546500815976989
103,0.17577732707780058
104,-0.05402391276138006
105,0.1627557918864802
106,-0.5097548495119967
107,0.49667162662346404
108,0.8136800880342767
109,0.8101629040479251
110,-0.4102874468695681
111,-0.05074396672438872
112,-0.17720017309427083
113,-0.09304205495978436
114,0.6973200255166304
115,0.5775546088855338
116,0.37071798103355885
117,0.5882772690260902
118,0.16218100663696164
119,-0.7333613259051736
120,0.837224532775638
121,0.1986378491950855
122,0.1606243858248482
123,0.43738451136858364
124,0.700218351131729
125,-0.09529474588292894
126,-0.11738764442805921
127,-0.06618855204496144
128,0.8656424252585342
129,-0.26595204090997665
130,-0.7165518357887981
131,0.8865379997492636
132,0.4095203731533569
133,0.30324627449910013
134,-0.5268979876836155
135,-0.04376938348862767
136,-0.8443945128187568
137,0.8314838901279331
138,-0.6760246960223856
139,0.8850676817311605
140,-0.0025085214683211706
141,-0.046013073129640265
142,-0.5617624299013154
143,-0.06829379179932599
144,0.20187858574528814
145,-0.6190783109123139
146,-0.16289603614239778
147,-0.5350905819659694
148,-0.05402392112492823
149,0.052510262577249604
150,0.4347633418342678
151,-0.1539082023816316
152,-0.3018095757380328
153,-0.5095822497739401
154,-0.8580543179951204
155,-0.04601307476782811
156,0.4738905066763144
157,0.019789274625399728
158,-0.20073232708522226
159,0.6496484835257825
160,0.5386561742987046
161,0.385940521953242
162,0.480005885800988
163,0.1177084016483553
164,-0.10089596047196646
165,0.2819651076729151
166,-0.6729829731491386
167,0.049461787142566306
168,0.13195464946159155
169,0.6437361571740569
170,-0.6905526902549703
171,0.7063843496199245
172,-0.22621924556280545
173,-0.6801614698159826
174,0.41028744686956825
175,-0.13039800600573437
176,-0.11713365941440504
177,-0.08705678419167776
178,-0.8063726652807612
179,0.5382159906270267
180,-0.013770931433453914
181,-0.0674981475166936
182,-0.3004730933723512
183,0.4969255939542946
184,0.2857700928705809
185,-0.3876189829767705
186,-0.5815000711937808
187,0.1923134187589286
188,-0.35806134335638934
189,-0.3125871912323081
190,-0.8310585093578152
191,0.9158688183615127
192,0.03869262935522
193,0.09304490674808039
194,-0.2435571964617929
195,-0.29567613989301367
196,-0.1477137626743721
197,0.8607207737182678
198,-0.6680530414550926
199,-0.5958400679140009
200,0.7898212235386773
201,-0.06234167782275641
202,-0.8441930501089282
203,-0.18482473305408287
204,-0.011738923696237566
205,-0.7765896965797962
206,-0.10430470870753965
207,-0.07591867899889461
208,-0.35920786045938424
209,0.8275413548341268
210,-0.5454880531519966
211,0.6913738393856662
212,0.8122521342852327
213,-0.25048879205605734
214,0.8309616841288188
215,0.47232467028380964
216,-0.7444572547319195
217,-0.2071572583216867
218,-0.5341017700202043
219,0.06869795990181429
220,-0.7820257544661178
221,0.6201760004074179
222,-0.05393997904599591
223,-0.45883384012698303
224,0.03926135441044824
225,0.2803214086213351
226,-0.5608210408892984
227,-0.6378567938272572
228,0.3018095757380327
229,-0.2238768030278974
230,0.3800610816577727
231,-0.3730298988027655
232,0.31292510808509794
233,0.6794893336366427
234,0.5688442888645785
235,-0.5420355689255727
236,0.1536180335807263
237,-0.064847892199228
238,-0.10847412643805013
239,-0.018783929585388777
240,0.5064866339084263
241,-0.03278167756509488
242,0.5934676687621815
243,-0.24637806964117465
244,0.8009366430321283
245,0.7292084739165771
246,0.20183936770772165
247,-0.2727333016280774
248,-0.2026822968009654
249,0.12517745632721655
250,0.22848286484607466
251,-0.762233070384045
252,0.15332453562707993
253,-0.7848272004378961
254,-0.1570658743087633
255,-0.46361625737257334
256,0.5656034575647806
257,-0.5445372422690384
258,0.49209996967572045
259,0.10146132199657389
260,0.19684371461529956
261,0.34245972068283564
262,-0.18497864112271792
263,-0.16812485769035324
264,-0.033035662578749826
265,0.9694867995067856
266,-0.8448126397688944
267,-0.30461198905464076
268,0.24327833269546864
269,-0.3099724402499743
270,0.7297832318244167
271,-0.16250180107828874
272,0.6401498486435016
273,0.8065622222994764
274,0.26124442861671376
275,-0.8525078840397966
276,-0.3268291974832793
277,0.4475006128292042
278,-0.49385271340821585
279,-0.548425232420641
280,-0.48176175241232355
281,-0.28212283720579795
282,-0.21263650981654106
283,0.27335290102013093
284,-0.4055564900446045
285,0.529904852140549
286,0.0056931240653682914
287,-0.9285254560386815
288,0.5088588013392937
289,-0.8865378940656884
290,-0.2559744790778738
291,-0.497115139955874
292,-0.20714539261455817
293,-0.8311631172542115
294,0.16062438582484917
295,-0.042598379465659086
296,0.18824000952977854
297,-0.672982973149139
298,-0.2183427108171597
299,0.023476767584837206
300,0.45565894714415767
301,-0.5914158467162185
302,-0.18801551959375443
303,0.6902817518673255
304,-0.4285973336756451
305,-0.5896740232826957
306,0.8500826634278282
307,0.533825329656089
308,-0.7986884098331581
309,-0.4852352929746336
310,-0.12226047606193267
311,-0.3303048403113251
312,0.8909471535373832
313,-0.11738764442805995
314,0.5479486828107498
315,-0.434763357312994
316,-0.10026562122544586
317,-0.5512736717478636
318,0.14528148226357854
319,-0.6010990330644223
320,-0.3559840780324006
321,-0.2084959041003014
322,-0.6819142792857772
323,-0.3217734725055005
324,0.5885980419112324
325,-0.19040305133455235
326,-0.1303650596202915
327,0.5955525993065652
328,0.06358281645916361
329,-0.2764104805232884
330,-0.30594143576311333
331,0.07711321981967006
332,0.2883724483170412
333,-0.5567095985173894
334,0.9756528576604316
335,0.9121502041402938
336,0.16250180686378246
337,0.7504253811483895
338,0.10026561765572468
339,0.7473456930880278
340,-0.47152757655258276
341,0.3605734807639738
342,0.25532307931225834
343,-0.3356037396727152
344,0.5119031659201766
345,0.09527184600131369
346,0.01568695827229711
347,-0.6499359540591741
348,0.6468952389357585
349,-0.23037053175601213
350,-0.7813100163263238
351,-0.23365522389203836
352,0.1415135494937614
353,0.27889933497545427
354,-0.13668824105029487
355,-0.21666035828257463
356,-0.24926892788036636
357,0.10058637853861317
358,0.29535537753472496
359,-0.3633545597979793
360,0.48633309932475327
361,0.31610436408972814
362,-0.6504125231944553
363,-0.13004428210522856
364,-0.8913203107411709
365,-0.8563015085253259
366,-0.21684988659228777
367,0.4668887435142838
368,-0.015921983386148076
369,-0.7595842038150596
370,0.6372820359398816
371,-0.47924188635100184
372,-0.8136800880342767
373,0.16148639045126686
374,-0.4492606725439321
375,0.523458641702699
376,-0.1849713187630255
377,-0.4747926522295401
378,0.5471141795436767
379,-0.5958400467005177
380,0.6499359309197343
381,-0.6510384039114928
382,-0.40008932016353904
383,0.3024822579596335
384,-0.37481714458267557
385,-0.3498493772975662
386,-0.20187858574528855
387,-0.9041785173818512
388,-0.372709125917624
389,-0.11770841730178096
390,0.6742828695765638
391,-0.6340228941825263
392,0.35806134335638995
393,-0.4636340188372269
394,0.4107482116128636
395,0.1254982247442893
396,0.5819788093633299
397,-0.8744295718194657
398,-0.19113754861421636
399,-0.8465654491762843
400,-0.1625017817065626
401,0.4985795482944513
402,-0.7045083842572647
403,0.2706946418882039
404,0.5740374043367104
405,0.37879150573837145
406,0.3463710547084555
407,0.6923999563274671
408,-0.8200476033577916
409,-0.19831380816903887
410,-0.07579173757914481
411,0.46674166592235794
412,0.21710386388551242
413,0.5504545017897827
414,-0.7560670467466966
415,0.8063726939897631
416,-0.49286398618798577
417,0.07021751757321068
418,0.8441405578587404
419,-0.0459133405199405
420,-0.17760462384644818
421,0.5653271047530065
422,-0.18550330137193974
423,0.3491927892705121
424,0.1723146872207152
425,0.08573106199352959
426,-0.8912679264225245
427,-0.2254862771989687
428,-0.5716871908368485
429,0.5962881153831904
430,-0.023509759935298167
431,-0.2546715877045535
432,-0.7603570778838705
433,-0.2174648346568383
434,-0.8200476033577919
435,-0.6077911316725707
436,0.5837206117408827
437,0.10201780090994653
438,0.04242073996004697
439,0.1677867653064577
440,-0.8744295718194658
441,-0.46368744388975647
442,-0.1418343173292267
443,-0.5663825084492182
444,-0.17206070219801775
445,0.25867257276844174
446,0.023797540458558423
447,-0.4567392861024526
448,0.11929801603174721
449,0.026761045707257087
450,0.3517957266889495
451,-0.575366625391038
452,-0.8857740147728972
453,-0.14400112047020613
454,-0.3631415544783512
455,-0.048144472712905305
456,0.7054972022699566
457,0.9756526931776488
458,-0.9215569715152585
459,-0.5590305527090692
460,-0.8691596093701066
461,-0.3035894941943506
462,0.7214301968487242
463,0.2618773594219824
464,-0.26224009915680396
465,-0.553971666178497
466,-0.20509907859553467
467,-0.9285254560386815
468,-0.4885828030842098
469,0.4677558330940734
470,-0.5975818490780718
471,0.690298729817777
472,-0.8071369802073154
473,0.34827854257737656
474,-0.9101209542965418
475,0.5062376654004239
476,-0.2328672057805687
477,-0.06940502378059782
478,-0.3881937408846094
479,-0.11593037266784234
480,-0.10039266124962891
481,-0.5399913530739116
482,-0.03574835072904447
483,-0.255997919126513
484,-0.4494929397294737
485,-0.1251774518705678
486,-0.34510218534776943
487,0.9285254560386814
488,-0.28857817970241445
489,-0.008063921093203964
490,0.310871838386151
491,-0.3257738247059512
492,0.5957888212264993
493,0.03842604820813589
494,0.19932642591405272
495,-0.07779610274073487
496,-0.15818317469913482
497,0.44742866697740036
498,-0.3694628226286096
499,0.23657786290057506
