,0
0,-0.5104951987566416
1,0.5513157508338863
2,-0.19111022577645229
3,-0.3422805555854213
4,-0.6170984683381349
5,-0.6414004376298367
6,0.8959718942611653
7,0.47560773715349364
8,0.6332698569180539
9,-0.19257637222962237
10,-0.6118758860029927
11,0.5385773485746563
12,0.6553031968668674
13,0.16146142662052002
14,0.2908708310852441
15,0.5649636340867285
16,-0.9393936866190824
17,-0.27849640499514106
18,-0.8959141530996189
19,0.4032645932293052
20,0.49963493468626247
21,0.8963922770138397
22,0.005715836613049599
23,-0.289760417864496
24,-0.2924107005089508
25,0.3053560683667128
26,0.6631009813142695
27,0.8738626614551908
28,0.8010714494724352
29,0.16870918612001848
30,0.2608219514131087
31,0.6663241262013806
32,0.5670171610790976
33,0.8856335472806348
34,-0.3651032363278841
35,-0.16793024657268607
36,-0.5922179958183985
37,0.5522695742979871
38,-0.6909855845280665
39,-0.8913461661004908
40,0.4643410288535507
41,0.6893966976494663
42,0.19817402463925804
43,0.13759561926117594
44,-0.5603432091319265
45,-0.6450407427434989
46,0.45797054664449427
47,-0.25577771941077687
48,0.7190355365469873
49,0.4793202024273318
