,0
0,0.996993606959865
1,-0.9969252620626834
2,-0.7017232793071034
3,0.9251848016332715
4,-0.9969117722564641
5,-0.994011384698495
6,0.7017777374433187
7,0.9999452265723787
8,-0.999986098173552
9,0.9999996596672023
10,0.6299009367538947
11,-0.9999997613593083
12,-0.9999997606975863
13,0.9999997613602977
14,0.9221923103120584
15,-0.7017234085900527
16,-0.9999996249484155
17,0.701695842416425
18,0.9251711391097386
19,-0.922192173679035
20,0.7047159323037119
21,0.7017778499750429
22,0.7016958673996663
23,0.9220966068745716
24,-0.7017754923710511
25,-0.626908286479081
26,0.9221102702804806
27,0.9969115986557846
28,0.9220966397026632
29,-0.9251301980864556
30,0.9251301980864578
31,0.6986908993962488
32,0.7047159323037125
33,-0.9251710007806144
34,0.9969390704189833
35,-0.9251301980864568
36,0.9251846312489743
37,0.9969528355081444
38,-0.9251848025171222
39,0.9969252975558596
40,0.9969254003918033
41,0.6269084463155462
42,0.9999996603312513
43,-0.9221102700593405
44,0.9999859600675471
45,-0.9940113838608997
46,-0.9968858755051564
47,-0.9999996590760889
48,0.9969390701498103
49,0.9220966066534316
50,-0.9969527352521432
51,-0.6269084463155467
52,-0.999985995447568
53,-0.9969117367627783
54,-0.9999996590760902
55,-0.9999996240645705
56,0.9969252622838203
57,0.9999859954475666
58,-0.7017777133410372
59,0.999945052647328
60,-0.7047702296473988
61,0.9969117724776047
62,0.9969117367627802
63,0.925171000780614
64,0.7016414508326554
65,0.6299553707315859
66,-0.9999997969629373
67,0.7017778499740579
68,0.7047157705809375
69,-0.999945190088813
70,0.9969115988769232
71,-0.7017234085900534
72,-0.9969526988751255
73,-0.9220967449815636
74,0.9969390349268568
75,-0.9968594535525437
76,-0.7017778499740552
77,-0.6269628579717005
78,-0.9221102700603302
79,0.6299008001198885
80,-0.9251710007806152
81,0.6299553716144529
82,-0.9999997606985713
83,-0.9251848025161337
84,-0.701775622528966
85,-0.7017232784833447
86,-0.999985960067546
87,-0.9999861335545657
88,0.6986908993976217
89,0.6986909002802467
90,0.9969934701092821
91,-0.9999452256904919
92,0.6986368965041532
93,-0.9999996588549493
94,0.9999860979524127
95,0.6269627213386829
96,0.997007168346973
97,-0.9939592749346395
98,-0.925184632061226
99,0.6986362353434167
100,0.9251709680642058
101,-0.9969117369849066
102,-0.9999453623225365
103,-0.7017233407314015
104,-0.9969115978202201
105,0.9251847695771116
106,-0.9939594048881312
107,0.9999860981745397
108,-0.9969254358849878
109,0.9969528710013182
110,0.999986097953401
111,-0.7046767306871028
112,0.6986908754040178
113,-0.7017756209300601
114,0.9999996238434254
115,-0.7017232784824212
116,0.9220967447604261
117,0.9221103031110361
118,-0.9999860979524133
119,-0.9969116336096576
120,-0.6269083096815369
121,0.9999451894977023
122,-0.9969528710023022
123,-0.9969116341484778
124,-0.9251709680632182
125,0.9251711059490718
126,0.9999996594450747
127,0.9969115988769226
128,-0.7017754915342462
129,-0.9968594527169665
130,0.7016959791174521
131,0.9999997962992352
132,0.9969389344029895
133,-0.6299553483025265
134,-0.7017777383261813
135,-0.9221103028898952
136,-0.6299009367538932
137,-0.996911504195284
138,-0.9969117724766147
139,-0.9968594527178924
140,0.9969117367627784
141,0.9999997613602962
142,-0.7017232793192281
143,0.9999859598454185
144,-0.9969254356638487
145,-0.9251710007816012
146,0.996911634148479
147,-0.9939593686649705
148,-0.9970072703657816
149,-0.9999453623225335
150,0.9220967778106514
151,0.6269083087986717
152,0.9999997971840766
153,0.6986362335757573
154,0.6299553483025224
155,0.9220967775885236
156,-0.629900936752911
157,0.9220967449805763
158,0.9969252622838204
159,0.6299007776937517
160,-0.9939594048881334
161,0.9999451886138475
162,-0.9251709680632174
163,0.9969252977779881
164,-0.9221377397013459
165,0.6986362087034442
166,0.9969254003918028
167,-0.6269083096815364
168,-0.922192141730401
169,-0.7017234094440196
170,-0.9220967778106508
171,-0.6269627436602119
172,-0.7046245677559715
173,0.7016414499490224
174,0.9999996588549507
175,-0.9969252620636688
176,0.7017234409815134
177,-0.9220966066524448
178,-0.9251302319054253
179,-0.9251710010017535
180,-0.996952735252145
181,0.701777737443318
182,-0.9251711061711984
183,0.7017778749601918
184,-0.9969252975568493
185,0.9999997971840765
186,0.6269627427763648
187,-0.999945225690495
188,0.6986362335349938
189,0.9969116343696152
190,0.9969117724776043
191,-0.9251709680642056
192,0.6299007785766184
193,0.698690874521581
194,-0.7017778490911902
195,0.9221377068717834
196,-0.7046244384854425
197,-0.9220966394825124
198,-0.9220966397036511
199,0.9251847686942458
200,0.6299008010027495
201,0.9999996238434254
202,0.6299007785766138
203,0.7047159072139573
204,0.7016959791006774
205,-0.9940115479888426
206,-0.9999997971840767
207,-0.9251711059500604
208,-0.925184665001232
209,-0.9968594890443031
210,0.996993606958881
211,0.9969252622848093
212,-0.999945326721831
213,-0.9969254358849877
214,0.9251711059500606
215,0.9251846650002521
216,0.7016958424173102
217,-0.7017232784824189
218,-0.9251846312499642
219,0.9251848022959848
220,0.9220966066534337
221,0.9999997606965997
222,0.9999452242155284
223,0.7016414499490653
224,-0.9999997969629368
225,0.9969389326803363
226,0.922192174561901
227,0.9969935047151977
228,-0.70467675661227
229,-0.6269083087996573
230,-0.9969116343696154
231,0.9251848025171222
232,0.9969936415609061
233,0.6269082873619414
234,0.996911772477603
235,-0.9999452256904945
236,-0.9251846312499633
237,0.9970073058618784
238,-0.9251846650012323
239,0.9221921736800206
240,0.9969117722554761
241,0.9969115988779107
242,0.7017778490911911
243,-0.9940114192523519
244,0.9221377397023289
245,-0.9969116341484673
246,-0.9251709678420774
247,0.9221102700603279
248,0.7047703411887292
249,-0.9220966394815239
250,-0.99401141925235
251,-0.7047157696970944
252,0.6986363702754718
253,0.9220966066524434
254,-0.9999859600665575
255,-0.7017778749601912
256,0.6299552125533522
257,-0.9968594527178903
258,-0.999999761580454
259,0.629955212552373
260,-0.9251303356013595
261,-0.9940115500414255
262,-0.9220966066524443
263,-0.7017777133410372
264,-0.9221104412180336
265,-0.701775597492688
266,-0.6269628794093871
267,0.6269627436602151
268,0.9969936069598676
269,-0.7017232784834042
270,0.7016959800000767
271,-0.9221104412180338
272,-0.922096606652444
273,-0.9940114192522911
274,0.6986363462836959
275,0.9969936415716291
276,-0.7046523387410467
277,0.9999997971840762
278,0.7016958119433736
279,0.9999453623225327
280,0.7016414749303211
281,-0.9251709678430677
282,-0.9969528363910093
283,-0.9968594535525472
284,0.6986362095956584
285,-0.9251302319064076
286,0.999999761359309
287,0.6986909051510011
288,-0.704676626504936
289,-0.9999997606985691
290,-0.9251848025171238
291,0.9251709680642063
292,0.9221378772182189
293,0.9999996232533047
294,-0.9969117369849063
295,0.6269627213386821
296,0.9251303685384458
297,0.704715931420847
298,-0.9939593692286075
299,-0.9969252620636699
300,-0.9221378435038181
301,0.9969934692221674
302,0.7016414759156859
303,-0.7017232793192277
304,0.6986907626228811
305,0.6299553483035081
306,0.9251303356023423
307,0.9220967775895109
308,0.9220966397036523
309,-0.9251846641889864
310,0.7016414508316696
311,0.9221104081663366
312,-0.9999859954485558
313,-0.9221102700603305
314,-0.925170968064206
315,-0.7047159063310924
316,0.9251846312499646
317,0.701695867398681
318,-0.9969121772836861
319,0.704715795669706
320,0.7047702036738266
321,-0.9999859956696958
322,-0.9251710010017518
323,0.6986362087034375
324,0.99999976158045
325,0.9999997615814374
326,0.9969390340404802
327,0.629900801003736
328,0.9999452256895095
329,0.9999997615814363
330,-0.99692529755685
331,-0.704770340305864
332,0.9999996247262938
333,0.69869087452164
334,-0.6299553707315836
335,-0.7017233044921196
336,-0.9939592387123763
337,0.9969936424543974
338,-0.9969254358849862
339,0.7016414499490423
340,0.9969527343692834
341,0.6269083087986708
342,-0.9999451900888173
343,-0.9969116343696175
344,-0.9221104081673231
345,-0.9221378772182185
346,-0.7017234335732626
347,0.9251709678430682
348,0.9251847686952313
349,0.9251303676555811
350,-0.704770366281406
351,0.6299007785776007
352,-0.9251847693559695
353,0.9999453632053986
354,-0.9969115988769233
355,-0.9251709678420762
356,-0.9221104083874734
357,-0.9999996232523158
358,-0.9220967447604261
359,-0.9999996605510493
360,-0.9999997613602987
361,0.9221104081663343
362,0.7017234151154393
363,-0.7046767557745302
364,-0.6269084454326808
365,0.9969936069792503
366,-0.9970073058618776
367,0.9969252977779872
368,0.9221378435038228
369,-0.7017234335741923
370,0.6986909002792683
371,-0.9939593686658973
372,-0.9220966397026634
373,-0.6299552340985626
374,0.925171139109739
375,-0.9251303676565632
376,-0.9251711059500599
377,0.9999860979524128
378,-0.9999861337757059
379,0.9999450873603872
380,-0.9999452256904929
381,0.925184769577107
382,0.9999861335545649
383,-0.7046766012834441
384,0.9999996234734536
385,0.6299008010037321
386,-0.9940113846975662
387,-0.6269628579707143
388,-0.9999859598454182
389,0.7017777374443026
390,-0.922096744759436
391,0.9969528363910085
392,-0.9969115986567738
393,-0.9970073058618779
394,-0.9999453632053988
395,-0.9969527352521484
396,0.7017777383271638
397,0.7016415684955815
398,0.996993469222114
399,-0.6299553491863742
400,-0.9251709678430671
401,-0.922137876334367
402,-0.9969116341475461
403,-0.9999997971830898
404,0.9221104081673213
405,-0.9969116341484732
406,-0.9221102700593407
407,0.9970071337327632
408,-0.6269083087996539
409,-0.7017755966600578
410,-0.9970073049799952
411,-0.9940113846966904
412,0.9999997971840768
413,-0.996911772476615
414,0.9251711061711988
415,-0.925184769356957
416,0.9221103031100476
417,0.9969936415716275
418,0.6299553483035076
419,-0.9221377405842074
420,-0.9999861335555537
421,-0.9968593227647022
422,-0.9251848025161407
423,-0.9939594048882223
424,0.704770341188732
425,0.9251848025161347
426,-0.9999451909726609
427,-0.7046767306871138
428,-0.999999623253305
429,-0.9251846314701131
430,0.7017777383261854
431,0.9251847695780963
432,0.922192311194924
433,-0.7017754668997532
434,-0.7047703403068447
435,-0.629900936753894
436,0.6986362335767727
437,-0.996925297777987
438,0.7047157696970907
439,0.704770341189715
440,-0.7046766014156572
441,0.922110408167322
442,0.6986907387043052
443,0.9999452256895084
444,0.9251846644101245
445,0.6986907378034726
446,0.6986908745213963
447,0.6269083087996571
448,0.9999859600675467
449,0.9220966066524434
450,-0.9969252622848098
451,-0.925184632945078
452,-0.7046767315238844
453,0.9999996596681833
454,-0.996925297777985
455,0.9251301989683398
456,0.9969934701073089
457,0.9999451886148331
458,0.9969528363900226
459,0.7016414508326525
460,0.9999861335555549
461,-0.7046766005785796
462,-0.9999996588549486
463,0.9999451885903062
464,0.9999997971830925
465,-0.9251711059490728
466,0.9251711059500611
467,0.7016960040996854
468,-0.9969114678660955
469,-0.9999997613602977
470,-0.9251301989683381
471,0.6269627436602152
472,-0.9251846314701145
473,0.9969115986567741
474,0.698690763314932
475,-0.7017777383261858
476,0.9999997962992393
477,-0.9221103031100469
478,0.7017232793652844
479,-0.7017778499740555
480,-0.6299007776937525
481,0.6269627436592314
482,0.7017778740763397
483,0.9999997971840764
484,-0.9969114687171405
485,0.9969528710023039
486,-0.9969117722554776
487,0.7016959791174541
488,0.9999452250983983
489,-0.6269627204558179
490,-0.996925400390813
491,-0.9970071692298363
492,-0.9999861337766918
493,0.6986908754049991
494,-0.9970073058618781
495,0.6986907387043081
496,0.9969528718851701
497,-0.7046767306871066
498,0.9999997971840733
499,-0.9940113846978311
