,0
0,-0.08283793678092226
1,-0.8508815622279731
2,0.5183980353465354
3,0.3639823842471203
4,0.03850103658663334
5,-0.08287626873199214
6,0.36095500059728264
7,0.04906328952782413
8,-0.07796365338200828
9,0.3643989775493805
10,0.36099640543206024
11,0.11066500433121136
12,-0.8544765779709709
13,-0.47586780998005046
14,-0.5424939944561038
15,0.04578431686945511
16,0.421208604823476
17,0.04410320067157038
18,-0.5430382192526382
19,0.9246044520827749
20,0.4102918661214945
21,-0.5450228604420638
22,0.9300240047092471
23,-0.14084683308490784
24,-0.14678852232493567
25,-0.5004171946886966
26,0.9939194690789304
27,0.5901359963927139
28,-0.5017498894371148
29,0.9996614021220073
30,0.10112083292021547
31,0.9242977149195896
32,0.5852250814519849
33,-0.8058647663384751
34,-0.14678353461842836
35,-0.14192193131995323
36,-0.5337817714980995
37,-0.1469790909738388
38,-0.8076461937012387
39,0.4101487515922047
40,-0.49971627182540296
41,-0.07421073594568209
42,0.41418809773745047
43,-0.8019639177698478
44,0.5902070992622194
45,0.4102089335954131
46,0.04472318545193478
47,-0.5004431480454672
48,0.0492608154795059
49,-0.8539432820536758
50,-0.14670720256517203
51,0.3655061243504183
52,-0.8539641357473056
53,0.518086938407235
54,0.04906152505386507
55,0.048785364354826506
56,0.9942528602112738
57,-0.5607363455064256
58,-0.5488142487486858
59,0.9999997970774375
60,-0.5000871272273516
61,0.5901643723409218
62,-0.5476318400898542
63,-0.5002005736046081
64,-0.8010703162395398
65,-0.14190316811252393
66,-0.8179864086752409
67,-0.4963793605149306
68,0.41148971662295475
69,0.09856613760692037
70,-0.48112315242998366
71,-0.8543034492824689
72,0.9942517853153617
73,-0.5800274184365827
74,0.9243003675244627
75,-0.8508075518074216
76,-0.8507615710472991
77,0.3572718229214364
78,0.36077281724545834
79,-0.08393041012847739
80,-0.14685664623182665
81,0.09823164757546231
82,0.09582938515141529
83,-0.8507622801277138
84,0.9999997908638938
85,0.36465671111420667
86,-0.5487951424133631
87,-0.147098344316243
88,-0.8510083762970739
89,-0.5003675905528215
90,-0.8044068816722304
91,0.9246192962727839
92,-0.8068239386457232
93,0.9996725298749979
94,0.100239008510606
95,0.41025825440413527
96,-0.0013614152062154422
97,-0.14689161416052313
98,-0.8544849728469583
99,0.3648268056456936
100,0.4094985327528098
101,0.41268696786801207
102,-0.14217432876924688
103,0.3626395465713653
104,-0.14133464750447333
105,-0.5482276218265535
106,-0.543652029752135
107,0.3527883051626953
108,-0.5476477229591481
109,-0.5003452710667498
110,0.5235311377397158
111,-0.8080643150576369
112,0.045117254219664005
113,-0.4754412938491496
114,0.5234426052113047
115,-0.14705381618325547
116,-0.14754302305055522
117,-0.4954202184572207
118,0.9942407487322669
119,0.930021705223182
120,0.9246148043463642
121,-0.14255004755380501
122,0.5856890847939268
123,0.5183295441827213
124,0.9242958149149522
125,0.5901676118662812
126,0.3636021857839237
127,0.5181482608903333
128,0.04619267540412471
129,0.0448864229284043
130,0.9999994366469811
131,-0.08139404571570139
132,-0.5481962991781059
133,-0.14192999918574442
134,-0.5624183836214574
135,-0.4758809774123662
136,-0.8043756598691417
137,-0.47607906238526687
138,-0.8074023524297234
139,-0.07763039070462541
140,0.9942404735516239
141,-0.47320932414097594
142,0.9245085677191954
143,-0.542692802787578
144,-0.1471822919724877
145,-0.527704673361092
146,-0.14103200739171848
147,-0.5004390024109989
148,0.09962965640757171
149,0.9243953065257594
150,0.9999879845700872
151,0.36469708424923636
152,-0.547279701534583
153,0.5183237447598918
154,-0.5428000443290365
155,-0.5124724944697925
156,-0.4761730095692922
157,-0.5445183553914877
158,-0.4963177208595359
159,-0.47616427611071
160,0.9942413650775905
161,0.027622552552484497
162,-0.5423491867878657
163,-0.8047154250145563
164,-0.14166517422150074
165,-0.08259450441754936
166,0.9300237745721052
167,-0.14195223953212838
168,0.5846683610814635
169,-0.8042248096950969
170,-0.1494961425678198
171,0.20276433955274326
172,-0.5002424387267475
173,-0.8545236090612288
174,0.09620614109968487
175,-0.850856995168242
176,-0.5001490103592969
177,-0.08099698049980167
178,0.5902762642779111
179,-0.47573325081201256
180,0.41419491827004906
181,0.044660974784809314
182,-0.8079906217759638
183,-0.8541935206165525
184,-0.8508705488390707
185,0.5233387601986951
186,-0.5426452219331016
187,0.9996725323644164
188,-0.4813587435868403
189,0.9939297325121911
190,0.924272302004014
191,-0.4964500328942292
192,-0.5449014593378112
193,0.4142147462647895
194,0.9246276428545518
195,-0.08269152631935425
196,-0.5482255903375697
197,0.9999997551556602
198,0.048769786832012704
199,0.9303128282676149
200,0.36450022090310946
201,0.09569744088791271
202,0.09548190682517824
203,0.373138924477481
204,0.9999994365023299
205,0.5862230468609602
206,0.58487359552122
207,0.5235418222392234
208,-0.5420332222347296
209,0.9939194393648136
210,-0.8042343155684251
211,0.5183466143206459
212,0.590545848395764
213,0.41419817004471454
214,-0.14672911421387108
215,0.0961054739982282
216,-0.47617031871335097
217,-0.5276934259050442
218,0.41419003884892597
219,0.360526933336479
220,-0.0777193390220621
221,0.5183746773750774
222,0.5904295673122063
223,0.4140131964509845
224,-0.481416897444485
225,0.5852528500684566
226,0.5904470081822861
227,0.10000430463251973
228,-0.14243577118628414
229,0.4101470497886627
230,-0.14710308525801424
231,0.5899437675978652
232,-0.48218083146072055
233,-0.8509713992228213
234,0.4102906204430328
235,-0.4809979028521325
236,0.924306774567283
237,0.4127990040346937
238,-0.5008563033039777
239,0.09596461391894248
240,0.5851622067164062
241,0.4104389674741493
242,-0.5085931378668542
243,-0.147154284208972
244,0.9939348515018378
245,-0.14192175992698258
246,0.09510918787472135
247,-0.4959216714838622
248,0.5233037777527275
249,-0.07768711244517085
250,0.5235365078254901
251,-0.4963100366512368
252,-0.5482147233310956
253,-0.8519816633211548
254,0.3582467854918447
255,0.4142067991710323
256,0.5183588781348386
257,0.5923682372362078
258,-0.5428215305140812
259,0.5851395195014473
260,0.5904477200865414
261,0.414214867340986
262,0.5904276506796191
263,-0.5448771601838149
264,0.584947951300432
265,0.09591634319860619
266,0.09995392141438462
267,0.35934584033083494
268,0.9240888286821434
269,-0.49647021450506995
270,0.09357537579563537
271,-0.47610757258860986
272,0.049017589010722236
273,-0.8042148751750783
274,-0.14688038690831004
275,-0.0829956774237924
276,0.41016684931621233
277,-0.48144473138215205
278,-0.5485961180052107
279,0.0444117672823739
280,-0.5002074085797584
281,-0.4761689071232987
282,0.523236711858095
283,0.36452090299411655
284,0.41047173234408324
285,-0.4761623717451533
286,0.3608059648865494
287,-0.5000760406816144
288,-0.5001718230147015
289,-0.8507811854137827
290,-0.49754631165065816
291,0.5237931264196118
292,-0.7994895587686318
293,0.04499302685627263
294,0.09481821560523022
295,0.9996612405366548
296,0.585246090209885
297,-0.08285358718525677
298,-0.4963382365943059
299,-0.5482145340485258
300,-0.5486937690190693
301,0.5239002826006764
302,-0.4815836838904513
303,-0.5002138808033585
304,-0.14711803450764155
305,-0.5029938390432565
306,-0.08134792085206526
307,-0.5482256342919056
308,0.5850038904712941
309,0.0828907624485103
310,-0.8509772132349993
311,0.9303421169327816
312,0.5901672996805283
313,0.4142565449491836
314,0.5852673043506388
315,-0.07767366452850416
316,0.36416830718961885
317,0.5852713821706063
318,-0.5482033697958503
319,-0.07796890015123684
320,-0.1473456600793204
321,0.9996622652069378
322,-0.4815268003126386
323,0.9245960323154542
324,0.04577179431659774
325,-0.1457439206120046
326,-0.141556660739646
327,0.9939335623094475
328,0.5850852059476184
329,0.41186511722146396
330,-0.8511112888162594
331,-0.5448199879154263
332,-0.5003035354718416
333,-0.8076896921014078
334,-0.85449713589203
335,0.363057353188233
336,0.413273495262979
337,-0.5482373104127608
338,-0.8042282144735458
339,0.9300082804904614
340,0.044839013920036336
341,-0.5003572351000559
342,0.5902403683320187
343,0.10005866700089049
344,0.4097598811014696
345,-0.14183547251746248
346,-0.854484713276386
347,0.09358283351830989
348,0.9300157172539907
349,-0.8043006318651472
350,-0.49881490140135776
351,-0.5010427519586427
352,0.5835607354539873
353,-0.08278330688006684
354,-0.48128543455673123
355,0.5904432843044254
356,-0.0780558705257259
357,-0.14216314938839303
358,-0.07765939383755445
359,0.523553617589616
360,-0.8499098688609729
361,0.9303195971534048
362,-0.49654956983574844
363,0.36079561038175156
364,0.9303273277934291
365,-0.5423350104436484
366,-0.08285970660977328
367,0.3623119459190836
368,-0.4963796789908071
369,0.9300146099840316
370,-0.5427941324819464
371,-0.49695066322681003
372,0.590160009443262
373,0.04884226201464255
374,-0.48143395158651575
375,-0.07759512050399806
376,0.5232606877152425
377,-0.49776113322895327
378,-0.8519415637294777
379,0.41414387469083014
380,-0.08349354389390015
381,-0.5472402785924763
382,0.41265771753337877
383,-0.15135556965983918
384,-0.5006693953643562
385,0.5849473761893571
386,-0.5500513695651201
387,-0.14229914211593783
388,0.0425938433363665
389,-0.4765082826840209
390,-0.14683662310212622
391,0.5849812251423305
392,-0.5417413691962696
393,0.5232479461113633
394,-0.07360271163022172
395,0.9242969960083885
396,-0.47607743432567334
397,-0.08328017573698794
398,-0.14681745582163538
399,0.3645555016335658
400,0.9999883009286142
401,-0.14167926390782343
402,0.04883794647072084
403,-0.5000884284845095
404,-0.08152194200869595
405,0.930028195234095
406,-0.8030964963779897
407,-0.077682395016727
408,0.584930526137301
409,0.5904431521723302
410,0.41785690410002957
411,-0.5479773506681153
412,-0.08298002993665199
413,0.999672555610099
414,0.523537876797681
415,-0.4748520691515616
416,-0.5482141510328433
417,-0.08282083524302525
418,-0.07770282697164582
419,-0.542538055687557
420,-0.5476959437142138
421,-0.854333591334899
422,0.41326617654730097
423,0.09973691600869039
424,-0.48151796639762445
425,-0.07792103953605097
426,-0.5450782341123968
427,0.4084617924743035
428,0.4107888636292863
429,0.41419957300924
430,-0.47613020804875367
431,0.4142042092867801
432,-0.1472501683702125
433,0.5901044730765803
434,-0.0828701206283568
435,0.924284140374814
436,-0.5482226121417072
437,-0.4968753485251007
438,0.5852259975046176
439,0.5849630164599361
440,0.5849597420633744
441,0.4149675139354479
442,-0.4817395764597799
443,0.5850750541401913
444,-0.851557327753679
445,-0.5428260547429757
446,-0.5488867207842059
447,0.9999997615814215
448,-0.5430868461988999
449,-0.851629769476775
450,-0.07788941421355183
451,-0.5459495355059201
452,-0.5478449778411824
453,-0.8519128439665359
454,0.9300284965030569
455,-0.5482146357768227
456,0.36066507946590415
457,0.049380678440518085
458,0.09812462577904772
459,-0.8110084389485986
460,0.04906304286482622
461,-0.5485765650684739
462,-0.5448634648255771
463,-0.5424862330685634
464,-0.512559551233324
465,0.10020912929340607
466,-0.07761692149058275
467,-0.5505174250321158
468,0.5904795421540596
469,-0.4758655743213231
470,-0.8043902049822707
471,0.9939280002345213
472,0.04492995662367351
473,-0.47587064086626013
474,-0.4966375957196148
475,-0.4982725191223661
476,-0.849401720078866
477,-0.5448595149262534
478,-0.0797623171409866
479,-0.5528966732080713
480,0.9996617601781466
481,-0.14688773186727477
482,-0.07786697590382928
483,-0.5004374025461706
484,0.9999997907569391
485,-0.5475702908664427
486,-0.48123132427047316
487,0.9999882842730713
488,0.518064323039218
489,0.365703031645906
490,0.590452221674476
491,-0.5425984760604637
492,0.5180620638213654
493,-0.8537932777139143
494,-0.14685090716903418
495,-0.4759168516808557
496,-0.14685249620540666
497,-0.14189434878508542
498,0.10027282836459546
499,0.9299980329243233
