,0
0,-0.6243023882349973
1,0.6246442774348985
2,-0.8601963913860488
3,-0.8595469642126073
4,0.5073637266523412
5,0.5028360296917576
6,0.8741337575172627
7,0.9820843263581422
8,0.4007259283908443
9,-0.9954720990759277
10,-0.9999996015764779
11,0.6246441292339121
12,0.8606539516374231
13,0.9999951118268852
14,0.624320227303775
15,-0.6330328689184481
16,-0.6326909757878871
17,0.6421685268670992
18,-0.5028362056069718
19,0.6376633523787468
20,0.999623088925273
21,0.6418098385919289
22,-0.9999951118077216
23,0.5073592193635336
24,0.6505392985312949
25,0.40070808541057074
26,-0.9996277377066298
27,-0.6418098167472579
28,-0.85988443426845
29,-0.9999952352236948
30,0.2924018322001407
31,-0.642186205950081
32,0.34253151703791057
33,0.9954767479859805
34,-0.6505392985121317
35,-0.6933799415057785
36,0.6421818395973715
37,0.8744934857987493
38,-0.9951000407460461
39,0.30168220821009956
40,0.3831529038726953
41,0.5338445763092584
42,-0.6501975536087172
43,0.7581795879255708
44,0.7409971097660749
45,0.5073635866644385
46,0.27520178633575565
47,0.758539320105746
48,-0.8648049721474912
49,-0.7641056815180737
50,0.40038387923630475
51,-0.8648004448225302
52,-0.776738611883865
53,0.9999996025437556
54,0.8741336054047745
55,0.8651771232458684
56,0.40738160777628707
57,0.5024640068033901
58,0.8651726267425942
59,-0.7581795918179023
60,0.9996533421315345
61,0.2748598893128624
62,0.9954720980895608
63,-0.41049874129301595
64,-0.29238399313072777
65,0.38658854962695127
66,-0.9951047615315067
67,-0.8744934546644674
68,-0.9999996450524253
69,-0.9999996411409291
70,0.2927438709060744
71,0.8701189626983218
72,0.4004468029241334
73,-0.8648049403909419
74,0.8691355843533303
75,0.8602819593965336
76,-0.40036605442161755
77,0.6372868268272655
78,0.30260600966194245
79,0.6501975535895537
80,-0.6372866441525189
81,-0.5140237024278139
82,0.3361104868286655
83,-0.3828418082961674
84,-0.5073590603257717
85,0.8689527812651638
86,0.9999817895303014
87,-0.523550080763929
88,0.5024685331418955
89,0.869255941620785
90,0.982133654004397
91,-0.8436007301193506
92,0.5163201931277773
93,-0.6421685458185027
94,-0.9954767489722745
95,0.31473518918715493
96,0.8651770072232905
97,0.9824576769727916
98,0.5024685331610592
99,-0.7833236261940557
100,0.3147126540909152
101,-0.860277433077104
102,-0.43294124701560127
103,0.7585393201057458
104,0.9996398925528748
105,0.8744934857987495
106,0.5028405560301896
107,-0.4096724011242578
108,-0.7642463020436339
109,0.8916578515685519
110,-0.8916758110044338
111,-0.5073637457021268
112,-0.6372868268465023
113,0.5073592012810392
114,0.9996532477304921
115,0.8602774330771038
116,-0.780737287501712
117,0.3070356167398132
118,-0.40968226796005475
119,-0.860262542135277
120,-0.7723067422478682
121,0.9954719312327073
122,0.2924019429376417
123,-0.4176008448968643
124,0.6418266566064287
125,-0.5163380321971905
126,0.6376631943465222
127,0.8606493108648953
128,0.29238399704222373
129,-0.9954720980703969
130,-0.740673033272657
131,-0.2748775801614898
132,-0.7640204502965279
133,0.7406730596234145
134,-0.9999952352428587
135,0.6246443035853847
136,-0.6421862297808876
137,0.38285980337040115
138,0.8874912787815277
139,-0.6246621204151726
140,0.5342043084894339
141,-0.7600299509695655
142,0.9954767834466787
143,-0.5073635856972347
144,0.6421862069365217
145,0.8651770082097312
146,0.8606494549539482
147,-0.9954720626288825
148,0.2923839931307277
149,-0.40992407378711876
150,-0.9999997971649134
151,-0.8606494559403155
152,0.6421863888185755
153,0.5073590422816102
154,-0.5326623511170336
155,-0.9996276152830297
156,0.6372911931610403
157,-0.5378009287151413
158,0.33757815404783303
159,-0.9999997615814379
160,0.8606541106559418
161,-0.8606873703651462
162,0.31405875564622815
163,0.6418141830617867
164,-0.8606496149780041
165,-0.9954765889866252
166,-0.5069915447453812
167,0.9996340543812381
168,-0.8590794019810871
169,-0.6326909944018649
170,0.9951047261222349
171,0.9954766253953578
172,-0.8602775920764651
173,0.5024640237060715
174,-0.4196585871209105
175,-0.38318370140057373
176,-0.8458836066803676
177,-0.9951047251358668
178,0.6372868268272653
179,0.8606541096887382
180,0.7585393201057458
181,0.30818624383354365
182,0.6376633750620138
183,0.32273355341965904
184,0.5073592183770929
185,0.2965045420250831
186,-0.537602956789682
187,-0.5338622783609678
188,-0.9824575559269023
189,-0.9996232113681979
190,-0.7406730293419974
191,0.3140436582073844
192,0.31692057630362924
193,0.8602774024488775
194,0.9999997615622741
195,-0.4100093581748255
196,0.40071335893110355
197,0.9817442336905124
198,0.3828597858280831
199,0.2752196312915847
200,0.8648049403718518
201,0.8606541413166704
202,-0.3831838398707027
203,0.4007576442737666
204,-0.7519564744173713
205,-0.6421817024749435
206,-0.5073589748106621
207,0.5341863983819953
208,-0.5399735322296477
209,-0.5069871784309988
210,-0.2923841491355485
211,0.8651769940628099
212,0.09610505677373073
213,-0.5374426164048905
214,-0.4307346924344115
215,-0.5338444431838872
216,-0.9951002351927669
217,0.7406553424048663
218,-0.5163203452402655
219,-0.7409972394277595
220,-0.5024640068033899
221,-0.4269487330071905
222,0.8871260136416043
223,-0.9996232479437979
224,-0.6418444956950058
225,-0.3831838438013623
226,0.9954765899538293
227,-0.5342042335177422
228,-0.6376586670024853
229,-0.860649454954022
230,0.3085071840404618
231,0.5028360465885202
232,-0.8606494243125505
233,-0.4108321792800608
234,-0.4007080893029029
235,-0.9999952352236953
236,0.9999997961977101
237,0.8920177319433633
238,0.4008596101658529
239,-0.740997109766075
240,0.8874937493580308
241,0.981684948035133
242,-0.8518077028052116
243,-0.8602819277818519
244,0.39475264395089377
245,0.4007079514566836
246,-0.29274371879359173
247,0.21693875232877582
248,-0.5073592183580026
249,0.30192800790942104
250,-0.8602775604810292
251,0.30443163132395634
252,-0.6505394467322871
253,-0.8602779892319047
254,0.6418141830617132
255,0.32048365797896855
256,0.9817626869474011
257,0.8673102971032169
258,-0.4007259283908447
259,0.5069917047695043
260,-0.84958304899775
261,0.27487774206034743
262,-0.9999996371791846
263,-0.7581974539690204
264,0.4007080996768394
265,0.650557137600708
266,0.30200551778698626
267,0.5341864694206563
268,0.6421861293955861
269,-0.6418444956950059
270,0.5024641827245963
271,-0.5342041563769512
272,0.4003660583522774
273,-0.6421863649686734
274,0.9999997615622745
275,-0.9996277377066297
276,-0.7693893842740043
277,0.9951001987782714
278,-0.5073592002945985
279,-0.7410150784773735
280,0.5069917228005143
281,-0.9996230523496785
282,0.316621268911195
283,-0.9954720636153234
284,-0.8744754985283445
285,-0.9999950762244134
286,-0.3832015404699869
287,0.9817446544175548
288,-0.2748777420795111
289,0.5166799108370832
290,0.5028361886910391
291,-0.9996232113873614
292,0.9951000407461192
293,0.30166646530416175
294,0.6330150523675173
295,-0.40038404560351903
296,-0.5069916363417287
297,-0.6330150484751847
298,-0.41079801203342103
299,-0.6372866451388125
300,-0.848441302527302
301,0.8651769950491033
302,0.8698865848021162
303,0.999981805983012
304,0.6372911704718607
305,-0.4270119398014268
306,0.5338623478251766
307,-0.4096015889949006
308,-0.4165571793852506
309,0.27520164009051995
310,-0.6326733113564356
311,-0.520542994895965
312,0.7581973018565322
313,0.9817355933979326
314,-0.5372836564173087
315,-0.7581795879064068
316,0.8602819287682192
317,0.5028360465885204
318,0.5028360287053905
319,0.8916578476378927
320,0.4778432654248592
321,-0.9996400294012623
322,-0.4100582115096485
323,-0.7762901059758555
324,-0.5354544714471904
325,0.9951045660982577
326,-0.5202076792560807
327,-0.8602819277819254
328,0.9954767480051441
329,-0.6418142068984382
330,0.981752812974273
331,0.35803429483541743
332,0.8602774330578669
333,0.3828417985583183
334,0.9817896684089655
335,0.9817638229706387
336,-0.2923839970230601
337,-0.5231716273229691
338,0.9820867707295629
339,-0.5028361877239091
340,-0.8602819287874561
341,0.8685006197928719
342,0.39354198706786886
343,0.6418143659360531
344,0.8651726267426676
345,-0.5375242399471757
346,-0.5209232015664862
347,0.9824755121300741
348,-0.6376631173448449
349,0.9824575209679771
350,-0.40070795145668364
351,-0.8606495843175102
352,-0.7271485419515763
353,-0.516662238382999
354,-0.8741514444933512
355,-0.2748597410927118
356,-0.9954722216666387
357,0.4004671517281842
358,-0.6372912447403437
359,-0.8602774330579404
360,-0.6505392946006352
361,-0.6418142059312345
362,0.9821157799690621
363,0.9996277387121603
364,-0.4003838974216903
365,0.5511556276817173
366,-0.5376451405733494
367,-0.43029687003303124
368,-0.6421817034613843
369,-0.7406551902732197
370,-0.5224443515036303
371,0.3013140313625276
372,-0.7585393200865819
373,-0.8600130075236485
374,0.8916579719164921
375,0.38903173338958597
376,0.6418266337557015
377,0.5028405560110993
378,0.9999817931855289
379,-0.6502153926781303
380,0.6246441253415796
381,0.2927438709060743
382,-0.3828597897395788
383,-0.9999996025436815
384,-0.7561114986289635
385,0.8701259815029165
386,0.7581972787741977
387,0.9996232479437976
388,0.4007165171418938
389,-0.8614024268089143
390,-0.7639742470278008
391,-0.5024686921795781
392,0.6418143649305225
393,-0.8418470580441915
394,0.5069871774253945
395,0.6376632160435625
396,-0.5584612460872751
397,0.6418098157609643
398,0.27520179222217184
399,-0.7694928723119759
400,-0.8744753471912947
401,0.39270206373977085
402,-0.292401832200141
403,-0.2748597508784463
404,0.999999793253417
405,-0.5376890482254421
406,0.6330150298496701
407,-0.860282117447928
408,-0.6418098395782965
409,0.5024640237059981
410,-0.763951420142515
411,-0.5024641837300541
412,0.9999817595634812
413,-0.43168056505832414
414,-0.8648005740573224
415,0.4007079475451875
416,0.6243022361225142
417,0.8651725959401597
418,0.4007259426385848
419,-0.506987178411762
420,0.3870862707120639
421,-0.7763394296196843
422,-0.8606495833310692
423,0.995104761550597
424,-0.9999996381463152
425,-0.8606494698641557
426,-0.7585215080231772
427,0.23812205858109753
428,0.9954720636153233
429,-0.8602774014433465
430,-0.6243022361225146
431,0.3140785761955724
432,0.8651724369216398
433,-0.5024685500638285
434,0.8741336014932783
435,-0.9824575598575617
436,0.9999997576507783
437,-0.42709356000555476
438,-0.6421818624606714
439,-0.860282364613587
440,0.6501974014770654
441,0.5069915638011534
442,0.3071164895707515
443,-0.7409972354970996
444,-0.7410149527661477
445,0.8651771222595748
446,-0.8651768610902824
447,-0.5069870374433231
448,0.9951000407461198
449,-0.29238409593176845
450,0.3944198996684191
451,-0.5251564147321746
452,-0.6418142059312344
453,-0.765116823363101
454,0.8697227477948142
455,0.8744756467293369
456,0.8648004458088978
457,0.6243200712797966
458,-0.5069871954946438
459,-0.9951000407461197
460,0.5069917218333106
461,0.3016590834252218
462,0.999999638165552
463,0.6421818614934681
464,-0.5241718541457675
465,0.5073592183580025
466,0.5028362056069716
467,0.9999996046429571
468,0.9999816368066693
469,-0.8471129704024287
470,0.8696329395862064
471,-0.409465299847358
472,-0.8648050993902973
473,-0.8480754382261511
474,-0.709752900503263
475,0.6418143430857636
476,0.4002647035105671
477,-0.7719487361208374
478,0.8919997129154073
479,0.9999997971648402
480,-0.8602819593966066
481,0.3998016307257504
482,-0.7613961466452116
483,-0.27487773227397266
484,0.6421818624799087
485,0.5338444202852801
486,-0.5377008316474272
487,-0.5163380321971903
488,-0.8920175520033488
489,0.758179466698615
490,-0.9824575559460658
491,0.9824755160415698
492,-0.7406730332534934
493,-0.9999997932725809
494,-0.8651769632601456
495,-0.41952559177020765
496,0.4003838935101946
497,-0.9996277742824647
498,-0.8473451772249059
499,0.860653951637423
