,0
0,0.8045688467099602
1,-0.8190859430729612
2,0.23279591319570084
3,-0.33685685721445735
4,0.7991842866947039
5,0.43997234196923657
6,0.9399611445532884
7,0.3203583537816793
8,-0.03791120195916087
9,-0.27657436641564304
10,0.15146397197999167
11,0.4501577183087878
12,0.6191281013488122
13,0.389074141658804
14,0.07803702101154293
15,0.18903649410965817
16,0.011459833725151894
17,-0.8993142664415507
18,0.8150265928982239
19,-0.29410493831248297
20,0.028641593906364227
21,-0.9815661724485437
22,0.13659444858616793
23,0.027655404723669622
24,-0.8012130415450921
25,0.14217122164969517
26,0.1222823698603345
27,-0.11544936170322231
28,-0.05372721059661586
29,-0.09907782220200784
30,-0.27716695569674876
31,0.17060051727450437
32,-0.14095910241990445
33,0.2852843099860407
34,0.9529167693201477
35,0.11901077959765374
36,-0.27992525525329687
37,0.3176942712419412
38,0.9706928827412394
39,0.1260075228945073
40,0.7896347099741223
41,0.019307693810417446
42,0.3744720128727375
43,0.3015852097207419
44,-0.08339643222775397
45,0.9954001087958273
46,0.8056319974848042
47,0.023263992054611576
48,0.4539645666805477
49,0.7249646601407723
50,0.09459077931266507
51,0.8598921938905042
52,0.3210686115004395
53,-0.1522463442056512
54,-0.8012129832214728
55,-0.7990298820592439
56,-0.0392613407330046
57,-0.3685816230286228
58,0.9838224415875073
59,-0.9038064030261446
60,-0.08203158627603843
61,-0.3065749921137976
62,-0.8154989046987087
63,-0.13674757959749553
64,-0.7160227541807556
65,-0.1421719454910935
66,-0.933795317991847
67,-0.07862518572110291
68,-0.3877601258911995
69,0.9693289100061614
70,-0.11904252433818838
71,0.15274426100944358
72,0.6208401098169744
73,0.754886093115133
74,0.12587177244656628
75,-0.1296712093726891
76,-0.0234446671511476
77,-0.16772844912684462
78,0.13623547453363422
79,0.8483902583242063
80,0.8700036833776511
81,-0.6046620903754057
82,-0.07559125942744005
83,-0.16171930488672653
84,0.8054780285033887
85,-0.9675655562809612
86,0.9809348440514377
87,-0.13674824511393063
88,-0.9794309685405939
89,-0.36545678825127065
90,-0.6353053975256202
91,0.8999691235956304
92,-0.29693983311718963
93,0.7996829282432933
94,0.35847533146010235
95,0.9560662120138447
96,-0.03791126364703803
97,0.025860178032025193
98,-0.9369226153150024
99,-0.058091139556478044
100,-0.13292649115821045
101,0.3845808477041447
102,-0.9649643728794263
103,0.8853644507017344
104,0.33996520530707675
105,-0.07475357687058772
106,0.15713579347611673
107,-0.15256425332208307
108,0.15224634518376
109,-0.9808757294315508
110,-0.8154982695667925
111,-0.9840030247794332
112,0.8007593852081217
113,0.7554588629798041
114,-0.8686142349673612
115,0.1228209778789143
116,0.8198903476952761
117,0.3152736321384241
118,0.9651456781006498
119,-0.6046621496188314
120,0.9400669698341302
121,-0.739630837409152
122,-0.7999840188108109
123,-0.04362521142221213
124,-0.05809119782245342
125,0.28964301297544415
126,-0.2692906210303578
127,0.7852162739113604
128,-0.9999990723645391
129,0.6694673165610066
130,0.8661664103092682
131,-0.3713472432002578
132,-0.07640647686247586
133,0.043805943929824655
134,-0.5873106013100399
135,0.31960622964464025
136,-0.35459197474582493
137,-0.14219876286545574
138,0.021649153937721252
139,-0.9956082303075519
140,0.8156789436276657
141,-0.8012398598975329
142,-0.9695371500728094
143,0.6352785575927031
144,0.15256425332205392
145,0.3839208665003495
146,0.04230273426879764
147,-0.8012129832214436
148,-0.8030867243470251
149,-0.6193094408741632
150,0.32467259904630186
151,-0.1527711925859565
152,-0.6092342947890387
153,-0.03923446168066971
154,0.4246577759292448
155,-0.3339094501352452
156,-0.08004100563288231
157,-0.006020071640291211
158,-0.8030893175128054
159,-0.8968652184720424
160,0.6193087524466491
161,-0.9362626499639134
162,-0.3330252074302034
163,0.03770304640852927
164,-0.8007144307749849
165,0.33549252364847104
166,0.15224573799031754
167,-0.28577545711209734
168,-0.7165069200123193
169,0.7995016171880556
170,0.016614392508620596
171,-0.40060772009099127
172,-0.8432160626074994
173,0.7159105175635406
174,0.996170813245285
175,0.1079435539743634
176,-0.023263993860921133
177,-0.8040743409706819
178,0.3846003163707192
179,-0.8599142616751871
180,-0.28861104845941393
181,0.13778046845861106
182,-0.9840031119088275
183,0.8292688109979512
184,-0.31799946699319903
185,0.6863527293099901
186,-0.6129422927543798
187,-0.13077096341849956
188,-0.14064118915706728
189,-0.6235194909972211
190,0.9153083343735382
191,0.058118015195831506
192,-0.9649643385817831
193,0.13830520754211476
194,-0.1261752047760737
195,-0.8005612394879581
196,0.11880948042311444
197,0.9546715772152073
198,0.2859167663664967
199,-0.6086944855189067
200,0.9855062645649197
201,0.2707955055023875
202,-0.12649244849204225
203,0.15277185706733187
204,-0.9006595494626402
205,0.8993117056772799
206,-0.8706611251018639
207,-0.18622531619855157
208,-0.7850356590363028
209,0.9006595494094313
210,-0.10617952690353988
211,-0.3532999720813736
212,-0.15291871928012482
213,-0.0808143599787028
214,-0.8947963451784846
215,-0.08181533458772121
216,-0.405895188856058
217,0.9686968219309599
218,0.36929666982861536
219,0.12586995895014974
220,0.8337321739810044
221,0.13674366181236755
222,0.08512706124857145
223,0.02559070649773435
224,-0.14064046543300956
225,0.023931739570531976
226,0.3699514779814068
227,-0.1360958614185671
228,0.9999997615814369
229,-0.4355335339022841
230,-0.3208658226360926
231,0.8962125810836455
232,-0.6191281003707612
233,-0.8833138606149403
234,0.33264613148507555
235,-0.27534757615757954
236,-0.7847452327050048
237,-0.3183958409906134
238,0.9955813535727449
239,0.8999704567016769
240,0.9693542384516315
241,-0.12943399310647835
242,0.40690621570583446
243,0.9508699223841399
244,-0.8477353509128801
245,-0.15265313873081512
246,0.3182077435341231
247,0.018581721541389384
248,0.7990030338884342
249,-0.43623514021885945
250,0.15884293427850127
251,-0.804073704080079
252,0.2845748583188701
253,0.15748387706492373
254,-0.12944545452807896
255,0.46615439528931274
256,0.31665011553117445
257,-0.3065756575142022
258,0.16130289501147624
259,0.7995021939019289
260,-0.2845943234249651
261,0.023476872354412426
262,-0.8033951130930096
263,-0.6076679668751418
264,0.8146133401988197
265,-0.11876739921465491
266,0.7852439022679983
267,0.18788697238344523
268,0.07151867703774144
269,0.15698266045030076
270,-0.12132258646843148
271,-0.13640054692787096
272,-0.8999716881667039
273,-0.805451382720601
274,-0.8546864865660407
275,-0.03944134805261603
276,-0.9992981918045333
277,-0.7843559201388888
278,0.8409507922597304
279,0.2876970774117885
280,0.7995022223663532
281,0.3324654563813617
282,-0.16594383986094174
283,0.9184110959191939
284,-0.2852534105354208
285,-0.28839000162891076
286,0.14942440932975892
287,0.9001554573565776
288,0.9044638693328841
289,-0.12165635149951329
290,-0.6046358791000531
291,-0.129202113231124
292,0.23587346547096943
293,0.11969465631455797
294,-0.33996776607140317
295,-0.6732962920170797
296,0.915288863805947
297,0.9839784039058901
298,0.8992883939443466
299,0.07422683623692476
300,0.8839737758585391
301,0.8402215284832807
302,-0.06250529599860555
303,0.11475399325330354
304,-0.15224567326823898
305,-0.6046352136412847
306,0.3164687637016025
307,-0.8156795488635533
308,-0.13089760578303453
309,0.9400669177910568
310,-0.6117580501414446
311,-0.15227260924644379
312,-0.290132289489599
313,0.4522318371625909
314,0.91081500598407
315,0.03176685749448307
316,0.3210677874461464
317,0.8048735401858416
318,-0.9546936751793543
319,-0.3859493757983675
320,0.1313795695200023
321,-0.3180263333254473
322,-0.6664677783372484
323,-0.9184110726554442
324,-0.08648774745860034
325,0.8470423499828309
326,0.9795840072715533
327,-0.07668737914372335
328,-0.40587645104460646
329,-0.8661690193578984
330,0.8630416134790797
331,0.8306074565214933
332,-0.10758619492926222
333,0.28906956220054275
334,-0.453285048628931
335,0.913994284171071
336,-0.9139372473727704
337,0.2884120759194929
338,0.9177765764719027
339,-0.919090541955995
340,0.3368625116603303
341,-0.28841212801580207
342,-0.30218351900786855
343,0.3020027865002855
344,0.6252309765525568
345,0.9362431949894615
346,0.18801497723556967
347,0.3992841250170834
348,0.8992921541855353
349,0.9695096079382767
350,0.33703753231105166
351,-0.6351253662473193
352,0.8693158568655251
353,-0.9546936449964155
354,0.11385090081568132
355,-0.12310162154367628
356,0.9324228000569176
357,-0.33219050467438116
358,0.6353061213677331
359,0.8442450611550135
360,-0.8146133692544202
361,-0.10737880055702442
362,-0.15972733507746417
363,0.8051065384858007
364,-0.23783961309835558
365,0.14971314198744406
366,0.03944201387915743
367,0.15259045910672858
368,0.8035758169321799
369,-0.33617458635261693
370,0.8152079034576878
371,-0.2852651383166672
372,0.12669999478285324
373,-0.3210677988769793
374,-0.23561171722641894
375,0.9992680645616657
376,-0.40238426989275733
377,-0.9529192923487346
378,-0.805424505007473
379,-0.8054513540444299
380,-0.8184259443117925
381,-0.8054237812243737
382,-0.8007413369373645
383,0.45222920438929515
384,-0.712891294530901
385,-0.9999728611465849
386,-0.9649643395598335
387,-0.05928627139743765
388,0.8157064545223254
389,-0.3420963279920282
390,0.6649162415177495
391,-0.8992895896118347
392,0.12649317325322104
393,0.4693038583860249
394,0.7894547012496664
395,-0.9184357012045168
396,0.8039198780692467
397,-0.08144840010995415
398,-0.3152710713235179
399,0.02589456590875263
400,0.3200288496456889
401,-0.10749219590556497
402,-0.8200704448541444
403,0.8193917653324402
404,-0.08588546715967586
405,-0.4661544156949931
406,0.15224567424631902
407,-0.9369421668599318
408,0.6590150666248874
409,0.07789487814870953
410,-0.3582367488320721
411,0.04209518393678282
412,-0.12599458546848635
413,-0.40240633386725333
414,0.027629254829085282
415,-0.6235201574346972
416,-0.13780662037256286
417,0.7195666078225326
418,-0.40412877419492277
419,-0.7996829272645279
420,0.9285990062594256
421,-0.3386173052094971
422,-0.9044638371874524
423,-0.7999645155528139
424,0.754654493713495
425,0.9006815775059935
426,-0.9795847311129852
427,-0.39796564023090897
428,0.45328504476634507
429,0.12278775397101872
430,-0.9331157677914456
431,-0.9838217752096793
432,-0.29645484708851266
433,0.8007419430354131
434,-0.04383348542449764
435,0.028338372831970937
436,0.33859523304188843
437,0.14968852732798932
438,-0.07674685296161204
439,-0.9190906267716711
440,-0.3210415762867074
441,0.435530976947272
442,-0.6092349008870062
443,-0.40247776334004787
444,0.30172226666256785
445,0.9369200507918449
446,0.04227513277349559
447,0.440651847718436
448,0.8035980185995723
449,-0.623673953899341
450,-0.3877795907524502
451,0.8195986497489158
452,-0.16139455865566765
453,0.02481223621965731
454,0.8323960559468659
455,0.9285990621678041
456,-0.16006337741356094
457,-0.1365669599121608
458,0.8177380576610471
459,-0.3852724209298476
460,-0.6572146053844764
461,0.9306458422205959
462,0.15224640442781692
463,0.6689209630882158
464,0.9306679023803566
465,-0.0741574291893777
466,-0.07415745024878666
467,0.7576777388080652
468,0.11518607985355768
469,0.14377929880752247
470,-0.28906951386037166
471,-0.3846328130716614
472,-0.3020027748291529
473,-0.37134722992879593
474,0.13742127753518388
475,0.15813574174491016
476,-0.07409605358612344
477,0.4145766791842695
478,0.136095196018157
479,0.804952771739894
480,0.011059826537648853
481,-0.4145767460938438
482,0.025003296936095046
483,0.3020303771851311
484,0.8839712465154376
485,0.13759912882305678
486,0.30221038584490684
487,0.2890669530959836
488,-0.9699887906526915
489,-0.07540777768260834
490,-0.3621921597080505
491,-0.0035268445719547634
492,-0.3330671794497489
493,0.4037763281266992
494,-0.46930378963446895
495,0.8400509126892856
496,-0.1522726157041604
497,-0.16129213822618163
498,-0.006025556870943977
499,-0.07423814279371074
