,0
0,-0.901914589199291
1,0.4521496577019859
2,-0.7211722996847325
3,0.6648204706221711
4,-0.04021622548843434
5,-0.41286350947894135
6,0.9805075028764835
7,-0.4210207625965054
8,0.2548930848050395
9,0.3390541080175751
10,-0.05047879372374823
11,-0.4093825946014669
12,0.9805851493688635
13,-0.6810854966641141
14,-0.7703905760810004
15,0.7408904992241743
16,-0.9805060608116891
17,0.7343446156078874
18,0.15411205133766073
19,0.5990533202099384
20,0.0387800280770329
21,-0.10579634235632822
22,0.4054521960588439
23,-0.5930235641685435
24,0.9993136367906333
25,-0.019975278161454488
26,0.047854812659752714
27,0.7394979548403859
28,0.33905421059143215
29,-0.1299883683347395
30,-0.25524954319485416
31,0.6809193642492829
32,0.6816844304090802
33,0.15178076165267798
34,0.4144205435813433
35,-0.2747769657795238
36,-0.9999207653096392
37,-0.6648147049738
38,0.10189559438783857
39,-0.1976959704120744
40,-0.5997393534310065
41,-0.22969683464610235
42,0.2903649896452895
43,0.47775628004559645
44,0.27104917537511986
45,-0.6957803369421396
46,-0.21641974041227136
47,0.9972266111600763
48,-0.6376433555346961
49,0.2752291125877619
