,0
0,0.8207752423498352
1,0.5182162801852849
2,0.9570467900327942
3,0.3547986326899348
4,0.598269570239767
5,-0.39020443354553275
6,0.9999112282686592
7,-0.7552330160056728
8,-0.3669917113591732
9,0.43755120489901866
10,-0.6389977277888405
11,0.5579938388620717
12,0.5873929328182063
13,-0.3902907462306393
14,0.7767858320294649
15,0.9559665088070739
16,-0.7304097951266598
17,0.7491563557089227
18,0.9987042973855208
19,0.43718818114764446
20,-0.5812069847325252
21,-0.8316507798970432
22,-0.766111110941553
23,0.36697076235815856
24,-0.9891000054229289
25,-0.356115065442591
26,-0.7661331151262537
27,-0.6134664449746252
28,-0.7674264300098825
29,-0.755614854307619
30,0.4375453468831958
31,0.7784506027373352
32,0.7661100098876213
33,-0.7546023849311844
34,-0.5169832086587552
35,0.7778688907940948
36,0.4369587770384443
37,0.7888475868266274
38,-0.3486342460943584
39,-0.6383582679491748
40,0.5886663918576941
41,-0.5823355447995624
42,-0.5586386614860387
43,-0.7551899867516068
44,-0.61412357962332
45,0.9999986860453154
46,0.9891011070027732
47,0.36696966104202194
48,0.5579949308929513
49,0.8195664425030493
50,-0.6382860720117621
51,0.9987646566321936
52,-0.7552333237658899
53,0.35609412599972345
54,-0.9891000054229031
55,-0.5982695609418147
56,-0.767404389252214
57,-0.5568471615456603
58,0.5995650724814572
59,0.51706852996582
60,-0.6140895837818008
61,0.7552553916642057
62,-0.9891220366230769
63,0.7661111016463262
64,0.5316424902044131
65,0.35611506544119254
66,-0.8315655450996906
67,-0.6210268649833358
68,-0.38956066493919783
69,0.5995430314600738
70,-0.7556646346366713
71,-0.3656763865026012
72,0.98780558159599
73,0.8206891091422679
74,-0.6383586622418969
75,-0.7490300584277164
76,-0.36696967060091434
77,-0.794156907309429
78,0.9558780224988983
79,0.8304177754999928
80,-0.5181299626987413
81,-0.5873708711485313
82,-0.6208761419928449
83,-0.7941445988650229
84,0.8207752029876871
85,0.34863528048079423
86,0.9999766452889988
87,0.7661111016449517
88,-0.5995639711652581
89,-0.5568461073394257
90,-0.9878276575208014
91,-0.7491563448603881
92,0.43688450700059467
93,0.5886873100794423
94,-0.9590733766297656
95,-0.5169821740198769
96,-0.36699172442507366
97,0.7766977007925879
98,0.9174178911345172
99,-0.7674275037399632
100,-0.7555821624069992
101,0.957281842613075
102,-0.5995419304061896
103,-0.917504227455641
104,-0.5597001123661091
105,-0.6219251753735959
106,-0.3656752851863772
107,0.36567639606011837
108,-0.3560941259997234
109,-0.599564047653854
110,-0.9891220014063626
111,-0.5995650606942233
112,0.8207736885922271
113,0.8206873617029999
114,0.7502167810229738
115,-0.638329895874163
116,0.9891231027238757
117,0.7888465904818038
118,0.5995419186211797
119,-0.5873708711485559
120,-0.9174168891690607
121,0.5310193028861608
122,0.9186519967566347
123,-0.7674054903047225
124,-0.7674275037399874
125,0.9571352229534069
126,0.9602222181309841
127,0.5886652693211363
128,-0.9999997971826766
129,0.8195208563945173
130,-0.7502177776311001
131,0.5586396958670535
132,-0.6209883867925517
133,0.7674054998636397
134,0.4095764443630589
135,-0.7552329033801616
136,0.3913522167796762
137,0.3561150651789239
138,-0.5822578152890467
139,-0.9999986602652529
140,0.9891220109652579
141,-0.9891000056851971
142,-0.5995430199373397
143,0.987827622089253
144,-0.365676396060119
145,0.9572818391634204
146,0.36699281267535805
147,-0.9891000054229028
148,0.9186509626280385
149,-0.5873929423784754
150,-0.9601347752171353
151,0.3656763732212373
152,-0.5873719820236095
153,-0.7674043616682951
154,-0.7906390966488954
155,0.5597069748718161
156,-0.6219244771313366
157,-0.7298262175038671
158,0.9186509953289886
159,-0.830503077942484
160,0.5873929214643552
161,0.9174179613284478
162,-0.957195540376081
163,0.36699171460251306
164,-0.9986822303686982
165,-0.7917879378623114
166,-0.3560941260010747
167,0.5597875906238062
168,0.5317130593202265
169,0.5886873214780002
170,-0.5823342104147083
171,0.5589827459069182
172,-0.5983299037101432
173,0.8196070629250951
174,0.9999986891642467
175,0.7778653246066037
176,-0.3669696741071134
177,-0.5886884113955789
178,0.9572818769417466
179,-0.9987646568845774
180,0.5597882744742538
181,-0.3561161540787138
182,-0.5995650820403499
183,0.4299820259752524
184,0.35482178739559633
185,0.8195895417798851
186,0.40888476275210955
187,-0.7545424628045088
188,0.756527712892836
189,-0.5873940132216003
190,-0.3487216548272136
191,0.7674275040022565
192,-0.599541909060911
193,-0.36569842699800065
194,0.756549780584942
195,-0.9986822210734504
196,-0.6867755481688957
197,-0.7490689472393898
198,-0.75461049708255
199,0.42321797025933217
200,0.999977756162692
201,-0.7543356730717724
202,0.7661320506467124
203,-0.36567637321986235
204,0.5170695830082495
205,-0.7491563557143811
206,0.5181299251727766
207,-0.7851232776134195
208,-0.5886652597622666
209,-0.5170695830082509
210,-0.6134780940661678
211,-0.388499194680312
212,-0.7952893659686353
213,-0.6219249254042394
214,-0.5984162402867461
215,-0.6141707362955776
216,0.5591222063151419
217,0.4312171133962916
218,0.7889339236556374
219,-0.6383586395294046
220,-0.3498683519688806
221,0.9558779729874097
222,0.7777619676962199
223,0.7766903524253455
224,0.7565277128942364
225,-0.5812837325203362
226,0.7889339330879862
227,0.7565288235056218
228,0.9999997615814387
229,-0.38964594322034724
230,0.9601358473818974
231,0.9988289156809161
232,-0.5873929328182045
233,-0.4300693594014486
234,-0.3547997370789872
235,0.4375492828471924
236,-0.598247529745151
237,-0.7888476248573605
238,0.9999986600029598
239,0.8305040825084294
240,0.4312171662747044
241,-0.7545402594340418
242,-0.958988074692015
243,-0.749070019393233
244,-0.8304177084144154
245,-0.7952894161365935
246,-0.3548217775730118
247,-0.5823345371087075
248,0.5982695819795029
249,-0.38964596737867446
250,0.7779518992801752
251,-0.5886884323530696
252,-0.7918742368989381
253,0.777952960972996
254,-0.7545394061396012
255,0.9584285397492615
256,-0.7552344522213378
257,0.7552553916628313
258,0.777952940242076
259,0.588687300520526
260,0.7918742648448537
261,0.7766977299886394
262,-0.5982706832970537
263,0.40888279015860096
264,-0.750304087231568
265,-0.7556655596206503
266,0.5886652905428698
267,0.9559456284279465
268,0.7767847318593071
269,-0.365675294481603
270,-0.7555756094969104
271,-0.7542504201105171
272,0.74915634485493
273,-0.9891010974439015
274,0.9185646585109399
275,-0.7674043714881056
276,-0.9999997235507053
277,0.530963779474705
278,0.9987415053245279
279,-0.7918732307161988
280,0.5886873214793522
281,-0.354799746637881
282,-0.7941650850742542
283,-0.3487206206985947
284,0.5597876135375384
285,0.5597864489287476
286,-0.6389896104664545
287,0.9988299870593145
288,-0.5170685108488632
289,-0.7556651913992297
290,-0.5873708708876147
291,-0.755589591440397
292,0.9570477996134301
293,-0.6306094583058943
294,0.5597001123606525
295,0.5317666750850591
296,-0.3487216674895528
297,0.5995650604363836
298,0.8305040447246252
299,0.7767858077141085
300,0.43006938162123975
301,0.9987414314669378
302,-0.6142532917086948
303,0.7778648627905749
304,0.35609411332320573
305,-0.5873708708862391
306,-0.7552344348932611
307,-0.9891220109666076
308,-0.754580396270864
309,-0.9174168891690829
310,0.40888237344106815
311,0.3560941130608891
312,0.43613731735806777
313,0.7900806963948295
314,0.998850920121095
315,-0.7304509583694698
316,-0.7552333237559148
317,0.8207748934137682
318,0.7490689736558444
319,0.39029178061165487
320,0.9558667033477883
321,0.35482177450071006
322,0.5315534610542447
323,0.3487206331139958
324,-0.6139189062358531
325,0.5983309761218673
326,0.5995639591143949
327,-0.6220042941873215
328,0.5590277295901119
329,0.750217777625618
330,0.9987656557123725
331,-0.34986938634983517
332,-0.6134929022569177
333,-0.5597864310802542
334,-0.5579948732485078
335,0.43112974244721813
336,-0.9988519900583895
337,-0.5597864686062437
338,0.4311308297035825
339,0.3487205829202705
340,-0.5597011664215478
341,0.5597864686062201
342,0.755256492980406
343,-0.7552565025393234
344,0.9878066829107998
345,-0.9174179615753495
346,0.955964437822479
347,0.5579075403301871
348,-0.7491563559613291
349,0.5995430196736715
350,-0.35479862313104144
351,-0.9878276127940047
352,-0.750216742992219
353,0.7490689469870068
354,-0.638319817317634
355,-0.7546168412927213
356,0.5994787241207173
357,0.4368049992471409
358,0.9878276575222004
359,0.9987425131211521
360,0.7503041139443785
361,-0.6134928826236625
362,-0.7952138558934571
363,0.9986833672419797
364,0.4376067582518406
365,-0.638989600179078
366,0.7674043988111058
367,-0.3656763827801542
368,0.59827067155595
369,0.7917879000785053
370,0.9987042713892733
371,0.5597874833128903
372,-0.7661320135491988
373,0.7552333506442224
374,0.4376260889178251
375,0.9999997588884927
376,-0.5579085744533245
377,0.516983190247328
378,-0.9891010971816117
379,-0.989101062229285
380,0.5182163177167087
381,-0.9891010971802092
382,-0.9986822661867221
383,0.7900806682603839
384,0.5317137354013434
385,-0.9999997969217597
386,-0.5995419090609114
387,-0.6209036870975481
388,0.9891220464442636
389,0.43679376149103083
390,0.8194167503919918
391,0.749156355966786
392,-0.7661320506453141
393,0.9584296085107346
394,0.5886663823001761
395,0.34872063285615507
396,0.5886884020976029
397,-0.6220017375372932
398,-0.7888465904763445
399,0.7766975707423204
400,-0.7552328156906495
401,-0.6134929049838598
402,-0.9891231474968194
403,0.9987053628842245
404,-0.6220177744312427
405,-0.9584285738718565
406,-0.3560941133232056
407,0.9174178908875693
408,0.819519696651556
409,0.7768199151756774
410,0.5590371610276587
411,0.3669928159200874
412,0.7565497632086371
413,-0.557908574705707
414,0.36697077516239607
415,-0.5873940132229755
416,0.3561161538178204
417,0.819608980756424
418,0.5589805827054153
419,-0.5886873100794424
420,0.599477673057433
421,0.7917869316710426
422,0.5170684924398553
423,0.9186519970035603
424,0.8206870578401813
425,-0.5170695643468222
426,-0.5995639591157939
427,0.558873156647863
428,0.5579948732485074
429,-0.6383582628618475
430,-0.8315655073213182
431,-0.5995650724800822
432,0.4368593092895892
433,0.9986822661880743
434,-0.7674054728056408
435,-0.7304339905271889
436,-0.7917869037337152
437,-0.6389895350923565
438,-0.6184576623198477
439,0.348720595335624
440,0.7552333240168325
441,0.3896459432148898
442,-0.5873719820249602
443,0.5589801408764443
444,0.38841287194076646
445,-0.9174178911399754
446,0.36699281241166587
447,-0.390204395767184
448,0.8207725872472751
449,-0.5873940225195746
450,-0.38956067905549124
451,0.9987053727040336
452,-0.7941421754506888
453,-0.5811920134203492
454,0.4299830450531668
455,0.5994776730574587
456,-0.7943171960481135
457,0.766111083929613
458,-0.7503030528506125
459,0.3902918044891247
460,0.5318261782522805
461,0.8315644808549147
462,-0.35609412599970003
463,0.8195207896333575
464,0.8315644811072977
465,-0.6208746223977695
466,-0.6209504797509107
467,0.8206896971959449
468,0.7778647371933853
469,-0.6389899981131637
470,0.559786431080278
471,-0.38955964442211605
472,0.7552564756501919
473,0.5586396759780018
474,0.9558780201573003
475,0.77795189078537
476,-0.6209504471781369
477,0.9583422031811896
478,-0.7565288235069968
479,0.9986833223896335
480,0.7767607399707149
481,-0.9583422373007324
482,0.7766977314277895
483,-0.755256475386501
484,0.4300693969273903
485,-0.35611616363898235
486,-0.7552564658289825
487,-0.5597864310857349
488,0.34863429654285055
489,-0.6141681715611744
490,0.43679763190585813
491,-0.7298263265129474
492,0.5597317092229469
493,0.78999539419924
494,-0.9584295743880812
495,0.998741365283031
496,0.3560941257387828
497,-0.7951955780116085
498,-0.729826196898361
499,-0.6208746047251796
