,0
0,0.8327528708179344
1,-0.07551931938332876
2,0.8382367977542535
3,0.9665356640556948
4,0.1326726238272251
5,0.6435535549054606
6,-0.830857900078691
7,-0.9977873910459263
8,0.7037742672581373
9,-0.07764733615165484
10,-0.38298814967003064
11,0.3151015547997686
12,-0.31103146860202713
13,0.8343771351507312
14,-0.393525079726825
15,-0.36239809238075277
16,0.18064835010179867
17,0.9266136490908142
18,0.23893870512982288
19,-0.35635117817200135
20,0.3563418421907991
21,-0.10716861588378633
22,0.10835455423901869
23,-0.41226331794408555
24,-0.5099519773485978
25,0.13268219981860624
26,0.38688038588333895
27,0.11698400486830245
28,-0.23327773593146087
29,0.6466303114821562
30,-0.1256321854790644
31,-0.2887522828601634
32,0.07551931938332891
33,-0.5383168317984193
34,-0.8535277226078121
35,-0.3103320571857393
36,-0.14133037595653014
37,-0.15214503780437155
38,-0.30893665222968136
39,-0.03591298540371503
40,0.4798559529170977
41,-0.8259901390893454
42,-0.28533856926649454
43,0.11256653760883631
44,-0.8693851074222434
45,-0.8164759474015362
46,-0.3102497502939555
47,0.8079877885606623
48,0.9945064859772031
49,0.6444929488103655
50,0.8363605245467477
51,-0.18141225958937904
52,-0.6739021930798682
53,0.29828590159001633
54,-0.8651317751376244
55,-0.3566264128874309
56,0.2805058011245177
57,-0.2819674810111939
58,0.6906806407274085
59,0.330968257894601
60,-0.31408411476679565
61,-0.010717932072555402
62,0.23900458314224482
63,-0.1867568472141846
64,0.7450056338901432
65,0.24971489565528288
66,0.23892957527852376
67,0.44897665692302857
68,-0.01960424222332822
69,0.32547498209479164
70,-0.9913513934147807
71,-0.3083039568810719
72,-0.9268982419974509
73,0.8164761747250103
74,0.0296452568647441
75,0.30473106670957667
76,0.8343019296669009
77,0.9406341200910943
78,-0.30480606372406516
79,0.01072705341700409
80,-0.8941426601033698
81,0.30773197594900453
82,-0.6465548719905675
83,0.8896874675597964
84,-0.3065262790823014
85,-0.13681262939219874
86,-0.6977948683766512
87,-0.3362392134272605
88,-0.3251966220334543
89,0.037853082752689324
90,-0.7999068354076946
91,0.19477735724294434
92,0.8587457515570478
93,-0.21257264257982214
94,-0.04478553367876847
95,-0.9914266286046469
96,0.1513909215411878
97,-0.12341981047071539
98,0.8101062554150832
99,0.9997058226091604
100,0.27834757263652443
101,-0.008665153564369046
102,0.08402044421976053
103,0.04005610462028567
104,0.08402637680635541
105,-0.6063464131268308
106,0.9320611788351381
107,0.4557863486134615
108,-0.1806483565333582
109,-0.8278567456932169
110,-0.37149227426695736
111,0.019365880887013135
112,-0.10880733914495078
113,-0.9892988066268251
114,-0.24963008447369592
115,0.820772169935392
116,-0.8938674146987957
117,0.12554760162095155
118,0.9667174531801805
119,0.23900458314224446
120,0.29828568488631013
121,0.825804194199994
122,-0.3235955962779202
123,-0.20186548092358494
124,0.25503778481736145
125,-0.41935134188088546
126,0.3047404153778241
127,0.9042377385555046
128,0.7103037780601011
129,-0.377207176718497
130,-0.937277979715697
131,-0.8079784398927474
132,-0.21081362407647053
133,0.9999152133259642
134,0.32415858218892524
135,0.08622939568239023
136,-0.6551280172457061
137,0.9228388620268405
138,0.9341137304014365
139,0.09206277588317814
140,0.7102944546805482
141,-0.28354363315246395
142,0.3914634393367306
143,-0.561185618471545
144,-0.7707130172407013
145,0.2609781562287666
146,-0.6828082210650608
147,-0.3446967258017444
148,-0.011164501236632825
149,-0.7648600009416465
150,-0.3550285135299893
151,0.16044221158539856
152,0.24938044768207296
153,0.8079875900036928
154,0.09063950176576345
155,0.8732866749864476
156,0.8938736921219866
157,-0.1348852037485232
158,0.296064256876188
159,-0.1224984093963376
160,0.911607349599526
161,-0.6551184645782765
162,0.14337335145837168
163,-0.7963085316446438
164,0.30480629104753076
165,-0.34466443490321336
166,0.056677212416190406
167,-0.8759074798315112
168,-0.08436430809300695
169,0.3446550862349653
170,0.8258135428679092
171,0.9320704943192079
172,-0.017789748028196127
173,-0.31206602122975124
174,0.8905329891890305
175,0.7771579718564438
176,-0.9913515854435135
177,0.046510834881994034
178,-0.5129633822636642
179,-0.8693944251377481
180,0.8079875900036929
181,0.8279415863486962
182,-0.6465548719905678
183,0.25519652419005395
184,0.9978720104279121
185,-0.2663325240650239
186,0.7016558292456431
187,-0.01153295201360382
188,0.8737138066318302
189,0.7420246357660567
190,-0.13138107593481624
191,-0.8759077383396104
192,-0.20871416025804843
193,0.22387120314210057
194,0.38110876180553804
195,0.7707034412493204
196,-0.632969423954627
197,-0.11485599086442771
198,0.33625132619652487
199,0.8186885453392874
200,0.7257200562850977
201,-0.4284052466327452
202,0.039990218101013525
203,-0.8896874358845684
204,0.4856245059553266
205,-0.3457506616472186
206,-0.33917115910340434
207,-0.6038164182920226
208,0.14124579713015248
209,0.9426957594397014
210,-0.048554037707301656
211,0.6201119839876831
212,-0.9669595882171423
213,0.8652161316722633
214,-0.3917574799074629
215,0.7015794301569134
216,-0.39392028274321245
217,0.7771581991799174
218,0.2835342945791203
219,-0.35376740000086365
220,0.8938673828747498
221,-0.24113260573107892
222,0.6529909051455859
223,0.9999901855900565
224,0.3238708850372008
225,0.3180929720057718
226,0.9263353006073373
227,-0.24751186489717575
228,-0.8002008099826098
229,-0.06305517336058203
230,0.04060150396285962
231,0.013216194962316113
232,-0.5663561756202502
233,0.048629274625819396
234,0.8737138066318298
235,0.3884814254698397
236,-0.21453269004662193
237,-0.8677840507142994
238,0.8327435221500187
239,-0.2682741593598089
240,0.10497211072854297
241,0.08121305515339351
242,0.12563216429906052
243,0.8324682449213996
244,0.12341958314724942
245,-0.20473525226228292
246,0.7631440056028291
247,-0.1828511511559138
248,0.8363604947701001
249,-0.12989359277897927
250,-0.12349504565790217
251,-0.2961581149096071
252,0.8079032334690538
253,-0.2523890859996363
254,-0.2929482480628173
255,-0.3259157024335445
256,-0.36052178932979806
257,-0.029791778815935144
258,0.09253268640192919
259,-0.41935135681090346
260,0.2497053196635615
261,-0.9892236066586164
262,-0.050650288469921464
263,-0.41132360515342353
264,-0.6185620591804909
265,-0.31972705509501215
266,-0.9426957594397017
267,0.3810994267057714
268,-0.12563218100622614
269,0.37560615090596233
270,-0.4801312130615753
271,0.37721652538674505
272,-0.3705653095167932
273,0.3309682578946007
274,-0.22299941006418947
275,-0.32548125951798323
276,0.42451306296772934
277,-0.7124318174284341
278,0.9977871637224603
279,0.019375457568211418
280,-0.8015078326844278
281,-0.14182329760489856
282,0.11484686951997812
283,-0.18129596572906
284,-0.16151718548232502
285,-0.34626544838778134
286,0.8279415863486957
287,-0.60322112941609
288,-0.3081240868341952
289,-0.08401702813810763
290,-0.7123472082088743
291,0.8996359357076031
292,-0.42972169756163997
293,0.8680780252787484
294,-0.8535277529956583
295,-0.8343773624741975
296,0.11536834088461094
297,-0.9426866380952525
298,0.027540904711846743
299,0.11705924005548918
300,-0.8165607585831232
301,0.07544431420562502
302,0.006056186635208141
303,-0.07765645749642851
304,-0.362122802249802
305,0.7963085599953358
306,0.3634983251070132
307,0.2159127345456562
308,-0.08614481182728823
309,0.2808630961914744
310,-0.7685100227340957
311,-0.3496483165165936
312,-0.0653703447168961
313,0.32809853102127073
314,-0.8018018357951443
315,0.25210446009296844
316,0.8737893002516944
317,0.24106649188598722
318,-0.5761563432205539
319,0.8382367977542534
320,-0.8759077383396104
321,0.0979399572582911
322,-0.3114188550836521
323,0.968560579546356
324,-0.2534438471216261
325,0.11697443304152111
326,0.7690369040666304
327,-0.17207540915106162
328,0.2390048104657106
329,-0.2871419084367147
330,-0.6705453947715395
331,-0.8590303774637155
332,-0.7792104956807859
333,0.01693318955348673
334,-0.1408494122811873
335,0.013927655110124304
336,-0.41224769185320315
337,-0.3808148007991034
338,0.13275720768232688
339,-0.8002008099826099
340,-0.799916155596809
341,0.04861703157475606
342,0.36315215733071254
343,-0.34559525821025744
344,-0.2389387051298229
345,-0.37561549957421014
346,0.238938705129823
347,0.32965185798873436
348,0.9341136971445152
349,-0.779285985936082
350,-0.3048060745759681
351,-0.9307904918461507
352,0.6551186685777914
353,0.9269076236657299
354,-0.7685006467051904
355,-0.196909748392735
356,0.994212511412754
357,0.3811024979508282
358,-0.019366108899963624
359,0.35635117817200124
360,-0.41357036913517
361,0.8759074798315106
362,0.42999697479026
363,0.8279415568717842
364,0.9252972162419163
365,-0.3148262775613481
366,0.1828513784793877
367,0.07544431420562513
368,0.4990584443147862
369,0.3183775979023059
370,0.11508376208234636
371,-0.03999044542447981
372,-0.12132065731639005
373,0.8204968926969718
374,-0.30694342639585515
375,-0.5723687219893661
376,-0.3563868897241353
377,0.1389407037763825
378,-0.18065769876971352
379,0.7102194215284654
380,0.4557863486134615
381,-0.355025429645087
382,-0.08356030299859121
383,-0.41386428866196756
384,0.41386435843428576
385,0.9268982419974512
386,-0.08615439088599343
387,-0.2752726537775925
388,-0.9263446162952642
389,-0.39146349139541037
390,-0.39243624048800635
391,-0.9324008662695994
392,0.6647267085424956
393,-0.3676914080379227
394,-0.8951900920278537
395,-0.3188828380191021
396,0.901246310131052
397,0.8424073960765204
398,0.9427711095632564
399,0.8693913538928009
400,0.6444270852344034
401,0.36511323548344593
402,-0.9250281061642982
403,0.7685004467423744
404,0.13663341336741047
405,-0.13034419555467538
406,-0.940643435269945
407,-0.8622970832330907
408,-0.8880863042608744
409,0.24757776023087136
410,-0.3069434373238542
411,0.35635117817200146
412,-0.3563511908590468
413,-0.3985577927551776
414,-0.8220885698412586
415,-0.9341887050082365
416,-0.0378533114238337
417,-0.20109973385080213
418,0.7687521591479288
419,0.011960061310640722
420,0.04295167596559371
421,0.7222844333019545
422,-0.6026247497611447
423,0.8748783520740665
424,0.30474041537782415
425,0.011384461844880553
426,0.3917480705919257
427,-0.15122721751076573
428,0.9665469041869108
429,-0.13488499436273635
430,-0.6255860286227742
431,0.7102944546805481
432,-0.8652161316722636
433,0.10427680668543908
434,-0.3047401772047931
435,0.8257384251935457
436,-0.9427619068472578
437,-0.21797444526715842
438,0.816475947401536
439,-0.2665686959280833
440,0.177867350735066
441,-0.27033773133487793
442,0.2504940856121858
443,-0.8641464330482992
444,-0.8278758202159836
445,0.9320611788351372
446,0.2497148867647718
447,-0.6177231198538289
448,-0.037937893931256975
449,-0.8651317443366434
450,0.9999904129135226
451,0.1074947933182817
452,-0.17958793951222898
453,0.8910596641906215
454,-0.3628174915201452
455,-0.9685605795463552
456,0.8279415568717847
457,0.7707130172407012
458,0.8938674146987955
459,0.9195256249016617
460,0.0840922491510765
461,-0.38110249795082796
462,-0.8691161076070141
463,0.11492210470716502
464,0.7016464805777283
465,0.31969400914325835
466,0.3047308285368784
467,-0.07552867074026412
468,0.9195255921641161
469,0.15076657705314425
470,0.006528526860326889
471,0.24800331434104791
472,0.33273368799178316
473,0.7792107230042514
474,0.8938674146987954
475,0.01716285963046012
476,0.08622962607585888
477,0.07544408688215108
478,0.2848643854827765
479,0.04889933036990305
480,-0.28701028806215395
481,0.05302257273838918
482,0.8878154617819219
483,0.6641997901338876
484,-0.19608146310370372
485,0.4245130629677292
486,-0.3513850009263651
487,-0.2961674635775218
488,-0.4355981799534303
489,0.9999243346707374
490,-0.3865864250823894
491,0.9999901855900566
492,-0.25628133598691094
493,0.41803495690503706
494,0.9999904129135222
495,0.07594162799694448
496,0.7308867746441746
497,0.8737797242599726
498,-0.4297123488937251
499,0.9427618732824393
