,0
0,0.3996922513374611
1,-0.25139908531106153
2,-0.9171896076310214
3,0.05504208053242198
4,-0.8424652129182011
5,-0.018871292771821882
6,0.34955463872576853
7,0.37137543873908707
8,0.43437010511028684
9,0.13349044936450072
10,0.16163978211188867
11,0.47941071309945055
12,0.39197957924774096
13,-0.20024348391702554
14,0.3093415920704156
15,-0.6185085191033913
16,-0.44940835119346945
17,-0.7956002617825705
18,-0.04695480183973909
19,-0.9160829194497423
20,0.3385747889867078
21,-0.1614267340546567
22,-0.23812142515035956
23,-0.03420684717350383
24,0.06315127740081246
25,0.09816793045709887
26,0.8118094649326432
27,-0.7620883825572466
28,-0.045016301695719164
29,0.25931815334532476
30,0.844898542029675
31,0.18892853993279612
32,0.3011255149173719
33,0.8323741240568513
34,0.8057921795895582
35,-0.35055441768746015
36,-0.13792577385832988
37,0.3525249731934617
38,-0.07334576364305478
39,-0.1780886924550372
40,-0.33404776624089005
41,0.8323740248301139
42,-0.3588163011706617
43,0.1216316677822456
44,-0.12145100690420502
45,-0.5186289689719907
46,-0.0245050153979672
47,-0.9952225006529747
48,0.7577241852336585
49,0.10733639447773007
