,0
0,-0.9251301980864585
1,0.9251303347194741
2,-0.9969116329033765
3,-0.9969114228706552
4,0.9221104083884619
5,0.9220967447594388
6,0.9969527343692822
7,0.9999451881555722
8,-0.701723278482418
9,-0.9999861335545664
10,-0.9999997615804488
11,0.9251303347184945
12,0.9969117369839186
13,0.9999997969619496
14,0.9251301989693236
15,0.6299552116704866
16,0.6299553483035053
17,0.9251847686952314
18,-0.9220967775895114
19,0.9251711061711991
20,0.9999996588549511
21,0.9251846641889853
22,-0.9999997969619495
23,0.9221104409968955
24,-0.6299008010037329
25,-0.7017232793652863
26,-0.9999996234744429
27,-0.9251846312499639
28,-0.9970965211462949
29,-0.9999997613602989
30,-0.7047159314208478
31,-0.9251847695771072
32,-0.7043951814098399
33,0.9999860981745399
34,0.629900801003733
35,-0.989945692026693
36,0.9251847693569573
37,0.996952871885168
38,-0.9999859598454203
39,-0.7046767557754599
40,-0.7017961660998427
41,0.9221921408475402
42,0.6299009376357771
43,-0.6269084239949638
44,-0.6269627436602151
45,0.9221104412170459
46,-0.7047702045557104
47,-0.62690828647908
48,-0.996925297777
49,-0.9939593828218075
50,-0.7017234151164228
51,-0.9969252975558606
52,-0.9940115585634821
53,0.9999997615804486
54,0.9969527343682996
55,0.9969254003918034
56,-0.701718743429892
57,0.9220966066524449
58,0.9969254356638475
59,0.6269084239949605
60,0.9999996247272805
61,-0.7047703411887319
62,0.9999861335545652
63,0.7016936526691047
64,0.7047159323037127
65,-0.7017756019433524
66,-0.9999859956696953
67,-0.9969528363910082
68,-0.9999997971830937
69,-0.9999997971830911
70,-0.7047157696970908
71,0.9969501160746732
72,-0.7017234348013244
73,-0.9969252622838205
74,0.9969385008278543
75,0.9969116343696168
76,0.7017234409824997
77,0.925171000781603
78,-0.704676797679169
79,-0.6299009376357766
80,-0.9251709678420778
81,0.6987390112553954
82,-0.7046077501124863
83,0.7017778749601915
84,-0.9221104409959069
85,0.9969354248923034
86,0.999999627713842
87,0.6986893537795361
88,0.9220966068735839
89,0.9969388972060192
90,0.9999452265733574
91,-0.9968583816897852
92,0.9221377397013432
93,-0.9251848016342552
94,-0.999986098174541
95,-0.7046245680342342
96,0.9969252678159154
97,0.9999453267228184
98,0.922096606873584
99,-0.9939892958137843
100,-0.7046245677559683
101,-0.996911634148478
102,0.7016266146148463
103,-0.6269082864790799
104,0.9999994910808379
105,0.996952871885168
106,0.9220967449805775
107,0.7016959796792487
108,-0.993959404988403
109,0.9970071683459917
110,-0.997007133733746
111,-0.9221104412180342
112,-0.9251710007816033
113,0.9221104081673237
114,0.99999966032964
115,0.9969116341484785
116,-0.9941337157857126
117,-0.7046261323237252
118,0.7016960049670588
119,-0.9969116339831899
120,-0.9940111135465055
121,0.9999859649694999
122,-0.7047158223214192
123,0.7016808130541019
124,0.9251846650012349
125,-0.9221377405842086
126,0.925171106170211
127,0.996911604188709
128,-0.7047159323037091
129,-0.9999861335545657
130,0.6269628570888324
131,0.7047703403068464
132,-0.9939591204550403
133,-0.6269628794103703
134,-0.999999761360299
135,0.9251303676565663
136,-0.9251848025161353
137,-0.7017778740763403
138,0.9969936347890745
139,-0.9251303356023424
140,0.9221922783634235
141,-0.9939982001816987
142,0.9999861337766924
143,-0.9221104412170451
144,0.9251847695771082
145,0.9969252678159163
146,0.9969117722554766
147,-0.9999860979524131
148,-0.7047159323037121
149,0.7016957540055977
150,-0.9999997971840766
151,-0.9969117722554768
152,0.925184802517123
153,0.9221104081663354
154,0.6986445721717075
155,-0.9999996590760893
156,0.9251710010017522
157,0.6986363279749458
158,-0.7042985010211051
159,-0.9999997615814378
160,0.9969117369849068
161,-0.9969121270441332
162,-0.7046246338560245
163,0.9251846314701133
164,-0.9969117722564659
165,-0.9999860981735518
166,-0.9221102702804792
167,0.9999996594361044
168,-0.9969119081424497
169,0.6299553707315868
170,0.9999859600675474
171,0.999986133775705
172,-0.9969116341494664
173,0.9220966394815242
174,0.7015408046083839
175,0.7017777383271682
176,-0.9992474912262366
177,-0.9999859600675467
178,0.9251710007816034
179,0.9969117369849063
180,-0.6269082864790801
181,-0.7046290822090757
182,0.9251711391097399
183,-0.7046221847147748
184,0.9221104409968949
185,-0.7046931478248257
186,0.6986362122314315
187,-0.9221921745619005
188,-0.9999453623225332
189,-0.9999996232533046
190,0.6269628570888358
191,-0.7046669398543352
192,-0.7046243386803093
193,0.9969115986557858
194,0.9999997615814376
195,0.7016958432988987
196,-0.7017232793192281
197,0.9999450932858059
198,-0.7017778490911942
199,-0.7047702287645334
200,0.9969252622838206
201,0.9969117724776037
202,0.7017777133410406
203,-0.7017233035573903
204,-0.9940079976205134
205,-0.925184802294996
206,-0.9221102855397016
207,0.9221921548430377
208,0.6986349956863193
209,-0.9221102700603303
210,0.7047159323027269
211,0.9969254358839977
212,-0.7093376051149543
213,0.698636355903358
214,0.7017378720538489
215,-0.9221921736790386
216,-0.9999859954485562
217,-0.6269628579707185
218,-0.9221377397023262
219,0.6269627213376963
220,-0.9220966066524454
221,0.7016418479977024
222,0.9969934692194891
223,-0.9999996588559393
224,-0.9251846658841004
225,0.7017777133410374
226,0.9999860981735523
227,-0.9221921557258994
228,-0.9251711059490718
229,-0.9969117722554759
230,-0.704606313111064
231,0.9220967775885233
232,-0.9969117367627791
233,0.7016958869986176
234,0.7017232793652829
235,-0.9999997613602992
236,0.9999997971840761
237,0.9970073058628603
238,-0.701723358498948
239,0.6269627436602154
240,0.9969934780295873
241,0.9999450746371857
242,-0.9968608449723521
243,-0.9969115988769242
244,-0.701811816233351
245,-0.7017233043494726
246,0.7047157696980737
247,-0.7049020209086904
248,-0.9221104409968944
249,-0.7046766256681297
250,-0.9969115986567741
251,-0.7046262528217552
252,0.6299008010027536
253,-0.9969116341488291
254,0.9251846314701129
255,-0.7046223029993697
256,0.9999450635331931
257,0.9969343973652809
258,0.7017232784824179
259,0.9221102702814691
260,-0.9968594595309727
261,-0.7047703653975532
262,-0.999999797183088
263,0.626908445431698
264,-0.7017233043484928
265,-0.6299008001208676
266,-0.7046766003451522
267,0.9221922774805587
268,0.9251846592864783
269,-0.9251846658841004
270,0.9220966394825129
271,-0.922192278362441
272,-0.7017234409824968
273,-0.9251847695780958
274,0.9999997615814379
275,-0.9999996234744432
276,-0.9939624041298744
277,0.999985959846408
278,-0.9221104081673229
279,0.6269627204548311
280,0.9221103031110356
281,-0.9999996232523162
282,-0.7032014066318081
283,-0.999986097952414
284,-0.996952871001323
285,-0.9999997613593108
286,0.7017777374443023
287,0.999945084069754
288,0.7047703653975534
289,0.9221378443866866
290,0.9220967447604255
291,-0.9999996232533042
292,0.9999859598454203
293,-0.7046766299450774
294,-0.6299552349814249
295,0.7017234400986513
296,-0.9221101476548528
297,0.6299552349814286
298,0.7016947221832005
299,-0.9251709678420792
300,-0.9968679340039187
301,0.996925435883999
302,0.9969394763694368
303,0.9999997963002287
304,0.9251709680632167
305,0.701641339613882
306,0.9221920317965222
307,0.7016960106323312
308,0.7019036512597546
309,-0.7047702296483814
310,0.6299553716134662
311,0.6986903661403324
312,-0.626908445432681
313,0.9999450516952271
314,0.69863634953088
315,0.6269084239949636
316,0.9969115988769247
317,0.9220967775885228
318,0.9220967447594379
319,0.9970071683459888
320,-0.7037742224576695
321,-0.999999624065554
322,0.7016958540638653
323,-0.9940113846975663
324,0.6986379468550636
325,0.9999859600665582
326,0.6986849652272239
327,-0.9969115988769243
328,0.9999860981745404
329,-0.9251846644091362
330,0.9999450499885011
331,-0.7025591330504923
332,0.9969116341484784
333,-0.7017778499750391
334,0.9999450598490333
335,0.9999450889290373
336,0.7047159323037097
337,0.6986891691678837
338,0.9999452242197033
339,-0.9220967447604266
340,-0.9969115988769243
341,0.9969387485849267
342,-0.7017723759792669
343,0.925184664410125
344,0.9969254356638475
345,0.6986362660248292
346,0.6986902733064638
347,0.9999453276056798
348,-0.9251709958812105
349,0.9999453267218323
350,0.7017233043494727
351,-0.9969117367637683
352,-0.9940088024904644
353,-0.9221378763353496
354,-0.9969527352511649
355,0.7047703411897116
356,-0.9999860979534018
357,-0.7017234344109968
358,-0.925170845030564
359,-0.9969116341484784
360,0.6299008010037359
361,-0.9251846644091358
362,0.9999451900897964
363,0.999999623474444
364,0.7017234400996307
365,-0.6968078617747487
366,0.6986362339657484
367,0.7016355207128455
368,-0.9251848022949962
369,0.626962857971701
370,0.6986888106352285
371,-0.7046766945513967
372,0.6269082864790803
373,-0.9969115041691144
374,0.9970071328508814
375,-0.7017761646955171
376,0.9251846320622121
377,0.9220967449805775
378,0.9999997963002181
379,0.6299009367529114
380,0.925130334718491
381,-0.7047157696970905
382,0.7017778490911909
383,-0.999999761580449
384,-0.9939614953988616
385,0.9969389866232041
386,-0.6269084231130784
387,0.9999996588559397
388,-0.701723305509175
389,-0.9969130140980518
390,-0.9939592395485882
391,-0.9220966068745717
392,0.9251846644101241
393,-0.9968551956082872
394,0.9221102700603291
395,0.9251711391087512
396,0.6969209047356231
397,0.9251846312499633
398,-0.7047702296473984
399,-0.9939591052841177
400,-0.9969527029276232
401,-0.7017740134310455
402,0.7047159314208469
403,0.7047703662814018
404,0.9999997971840736
405,0.6986362087836604
406,-0.6299552125533519
407,-0.9969116343706045
408,-0.9251846641889865
409,0.9220966394815249
410,-0.9939592398650905
411,-0.9220966394825141
412,0.9999997606975806
413,0.7016396987608157
414,-0.9969252620636714
415,-0.7017233043494756
416,0.9251301980854755
417,0.996925400170664
418,-0.701723303465625
419,-0.9221102700603303
420,-0.7017754273061693
421,-0.9940114204184496
422,-0.9969117367637678
423,0.9999859956696951
424,-0.9999997971830883
425,-0.9969116041896974
426,0.62690830968154
427,-0.7117123498626625
428,0.9999860979524136
429,-0.9969115986557855
430,-0.9251301980854759
431,-0.7046244115492705
432,0.996925400169676
433,-0.9220966397026634
434,0.9969527343682961
435,-0.9999453623225363
436,0.9999997615814346
437,0.7016411583481323
438,-0.9251848022959852
439,-0.9969115990052261
440,-0.6299009376367596
441,0.922110303110047
442,-0.7046249947426036
443,0.626962721337699
444,0.6269627427773465
445,0.9969254003918029
446,-0.9969252815480362
447,-0.922110302888908
448,0.9999859598454197
449,0.7047158134965005
450,-0.7017312582459713
451,0.6986680974219471
452,-0.9251846644091358
453,-0.9940054507439655
454,0.9969390348850451
455,0.9969528710023025
456,0.9969252975558613
457,0.9251301989683379
458,-0.9221103028898959
459,-0.9999859598454202
460,0.9221103031110347
461,-0.7046767567956886
462,0.9999997971830887
463,0.9251848022959844
464,0.6986852145470176
465,0.9221104409968948
466,0.9220967775895117
467,0.9999997615804506
468,0.9999997962992351
469,-0.996859297327406
470,0.9969386483767331
471,0.7016959385252107
472,-0.9969252622848088
473,-0.9968593257243207
474,-0.9937800746507038
475,0.9251846314711027
476,-0.7017235161496015
477,-0.9939653420427719
478,0.9970072694829172
479,0.9999997971840772
480,-0.996911634369617
481,-0.70172076833503
482,-0.9939587618137379
483,0.7047703403058639
484,0.9251848022959849
485,0.9221921408465537
486,0.698636208703437
487,-0.9221377405842086
488,-0.997007270365782
489,-0.626908446315543
490,-0.9999453623225328
491,0.9999453276056836
492,0.6269628570888326
493,-0.9999997971840727
494,-0.996925400390814
495,0.7016502474734007
496,-0.7017234400996338
497,-0.9999996590770779
498,-0.9968598788879115
499,0.9969117369839183
