,0
0,-0.013158728838271063
1,0.008345826087579536
2,-0.22294166256998496
3,-0.08168327353516082
4,-0.23772412166304796
5,-0.025984015108160643
6,-0.16137947012072004
7,0.03886370422358218
8,0.08153366855427775
9,-0.09203705282020547
10,-0.1555686473896441
11,0.04885610522310784
12,0.13468418055933237
13,0.014227577519113847
14,-0.01742999382700351
15,-0.14067773573216943
16,0.3019160245940468
17,-0.12546656459315977
18,0.024476111093062913
19,-0.31080757437655576
20,0.050640990116122275
21,-0.001129210526068032
22,-0.05722937975859885
23,-0.09183032552425356
24,-0.12780706803309028
25,-0.2083426089176926
26,-0.20973608071367777
27,0.17834259562234306
28,-0.10542671070671675
29,0.4020735061007908
30,0.1577321693645683
31,-0.5824316929097656
32,-0.07549394891559358
33,-0.11817245515713344
34,-0.11169069319524297
35,-0.07733499312099439
36,-0.18348586811450002
37,-0.06626162625170501
38,-0.025336307712618654
39,-0.02796676371343135
40,-0.1041460222103203
41,0.07962852258101982
42,0.26242543058987905
43,-0.02577811599340178
44,0.21840269827439301
45,0.032923878939741295
46,-0.2730493334294507
47,-0.1411467457493784
48,0.030221731162284715
49,0.03072530065803462
50,-0.10152857248327413
51,0.09293668229169462
52,0.1201767635152202
53,-0.25648224791226193
54,0.04123301522257129
55,-0.07783334176402337
56,0.24578036766333486
57,0.024050430090788704
58,-0.12986945847271125
59,0.9991327278441863
60,-0.12730017942918845
61,0.12677560000834798
62,-0.12793303822731214
63,-0.05928699600867252
64,-0.06266758429645947
65,-0.0654549414447832
66,-0.038763435011329325
67,0.025422362193094506
68,-0.07851436379291207
69,0.2008523810984361
70,-0.039556951738630046
71,0.12672953059671216
72,0.24942040266758092
73,0.06638895210728837
74,-0.5758775899703564
75,0.07665104752659341
76,0.0283755054003308
77,0.018477650721771717
78,-0.22029856671737308
79,-0.08399655394439556
80,-0.08843448094376971
81,0.14491338882928503
82,-0.023715244949248537
83,0.007476899679673129
84,0.9937001327906093
85,0.0590217161017458
86,-0.013015428951046824
87,-0.10512399876602077
88,0.058029136412870885
89,-0.16835686125910013
90,-0.12163976820497097
91,-0.3048990871190663
92,-0.048323867969597714
93,0.5195546599929729
94,0.2319629445895472
95,-0.03127582517997317
96,-0.01779747123550688
97,-0.09477362650046764
98,0.12863047157056165
99,-0.06309968913414736
100,0.05792766058604192
101,-0.01989380320994401
102,-0.021592186595035336
103,-0.04332809894037545
104,-0.05698603264970069
105,0.06601751912199974
106,0.032948519248354076
107,-0.23138406888267213
108,0.003695731479003329
109,-0.17081780021143625
110,-0.042944517699772845
111,-0.06242922332549852
112,-0.2382421869455987
113,0.008736025359644108
114,0.023518985196740276
115,-0.07802210263111055
116,-0.06681158067053798
117,-0.011508403107225739
118,0.13363606745941858
119,-0.0934382421174471
120,-0.3877523539482558
121,-0.01654513054129744
122,0.0797653521697138
123,-0.22313358485616006
124,-0.6503864370855152
125,0.16356269264006715
126,-0.03832697210365318
127,-0.24331962008044442
128,-0.1756244174343517
129,-0.14159322667046711
130,0.960914197844488
131,0.02214107133651642
132,0.052706970513527435
133,-0.06938488173100729
134,-0.0345264442367045
135,0.0008981935619610241
136,-0.10425908552708378
137,-0.03311244023481043
138,-0.021503555433842778
139,0.10312289981252053
140,0.11934563743902668
141,-0.050777298402773174
142,-0.3786073933817325
143,-0.04017173876558089
144,-0.09677704156942035
145,0.05511152310305961
146,-0.05920469255402228
147,-0.15476469574901863
148,0.12358382064671791
149,-0.5930800827603943
150,0.8128857847273973
151,0.05045795164278272
152,0.07911246501538136
153,-0.2026306840257225
154,-0.021127669020478208
155,-0.002378837816316849
156,-0.009606188813196118
157,-0.07383894350032837
158,0.05697524475973286
159,-0.021258797290603534
160,0.16217915160724689
161,-0.2559980507278901
162,-0.012577952544533432
163,-0.08194127145546018
164,-0.11668847715551264
165,0.01850085012561891
166,-0.026628122305894612
167,-0.04674211505183281
168,-0.1628100182181054
169,-0.11647286652383199
170,-0.05437995938273469
171,0.19158770646744908
172,-0.09118572579970115
173,0.07226389197427156
174,-0.013578636465160209
175,0.02319288314381964
176,-0.06818205771210373
177,0.008709366764135596
178,0.16219482540899158
179,-0.06356024653296509
180,0.2607457993959491
181,-0.25036329013777797
182,-0.00530083847388328
183,0.10516884679482595
184,0.05212141694995498
185,-0.13498463725249357
186,-0.02357883837900216
187,0.5152391506687651
188,-0.025234411101305653
189,-0.13969385926333994
190,-0.6880489158586065
191,-0.039482663865649005
192,-0.003234901224015225
193,0.2403126256056563
194,-0.3290459463438786
195,0.00585182604664481
196,0.06802815337836488
197,0.9929445977315368
198,-0.05581486683972599
199,0.19444714473937805
200,0.06263938797051717
201,5.97182399967415e-05
202,-0.01267145543513719
203,-0.02067562159449794
204,0.9610612411948458
205,0.014414797390672482
206,-0.17744481788647953
207,-0.01740978041234034
208,-0.009179458486030027
209,-0.215901755796893
210,-0.15103232534780522
211,-0.2165899887728279
212,0.1671730577995565
213,0.2851986093849663
214,-0.11845433503990405
215,-0.02634060118623796
216,-0.0022392917082882523
217,-0.04674567715925772
218,0.2679066246825784
219,-0.3043117021420667
220,0.11069438842702513
221,-0.18781800113910116
222,0.3436469190868969
223,0.1982081304780666
224,-0.0023827235781103155
225,0.05801615345443702
226,0.3617731797462709
227,0.14349953833426693
228,-0.02475096656635429
229,0.08705713609042214
230,-0.06243453386580003
231,0.18089160336326404
232,0.019039307645757945
233,-0.034159482904330477
234,0.08007688050177193
235,0.02984153427570045
236,-0.6148620020402218
237,0.273647133055366
238,-0.060104988417970975
239,-0.05233320794007621
240,0.04277274871664893
241,0.12201946141003812
242,-0.061909744313132536
243,-0.08890277473019358
244,-0.14359006866791954
245,-0.06285190722218548
246,-0.030906809156274764
247,0.04980425264813607
248,-0.14782924523144025
249,0.1036126693706194
250,-0.026163206258270337
251,0.036519087303704886
252,0.029652210185155948
253,0.029466179679081217
254,-0.30520750012332687
255,0.2941975831186924
256,-0.22031693690429752
257,0.14327088261637133
258,-0.0013896840380785368
259,-0.08282894940353923
260,0.3794231961486094
261,0.2549317227251589
262,0.339432290702196
263,0.013437654109387577
264,-0.17870758316828986
265,-0.015552157989447767
266,0.23482230206080965
267,-0.21800674232288988
268,-0.38399586818434933
269,-0.06583154253794665
270,-0.02215304927292817
271,0.00941862729662238
272,0.008553544310638574
273,-0.08602020990179611
274,-0.12717677546266445
275,-0.023199625076728174
276,0.07159673339380926
277,-0.035459474593886924
278,-0.11420171240353631
279,-0.22000273974786172
280,-0.09179281821198633
281,0.015152397610989153
282,-0.12478872310791236
283,-0.03282885018608878
284,0.10203354258995999
285,-0.007969860731650132
286,-0.23369260404939737
287,-0.11588297961852448
288,-0.13470452266273963
289,0.008580560284760279
290,-0.23333065659634536
291,-0.14236972217122656
292,-0.043013545306453196
293,-0.19102302557955753
294,-0.011651623368312379
295,0.40731973845304387
296,-0.0011820996493343092
297,-0.0496833385365775
298,-0.007486526535539937
299,0.026690710608413912
300,0.005022825285325663
301,0.01897168157225978
302,-0.004883716024010016
303,-0.024932797062165026
304,-0.09007404412902636
305,-0.08189270233676704
306,-0.027016154425663824
307,0.06428982890054781
308,-0.14352015344159927
309,-0.15063833737731142
310,0.01772258525864712
311,0.25406332607682136
312,0.17375472044603676
313,0.26056907189863004
314,0.05334323961521541
315,0.073369245719329
316,-0.10875759094086292
317,0.09458650215362131
318,0.0323338703863248
319,0.060578321415698896
320,-0.1460976459685909
321,0.4133266371462218
322,0.026063627907104925
323,-0.32248352406032543
324,-0.11768358690648412
325,-0.06603800256372701
326,-0.02729810961169071
327,-0.12960164683851572
328,-0.1676902822871288
329,0.20284156998503108
330,0.027455004724394882
331,0.010459405388257778
332,-0.1977354725727485
333,-0.028422156178815036
334,0.09836251825989985
335,-0.05100935243268851
336,0.0688940975329506
337,0.0710077554276853
338,-0.09921881493758915
339,-0.08602765016167586
340,-0.15027039621048213
341,-0.1677384420697811
342,0.13560780666559577
343,0.1514659601826582
344,0.22973904064829911
345,-0.01601103634734235
346,0.10800955313517419
347,-0.02987821502775248
348,-0.10321909120631326
349,-0.15742688641013672
350,0.05349065804590946
351,-0.07834861485377552
352,-0.18608115191180918
353,-0.007080857038735288
354,-0.05561962956074681
355,0.28900403017639426
356,0.07444453065806565
357,-0.02179342531000538
358,0.13557584306224138
359,0.003224426548084216
360,0.013941142743578529
361,0.19577980234565165
362,-0.09941036234043675
363,-0.25657762032808545
364,0.194843561796848
365,-0.00979423567340079
366,-0.03967246216472612
367,-0.28339369717200213
368,-0.049236033450131035
369,-0.04135717498758137
370,-0.03228234515780279
371,-0.08632674632266088
372,0.10460421495086902
373,-0.06486895381972081
374,-0.007899386351528863
375,0.09774654978092896
376,-0.06424263119942783
377,-0.13288175113281403
378,0.012535966058085261
379,0.269895912267766
380,0.015018714153498987
381,-0.08887534774493884
382,-0.020711974050277367
383,-0.02792477712240111
384,-0.14987770693341956
385,-0.0923665872133471
386,-0.039587096497900195
387,-0.05619185346950294
388,-0.26784557867688563
389,-0.012910561312810933
390,-0.10959106122896416
391,-0.1725045726812367
392,0.05338168635623694
393,-0.11908103072988803
394,0.025570948687813334
395,-0.6061084573638642
396,0.010807114771928724
397,0.023573425467885604
398,-0.12406045783207141
399,-0.07107534926770809
400,0.8475766471747178
401,-0.07334540170117336
402,-0.056292691588769955
403,-0.22690334029017012
404,0.031043352549464623
405,-0.02022425877517421
406,-0.1217743435186511
407,0.11076009869711818
408,-0.17353864645777287
409,0.3591648337928615
410,0.045800952590232924
411,-0.019784005520515853
412,-0.04319931435080356
413,0.5139074660125267
414,-0.029035382271045886
415,-0.0049888497532122825
416,0.05536434153856974
417,-0.03867070766121643
418,0.12014944075651153
419,-0.0454873730535155
420,-0.1183944062615653
421,0.11064582508238702
422,0.2557466493318518
423,0.16202944773708225
424,0.007245980483064276
425,0.052917821254059354
426,-0.06150074588455157
427,-0.0024055658404791838
428,0.08436175989165849
429,0.28600249238085174
430,-0.0002088634757725352
431,0.2612379710381221
432,-0.0766442501571872
433,0.11589030349382165
434,-0.03382877497260082
435,-0.6744569538830697
436,0.06475077024524721
437,-0.029836806109565513
438,-0.002464891886773866
439,-0.11079125358927056
440,-0.08470388155585375
441,0.214297887685304
442,-0.010154305915012356
443,0.082468437851395
444,-0.02026168376614623
445,-0.006345115888535157
446,-0.11507005561537116
447,0.9999925766513718
448,-0.005293404197406671
449,0.025048859191751767
450,0.07342178149686215
451,0.03372030310897742
452,0.03157875026023466
453,0.010967517973566487
454,-0.09627592048247366
455,0.042572107894912725
456,-0.18587152656364858
457,0.03616635459264286
458,0.19273004958021672
459,-0.09715867332703346
460,0.006270823448215679
461,-0.11453061682567749
462,0.07791935247281238
463,-0.019654061728308133
464,-0.07046040026118376
465,0.20770650939944188
466,0.09893705850250828
467,-0.11514379867469945
468,0.2878389074526689
469,-0.009444172462404648
470,-0.1268282167798842
471,-0.1350287601117179
472,-0.1486749374853724
473,0.007181209899451901
474,-0.05854962337025434
475,-0.1023796372161368
476,0.04397036981804981
477,0.023076409238909502
478,0.09963411569497405
479,-0.1057354844283126
480,0.37305011778208436
481,-0.12499673379606666
482,0.07637404655599134
483,-0.19734284666061522
484,0.9928723259099341
485,-0.03655082306143141
486,-0.027281427343006908
487,0.8436066870524767
488,-0.2811609462514693
489,-0.05855557416904599
490,0.3626603645251057
491,-0.0026187232513430266
492,-0.26938603221720553
493,0.0699693913676223
494,-0.13769098100990698
495,0.02224796958649931
496,-0.11148055273872826
497,-0.048773011779800014
498,0.206483470618317
499,-0.08679465042693796
