,0
0,0.1287204587931873
1,-0.21676978720447876
2,-0.9855823405282133
3,-0.09254128097447752
4,-0.19959301307534735
5,0.4476040378407324
6,-0.6098200512526571
7,-0.7823816539083075
8,0.09691929183427815
9,0.5625348918942417
10,-0.9432772260613891
11,-0.10083941100561207
12,-0.7402783060249812
13,-0.21725609494181
14,0.22135591085439194
15,-0.998058264151353
16,0.5077362233534244
17,0.32157170431684057
18,-0.2846853504084746
19,-0.7212199325836945
20,0.17571218912518227
21,-0.31772345838741045
22,0.1405023091020902
23,-0.7267680547189092
24,-0.2179595568642865
25,0.21678745113156536
26,0.3610876831355102
27,-0.5058124078586866
28,0.9996062654778727
29,0.5314030217268599
30,0.1496106465762898
31,-0.2569551842044229
32,-0.6101959190177638
33,-0.7776542703792736
34,0.027448638688405184
35,0.9055993853689481
36,0.5762402647199547
37,-0.17182663564972023
38,-0.258601740630539
39,0.10355287631252935
40,-0.46288143984018626
41,0.2416440114048716
42,-0.34494858150095536
43,0.28468535040847476
44,-0.07089723567870224
45,0.6009473617371829
46,0.09808938072706755
47,0.9999997615814373
48,0.5017231749525787
49,0.6098377368915806
50,-0.1162077384381064
51,-0.3743843068837766
52,0.142691751329781
53,0.9538691372883841
54,-0.018155873387858033
55,0.5185020914421274
56,0.6764865823105385
57,-0.9728258707481157
58,-0.6243572450041388
59,0.12089026610636541
60,-0.5329686513918376
61,0.28407741401665965
62,0.31010486038903295
63,0.0980893807270676
64,-0.5765039846384524
65,0.8382784792936222
66,-0.1653460989083286
67,-0.5530975018411781
68,0.8063751771890264
69,-0.500308031023847
70,0.2623430695963707
71,-0.22568069069622018
72,-0.20201646163356232
73,0.1754483408555106
74,-0.2637143395925621
75,0.15428664132554606
76,-0.15319715215648744
77,0.8959567723250329
78,0.5787057985564209
79,-0.07091490213054684
80,-0.2435501809807827
81,-0.4817977097911742
82,-0.5605879158379191
83,0.5524957692175733
84,0.17034092218728833
85,0.1644767971135884
86,0.9728258361129395
87,0.2940323931529102
88,0.8555165532932467
89,-0.8234090624964779
90,-0.144597920973557
91,-0.9485441032030634
92,-0.09254128426919195
93,-0.6383987987921724
94,-0.2825223196840193
95,-0.14983389352338417
96,-0.07920612940528757
97,-0.29247335511011524
98,-0.23893054978471032
99,0.1274302388806614
100,0.11385585896065958
101,-0.655471519411583
102,-0.4522492734663378
103,0.5625172950265537
104,-0.11620773430080346
105,0.5020990427310675
106,0.5057946656279046
107,-0.08595179302768467
108,-0.5920780369443065
109,0.26369667566547517
110,0.2404608196178858
111,-0.27170567838401993
112,-0.27377380989547806
113,0.4096842434746319
114,0.40953807301241474
115,0.03303814547840553
116,0.16319429268600724
117,-0.1500593702045546
118,0.31932936362023134
119,0.5830573214034395
120,-0.22450014297619622
121,0.042148712425864834
122,0.538832832726032
123,0.12175583489598239
124,0.12403142645512585
125,-0.03824768809288427
126,-0.274413323994627
127,-0.19733894236589417
128,0.5076471391889429
129,-0.19561016386278413
130,-0.9984341674633586
131,0.3504966779588308
132,-0.31500458711254326
133,-0.550441323983117
134,0.11634111364476343
135,0.39654986041466733
136,0.27455921645407994
137,0.5444441371701851
138,0.8180719642996939
139,0.11516209724640258
140,0.6991706706883997
141,0.18518845031349557
142,0.00427753881458923
143,-0.8218610967034753
144,-0.9523034736631406
145,0.10505898205506033
146,0.18645863001538343
147,0.6548955670397888
148,-0.6812363344911251
149,0.4132467273738138
150,0.5920780369443068
151,0.12175583489598223
152,-0.14623600286219332
153,-0.009027889525327744
154,-0.15047976108676947
155,0.17572985305226876
156,0.5753811846978372
157,0.2641366271844306
158,-0.895974317101173
159,-0.03555497887636072
160,-0.28010730293939357
161,-0.010658570239931556
162,-0.1097985834418881
163,-0.17145076176713
164,-0.017162305526830884
165,0.27713635894138244
166,-0.3199693974300303
167,-0.3668045565202774
168,-0.24344494204663555
169,-0.8600676587742945
170,-0.09808937723482616
171,-0.2621663831884881
172,-0.2183177529423697
173,-0.40173451127570947
174,0.18289613650647538
175,0.6527680701557965
176,-0.4789493700494438
177,-0.038586243112526585
178,-0.11798842721113362
179,-0.82225462840968
180,-0.39295369309993217
181,-0.3232981610528151
182,0.9940757975559822
183,0.1288029645912726
184,0.8031885470585381
185,0.40839042650593627
186,0.29685664692101066
187,0.5125781089566257
188,-0.42782436915454936
189,0.40723600695891876
190,-0.14267408232249001
191,0.5767819649849298
192,-0.28250760787545637
193,0.09846725757216883
194,0.4336228699824713
195,0.05416131973264063
196,-0.3630115167070017
197,-0.26909702336008734
198,0.10875494147961468
199,0.1729987336642337
200,0.11107470996763288
201,-0.21748946789939205
202,-0.17596751250009854
203,-0.2657371589607221
204,-0.15087329815045195
205,0.5694572206723821
206,0.9526970053553342
207,-0.5199676813954944
208,0.43835028136636267
209,-0.16155416740733947
210,0.1741642295879988
211,0.8300603074518617
212,0.3863377622453328
213,0.985206507839065
214,-0.09612966713958533
215,-0.5073603736516896
216,-0.5300266967333087
217,-0.12213170267447082
218,-0.19674341842151508
219,0.928636675289705
220,0.09913501428922683
221,-0.45711170711896904
222,0.9289948791277259
223,0.13033327104228648
224,0.32487747144707724
225,-0.5303327009674987
226,0.11584315576124858
227,0.1644767971135888
228,0.27834221624722366
229,-0.10474263825475874
230,-0.03697648374647805
231,0.9526793414282477
232,0.261000887264723
233,0.9732194024543201
234,-0.6102135829448506
235,0.5767819649849296
236,0.08165281196595929
237,0.009306947453114459
238,-0.2521838139170091
239,-0.8095378077935108
240,0.3941257911144464
241,0.4130310798095372
242,0.293993421529572
243,0.014354533025390422
244,-0.27504033183774734
245,-0.13462710866498395
246,-0.8346786881233389
247,-0.14621833893447708
248,0.094581697979224
249,-0.9684919565895498
250,0.096936959212577
251,-0.023601102790672217
252,-0.13193977912754173
253,0.6949719024263
254,0.01027877762992679
255,0.7896782962334672
256,0.1425290840633507
257,-0.9538514733606684
258,-0.07466682205049797
259,0.6328506798031378
260,0.09459936527429835
261,-0.09846725757216901
262,-0.3006266761953786
263,-0.7036159351596615
264,0.80120294850964
265,-0.26250328046477106
266,-0.28389030259785236
267,-0.09913501781869617
268,-0.1348167165436686
269,-0.8741092120624118
270,-0.40968424347463156
271,0.060276278291775454
272,0.564065260764445
273,-0.24980789400717068
274,0.15428663583253305
275,0.8911819638024251
276,0.14778394577647214
277,0.5609637636446129
278,0.005272764641909539
279,-0.26138258684282556
280,0.09808316300782682
281,0.12524083368824854
282,-0.18289616734046554
283,0.28621565227376194
284,0.29857255619921785
285,-0.5614469753749431
286,0.8116820329843354
287,-0.560963783616408
288,0.2769584900726353
289,-0.29361755376446497
290,0.06392846022332063
291,-0.31932937498920216
292,0.1402450875375119
293,-0.38632011207226424
294,0.38263331772790493
295,-0.4757820258563299
296,-0.2939934215295719
297,-0.7215958003488019
298,-0.024544688450636898
299,0.13033326640207696
300,-0.7842878514069417
301,0.8744851109615033
302,0.4620438071102896
303,0.9481682354379566
304,-0.16613181315976505
305,-0.2598287892502095
306,0.21407399713300504
307,-0.8955986003726939
308,0.12569597575402724
309,-0.1546625091040346
310,0.3161754813377236
311,0.7776719066198102
312,-0.1625547815375789
313,-0.9274644539782648
314,0.03660061466491076
315,-0.06026208712947534
316,-0.28186275134965805
317,0.7780477743849168
318,0.15047976108676922
319,0.18830705288692534
320,-0.2625245776926914
321,0.2704206908495113
322,0.14778396339369487
323,0.12561227495651459
324,0.20656261415520485
325,0.16611725085091708
326,0.24164402000803822
327,-0.141526250367307
328,-0.3138342959201793
329,0.1625547757501984
330,-0.27713634907459433
331,-0.4905613375069674
332,0.19404491681499944
333,-0.3906259102965284
334,0.5628931627916609
335,0.5388505158376228
336,-0.3289003490932871
337,0.4639585780816058
338,0.2010145250515055
339,0.06899106855905535
340,-0.7508915128435066
341,0.6727061452128059
342,-0.08471759323600295
343,0.35087253324532824
344,-0.5735081868824008
345,-0.9681160888244436
346,-0.3498015730412069
347,0.30945649065466785
348,-0.005028497619693251
349,-0.11472819266391669
350,-0.32275505526290194
351,-0.29131893143614296
352,0.3392948809338043
353,-0.578347594705648
354,-0.2750579859726705
355,0.6808603855611184
356,0.8959744681511819
357,-0.9523035075676655
358,0.2322233527376799
359,-0.286233316201477
360,0.985206472763106
361,0.08329608841649463
362,-0.13493666144729877
363,-0.5845875454729981
364,-0.5462488155369631
365,-0.1166696900940009
366,-0.5466997573311331
367,-0.14932532704107207
368,0.7232055854055711
369,-0.8095379154497182
370,0.22098003520842882
371,0.1236555542741716
372,0.784287729989816
373,0.12365555427417128
374,0.1392537045831583
375,-0.3910297458277278
376,0.7970221994729255
377,-0.0708972356787023
378,0.2543194911694811
379,-0.8487202716281443
380,0.16355606005466009
381,0.14013691678858353
382,-0.9270887425586273
383,0.2640725434305823
384,-0.24009812029757366
385,-0.6102135829448503
386,0.2750403220455838
387,-0.752815373148724
388,-0.5392020260761461
389,-0.3134584393150221
390,-0.8172301003466558
391,-0.7837543322080112
392,0.46511301216840445
393,-0.19735000607988165
394,-0.6102135829448504
395,0.46619832438097375
396,0.0351791098454025
397,0.3449485692198731
398,-0.0525496156414421
399,0.6234864566699622
400,-0.25333072646610566
401,0.208849599294087
402,0.07007638529845985
403,0.7972645830330827
404,0.5554156871585326
405,0.6243572450041386
406,0.9665680078626429
407,-0.4398982471593656
408,-0.1681028779954542
409,0.30583358857707604
410,0.8281364738803705
411,0.1644767912577797
412,-0.20656261415520444
413,0.2952044806573627
414,-0.5388261391140202
415,-0.5181262236636389
416,0.19850211245163984
417,-0.27180648628397563
418,0.2664729582246665
419,0.44027409926293065
420,-0.24709443238700987
421,-0.27692071137710583
422,0.1755130786485839
423,-0.27768936042354797
424,-0.486718899097121
425,0.18160069985922492
426,-0.3688167915015594
427,0.31110968781516884
428,-0.3793900827027857
429,-0.38786807786526684
430,0.07208039548805864
431,-0.32306084770840277
432,0.5181262052169736
433,0.6549883276530482
434,0.680554505602617
435,0.6690298576218474
436,-0.4913026805384737
437,-0.5952170846591426
438,0.5355748120615378
439,0.15459262118547526
440,-0.047145337665646686
441,-0.1151620972464025
442,0.2835144449266099
443,-0.6188091485462635
444,-0.14942039269023388
445,-0.34765470058235903
446,0.034320051560847796
447,0.12365555427417117
448,-0.09691929183427817
449,0.44452122199547095
450,0.21794188517726282
451,-0.752797682419418
452,-0.1009069869741112
453,-0.6064954795903753
454,0.11781752204918436
455,-0.7970045355452102
456,0.953869137288384
457,0.41782791818591286
458,0.28389030259785225
459,-0.5771754966911338
460,-0.4445211470547919
461,-0.5337964982222332
462,0.5077185775024626
463,0.35936600306747846
464,0.09614732764420177
465,-0.22314295996783154
466,-5.825465695630423e-05
467,-0.7752608751802423
468,-0.037063294458181975
469,-0.20139038565996292
470,-0.39412572466980167
471,-0.3204192561764624
472,-0.8234267264241936
473,-0.26947288154462806
474,0.186082762250276
475,-0.3986384857848421
476,0.12935401696047671
477,0.7843054874113056
478,-0.09917952966860388
479,-0.26354891751917237
480,-0.8238025942026822
481,-0.4402564510101391
482,-0.2308529274104374
483,0.12317236253283921
484,-0.5025433881542763
485,0.8585358116583126
486,-0.24899302963969988
487,0.23252477536745136
488,0.19026137026800088
489,-0.02981085376175371
490,0.333799825117909
491,-0.23928872180097235
492,-0.12608950746023162
493,0.0954332243963637
494,-0.5753812051829309
495,0.9290125761301183
496,0.8222545991352389
497,0.3614812019720266
498,-0.4336405184714358
499,-0.3180993261658997
