,0
0,0.08054408654194711
1,-0.006918728533786266
2,-0.003548486123834668
3,-0.012018700627121928
4,0.010345040913462621
5,0.020016879991537437
6,0.03309461323603755
7,-7.454504147971427e-05
8,-0.0031407905848473815
9,0.04585300778315812
10,-0.0044499624330813226
11,-0.04383833942171879
12,0.004023501786795535
13,0.005213698019546303
14,-0.022599488793524677
15,0.05009963026681574
16,-0.02459111362452665
17,-0.02335005395083356
18,0.021594709908929356
19,0.009924146891323274
20,0.02472342595626001
21,-0.026061497075122744
22,0.031163018006599173
23,0.04251264055656379
24,0.029921529047130687
25,-0.01095734734890038
26,0.032097773259681564
27,0.013235512424083941
28,0.005354874126323279
29,-0.03245413558038795
30,0.002958300696737255
31,0.03383152618144697
32,0.023351057933990067
33,-0.0318532406875553
34,-0.026243804262941726
35,-0.0003014412271520432
36,-0.015600782172476728
37,0.003945000537299055
38,0.018400648226094878
39,0.01495354801178177
40,-0.017534285011951787
41,0.04384006220130938
42,-0.031632569123003065
43,0.004531105146527906
44,0.014269597582530233
45,0.019309045331692015
46,-0.01557284104574494
47,0.021197404243863488
48,0.0654613303928866
49,0.03972660681858945
50,0.004587602210081456
51,-0.03776893422094067
52,0.042325415263078106
53,-0.014907747711421702
54,-0.054539324758932174
55,0.011775845167761723
56,-0.006238213369040194
57,0.010849017492100457
58,0.021985441803453343
59,0.014198485909142897
60,-0.06430014077689747
61,-0.035156801644446664
62,-0.023042830536183258
63,0.009972820885894549
64,-0.06822444656222554
65,-0.024261526508938265
66,-0.020130557625536734
67,0.0038468048759015537
68,0.024640871644056365
69,0.047647949099511776
70,-0.05632294732131188
71,-0.03571234856824373
72,-0.0329762903539095
73,0.01985865822037295
74,-0.036671355585798704
75,0.017190383821010537
76,0.00995912267630503
77,-0.04085136721819025
78,0.04433830075818435
79,-0.017139845497362555
80,-0.044222781931158334
81,0.03939220485754842
82,0.00471456633576609
83,0.0014575806637668783
84,0.011647926999598185
85,-0.0052608435630385735
86,-0.0035821728749888693
87,0.0022965368929299887
88,-0.008743387819176295
89,0.03874745628434452
90,0.01181679230786428
91,-0.015558521495208859
92,0.052822546015936715
93,0.004270620319944466
94,0.011352290569258228
95,-0.01845970272238276
96,-0.037994708377478814
97,-0.002862247419333868
98,0.011189818285359025
99,-0.00014424011424302857
100,0.021583299072192846
101,0.027252718979294894
102,-0.01184197421803973
103,-0.043085149864480074
104,0.020526874219414272
105,0.021753362338237207
106,0.028578721376516895
107,-0.015630644739521013
108,-0.03314618543357604
109,-0.002198932850543296
110,0.005545924260989362
111,-0.06455613331452054
112,0.0036010612458711212
113,-0.03278568718243067
114,0.047139075818951104
115,-0.03428023850154057
116,-0.003549164831885883
117,-0.04995472152405351
118,-0.01595087091354567
119,0.0020892723374970968
120,-0.0074087204879400214
121,0.0014753456302495152
122,-0.003755995311354451
123,-0.012821115135129204
124,0.0066306955053090574
125,0.05423354424033289
126,-0.013671281282648023
127,0.03063681880036827
128,-0.00579771463691885
129,0.03822675137838442
130,-0.007750304407420359
131,-0.0017359007670503107
132,-0.049997533280225485
133,0.00498580647079679
134,-0.02026565134836735
135,0.00934930400278378
136,-0.03254765329350801
137,-0.0254317410155934
138,-0.0008800071447275168
139,0.03918821333931825
140,0.0014962399831434017
141,0.025420359526772175
142,-0.05751965488109464
143,0.00041618780010541784
144,0.02159869777500524
145,-0.034563843723914606
146,-0.0541299323864713
147,0.01774447543800151
148,0.02084010466944879
149,0.009867346858249287
150,0.011917944876507764
151,0.0745809545363478
152,-0.0016702278969027429
153,0.02360114586881476
154,-0.007640335975942755
155,0.0088152459152098
156,0.0018876279127302224
157,0.022083352066107023
158,-0.022824871353328863
159,0.017396078418118553
160,0.0006893668839561768
161,-0.0027638284897849065
162,-0.07066606325458827
163,0.0759883275374057
164,-0.08517691833997654
165,0.06260747521669631
166,0.010935669237367688
167,-0.02201948668872069
168,-0.0005955008608484157
169,-0.04470862443269592
170,-0.006907655494188517
171,-0.02800739889186174
172,0.007717947011177108
173,0.029285635900605445
174,0.06751683338061291
175,0.0034351930059852813
176,-0.04666132692515386
177,0.011550798575574554
178,0.02390788415816575
179,-0.03416202249713268
180,-0.007963901036798376
181,-0.006956541007314972
182,-0.037862363933049634
183,0.022586065237272177
184,0.043097431788804916
185,0.03374595997633803
186,0.01167095621796118
187,0.03568129914626551
188,-0.04964594531549235
189,0.001959141595542776
190,-0.0157697418998677
191,0.03229918125286153
192,-0.0009999690009992405
193,-0.0402369284030093
194,0.05390262061716098
195,-0.01940887994066783
196,0.021313457080204823
197,-0.004268915026991767
198,0.05352383000552466
199,-0.028669394762923014
200,0.0027849894067104274
201,0.012597458090801532
202,0.014193456435649818
203,-0.062494429887621064
204,0.06337365404167919
205,-0.047001438397237735
206,-0.056177286614311775
207,0.03594407494954341
208,0.030278619657169353
209,-0.0405593418039842
210,0.05544198396200524
211,-0.0012129685701773394
212,0.033483056054241664
213,-0.01757437766726848
214,-0.009209822981713675
215,-0.030297773679277856
216,0.03371237569061877
217,0.0011790285485566484
218,-0.017272565216396273
219,-0.012085856155829158
220,-0.02367728648925422
221,-0.026407686240464523
222,-0.056373338481640334
223,-0.01632376813898546
224,-0.0010864494309544212
225,0.03448706541265958
226,-0.03834901018692114
227,0.023616106937631377
228,0.024244891319123628
229,-0.01828777628615567
230,0.01798047194607491
231,-0.012481358139403516
232,-0.005042095584087417
233,0.01057539446913609
234,0.007954762973501527
235,0.02000480546642476
236,0.0009167602277113784
237,0.002000706213992145
238,0.01595773185640556
239,0.03525339790263553
240,-0.0037287070453291323
241,0.08920188993974673
242,0.04945403183037386
243,-0.011734466942118197
244,-0.053457319150154586
245,-0.022723044373383516
246,-0.026680319402739287
247,-0.051294916910498714
248,-0.00780627329575884
249,0.01017259524800962
250,0.007920286947692649
251,-0.010627456910985341
252,-0.004339527802214801
253,-0.04385842092072699
254,-0.030521487207289356
255,-0.03374234976784622
256,-0.00018021101380357243
257,-0.035072907871740694
258,-0.01463992698937044
259,0.050982381769358154
260,-0.024144075441122046
261,-0.05440690580921835
262,0.04074830918708986
263,0.004582334460031801
264,0.022338041387243487
265,0.0713940716966479
266,0.005370152558209284
267,0.010854967752558953
268,-0.05471593520488616
269,-0.027678296210676575
270,0.02329941569901896
271,-0.007621939536099518
272,-0.04706866119425178
273,-0.03954325373995262
274,0.06364498309930616
275,-0.031151965024456243
276,-0.03511095090880843
277,-0.04463492388965602
278,0.045428586797227215
279,0.010911141331784398
280,0.006520704725837012
281,-0.031041112010833476
282,0.03354961933704087
283,-0.034161167031216556
284,0.002467385114078559
285,-0.012405842412079829
286,0.0208698884975601
287,-0.024306738191368287
288,0.015635646734520843
289,0.003798085224426092
290,0.049105357244294406
291,0.04331424604721408
292,-0.03844208494349545
293,-0.019881394278149292
294,0.0047907031205115195
295,0.0017606077323765682
296,-0.027583887391552098
297,0.03477919979306368
298,-0.0017110229139783231
299,-0.05470973976711936
300,-0.01778275409445823
301,0.06515822514339459
302,-0.018867046198300853
303,-0.022158297270170997
304,0.016715754408703834
305,-0.011895517715814711
306,-0.06390429426453986
307,-0.014389683011558012
308,0.03897647195775333
309,-0.0735418963216939
310,-0.01231594091490134
311,-0.010707127561703268
312,-0.030693461087708512
313,0.007012555516305391
314,-0.010640688605216496
315,-0.0010569563628021602
316,0.06335506062272943
317,0.0034611526908863936
318,-0.05420535168876578
319,-0.0031647430783703252
320,-0.005598347080063119
321,0.00939001367977762
322,-0.01020207877665244
323,-0.056891376631017315
324,-0.04092764960328308
325,0.003619895137298646
326,0.04206521326042169
327,-0.051667765149702
328,-0.028326142230169014
329,-0.0059738542665510805
330,0.0131035861092321
331,-0.034846539996617965
332,0.0373346430347454
333,-0.047789418809854066
334,-0.051618153505478936
335,0.016702567366036966
336,0.01603773879620538
337,-0.023207341066128116
338,-0.0009188862488908878
339,-0.03870338451689108
340,-0.026699160626683673
341,0.0428648959130261
342,-0.029266561365913872
343,0.0384481477019427
344,0.02420447013355987
345,-0.007071634545302345
346,-0.045393324870941665
347,0.014330123569894358
348,0.02957942988426649
349,0.006488320815890021
350,0.00013901647934701916
351,0.0035094052092086714
352,0.016571934841248293
353,-0.0029136438280675924
354,7.421827867502492e-05
355,-0.006412972381659929
356,-0.004482818708375674
357,-0.003967491841036883
358,-0.01562193247161691
359,0.0006965413120499572
360,-0.017653152734152442
361,0.007735317678902948
362,-0.01637053516453099
363,-0.06621129850596802
364,-0.012259111164876876
365,0.009454178949862606
366,-0.0020328597554797783
367,-0.01751263845962848
368,0.021262276246306024
369,0.051089148284032146
370,0.009596501379066667
371,0.009616597107255872
372,0.0745771619099978
373,-0.03946016957970038
374,-0.04424822669998116
375,-0.035280716721607305
376,-0.0066522828021223345
377,0.0005688538832176963
378,-0.07890950192656335
379,0.024033644784413926
380,0.024313115436119692
381,0.0339472813362327
382,-0.002725928220552948
383,0.0019587589074510805
384,-0.004476299925666057
385,-0.005266882652543879
386,-0.012201798377848752
387,-0.031358732578388816
388,0.021979732243120685
389,-0.03566098896448056
390,0.0332870267069367
391,-0.0044604669301431445
392,0.0018473924764205417
393,0.021098221057926105
394,0.00613961017955611
395,-0.04798314696373164
396,-0.005063658640958507
397,0.010891631832913872
398,-0.026393403079561426
399,-0.02298424663566876
400,-0.0021428960992781153
401,-0.021254767589800026
402,-0.014135308176767312
403,-0.024388698342811207
404,0.07851451323299459
405,0.057912310157622424
406,-0.03510894915731817
407,-0.010326377894526534
408,0.03251772999616827
409,0.0465996947716648
410,0.018369299786156028
411,-0.001223069748898839
412,0.01636821610484598
413,0.00899173292214314
414,0.0675779493768676
415,0.06401250613411358
416,0.0022076133618617495
417,0.008945080269552784
418,0.0021603560600041843
419,-0.021964947540874157
420,0.02959732453430369
421,-0.020027717115986676
422,-0.00047993446953148444
423,0.015979723799174367
424,0.0012612983598727211
425,-0.05505928705193912
426,-0.015170950406715447
427,0.0008717768587206652
428,-0.010963085866954462
429,0.03009115683089445
430,-0.0672759321685279
431,0.03454177870422844
432,-0.02434083481893879
433,-0.03183151754916616
434,-0.02621619212676346
435,-0.020585780723315125
436,0.010083169545616617
437,0.04002289592556542
438,0.04061416186948824
439,-0.04786720108209819
440,0.028372399504671318
441,0.008067569118965999
442,-0.05290329241297312
443,-0.008644503017749215
444,-0.04435088829863623
445,-0.027453159028575577
446,-0.012277418672967663
447,-0.046477629581899035
448,0.012400125462170545
449,-0.017302475987788335
450,-0.009172111905124843
451,-0.06858564131102429
452,0.011036671006332493
453,0.07056598056412498
454,0.03143332283918783
455,-0.02430301910857788
456,0.005352504671070202
457,-0.027335610722461247
458,0.038637363916362986
459,-0.009465392703445446
460,-0.011900454037836903
461,0.060472786052423885
462,0.00855872318208617
463,-0.007797919361604828
464,0.016885960372276635
465,-0.005262879854585822
466,-0.029110180861735564
467,-0.02613535591621634
468,0.025160798712147964
469,-0.005616045865207846
470,-0.01118364174815967
471,-0.03881140978287103
472,0.001883256311638647
473,-0.02721355269739102
474,-0.01827795888045483
475,-0.031270496975821606
476,0.011939129097889332
477,-0.020161281144977915
478,0.07122763480200499
479,-0.014288395904858248
480,0.025457077446945777
481,-0.03258079796672454
482,-0.030134658458877778
483,0.014400404374249477
484,-0.056905012146791396
485,0.033457707237834484
486,-0.03842367513702679
487,-0.01372664891808772
488,0.02585790709328975
489,-0.038269701247881746
490,-0.049187275589216456
491,-0.012601467013852622
492,-0.0054450731852204795
493,0.010835538555258779
494,-0.07634144671532284
495,-0.014974294901124077
496,0.031575587923927555
497,0.04153457461561587
498,0.00423314559010333
499,-0.04149724221318163
