,0
0,-0.7532036142403552
1,0.7532345934747698
2,-0.9555973586007059
3,-0.9555407436842855
4,0.7126909517862952
5,0.7119161602910402
6,0.9579495532150176
7,0.9969184089567025
8,-0.03726730771683684
9,-0.9992250056488636
10,-0.9999997577894053
11,0.7532345898310017
12,0.9556329243920797
13,0.9999995856624738
14,0.7532044388075141
15,-0.1644308063283641
16,-0.16439982704455508
17,0.756282380654924
18,-0.7119161894043002
19,0.7555086252238024
20,0.9999672225157489
21,0.7562506612468513
22,-0.9999995856623485
23,0.7126907694304092
24,0.1674777748547422
25,-0.03726813233326469
26,-0.9999673984234917
27,-0.7562506343348241
28,-0.9590787006095333
29,-0.9999995538393746
30,-0.07626894494830824
31,-0.7562832014301765
32,-0.06313411488308876
33,0.9992251815829055
34,-0.1674777748546167
35,-0.8624100990683552
36,0.7562829974801463
37,0.9579813570177239
38,-0.9991926069282365
39,-0.07434590438342015
40,-0.0411800774067799
41,0.7172807498812604
42,-0.16744679921372438
43,0.20641744474228044
44,0.2034006404435169
45,0.7126909733925688
46,-0.07928657090498603
47,0.20644924859312294
48,-0.956375175282153
49,-0.9187779902637685
50,-0.037298290742952246
51,-0.956374967527836
52,-0.9213575246757408
53,0.9999997578016533
54,0.9579495495219803
55,0.9564075081577716
56,-0.03648325560649105
57,0.7118837971454675
58,0.9564073344542198
59,-0.20641744479142368
60,0.9999685745558172
61,-0.07931755023793866
62,0.9992250056364904
63,0.03550059305202719
64,0.0762697695154967
65,-0.03994675114861049
66,-0.9991928540237417
67,-0.9579813229110522
68,-0.9999997934909134
69,-0.9999997934416441
70,-0.07623795920706763
71,0.9574876833719629
72,-0.037294541016119134
73,-0.9563751412204186
74,0.9570984644631702
75,0.9556005952685427
76,0.03729911663805874
77,0.7554760812456136
78,-0.07431083511587425
79,0.16744679921359915
80,-0.7554760505567599
81,-0.0014672418323810662
82,-0.06855947634722245
83,0.040346903877327416
84,-0.7126907656506248
85,0.9569599095264024
86,0.9999988040296572
87,-0.004241697209330221
88,0.7118840048874041
89,0.9571427843848205
90,0.9969210306106265
91,-0.9525335688896254
92,0.714232984436528
93,-0.7562824075313099
94,-0.9992251815952784
95,-0.07175682235935771
96,0.9564073809578988
97,0.9969511498832675
98,0.7118840048875297
99,-0.9218752782314946
100,-0.07175816892361798
101,-0.9556003875267243
102,0.03115965794745973
103,0.20644924859312305
104,0.9999678247008242
105,0.9579813570177237
106,0.7119163680329765
107,0.035725263832384425
108,-0.9187959091725189
109,0.9609973367615001
110,-0.9609981308076481
111,-0.7126909771723529
112,-0.7554760812457395
113,0.7126907440566062
114,0.9999686077730171
115,0.9556003875267249
116,-0.9242160460333085
117,-0.07239188950560237
118,0.035725299003861816
119,-0.955599694175819
120,-0.9210537394781391
121,0.9992248371919883
122,-0.07626892939878435
123,0.03501489077646211
124,0.7562514282957924
125,-0.7142338090037162
126,0.7555086214565163
127,0.9556325895656793
128,-0.07626976946622774
129,-0.9992250056363648
130,-0.20337047853478574
131,0.07931672931467375
132,-0.9187703895576244
133,0.20337048577518776
134,-0.9999995538395002
135,0.7532346203411847
136,-0.756283228368109
137,-0.04034607556795797
138,0.9602574164650842
139,-0.7532354180911978
140,0.717312553732103
141,-0.9191277028493983
142,0.9992252171580933
143,-0.7126909733803213
144,0.75628320144255
145,0.9564073809702717
146,0.9556327506608252
147,-0.99922497006131
148,-0.07626976951549669
149,0.03567396563660004
150,-0.9999997971839507
151,-0.9556327506731983
152,0.7562832321478927
153,0.712690740277073
154,-0.005808189602651018
155,-0.9999674302578181
156,0.755476285195526
157,-0.006889947345406695
158,-0.06261696487766058
159,-0.9999997615814371
160,0.9556329281717384
161,-0.955722904943246
162,-0.07181469136386706
163,0.7562508382846043
164,-0.9556327544529819
165,-0.999225177803373
166,-0.712658584861064
167,0.9999677389652155
168,-0.9555726145039584
169,-0.16439983284835546
170,0.9991928184499566
171,0.9992252133906818
172,-0.9556003913062575
173,0.7118838224780427
174,0.03203318939028331
175,0.04031592459266648
176,-0.9660378186340578
177,-0.9991928184375836
178,0.7554760812456136
179,0.9556329281594909
180,0.20644924859312286
181,-0.07280296548657376
182,0.7555086521217838
183,-0.07096913828034611
184,0.7126907694180358
185,-0.07613366749490032
186,-0.006878339185104904
187,-0.7172815962432358
188,-0.9969511816350619
189,-0.9999671906815553
190,-0.20337047848539153
191,-0.07268412975968216
192,-0.07162754429566652
193,0.9556003535048219
194,0.9999997615813111
195,0.03569463130997193
196,-0.03726798124516316
197,0.9968889541728135
198,-0.0403460741807999
199,-0.07928574920987855
200,0.9563751412202934
201,0.9556329621949261
202,0.04031591946427553
203,-0.03726548679904813
204,-0.9193156432613572
205,-0.7562830206139173
206,-0.7126906455000646
207,0.7173116337734142
208,-0.007201907321313121
209,-0.7126583809112849
210,0.07626976577331562
211,0.9564075384165052
212,-0.16054826975556352
213,-0.006855375332232315
214,0.033767798338683236
215,-0.7172807717251913
216,-0.9991926462817973
217,0.20336965761139544
218,-0.7142329881295656
219,-0.20340063694434785
220,-0.7118837971454677
221,0.03273650245235238
222,0.9602224499738825
223,-0.9999672262954075
224,-0.7562522528631062
225,0.04031591941488092
226,0.9992251778156201
227,-0.7173124582910689
228,-0.7555084137020817
229,-0.9556327506608259
230,-0.0719092374437897
231,0.7119161856246421
232,-0.9556327166377706
233,0.03565043213726353
234,0.037268132284121236
235,-0.9999995538393747
236,0.9999997971717032
237,0.9610291442571184
238,-0.037287699380618544
239,-0.20340064044351702
240,0.9602554377853
241,0.9968855695777088
242,-0.953463943883743
243,-0.9556005612342598
244,-0.04081102959654336
245,-0.037268137304003135
246,0.07623796290010515
247,-0.09207523041892658
248,-0.7126907694179108
249,-0.0743202054002786
250,-0.9556003572721075
251,-0.07266645971494212
252,-0.16747777849851106
253,-0.9556003960732481
254,0.7562508382846036
255,-0.07114380333691084
256,0.9968922907270192
257,0.9568291400172286
258,0.03726730771683688
259,0.712658588653221
260,-0.9531390880704701
261,-0.07931672844552166
262,-0.9999997933920448
263,-0.20641827665835072
264,-0.03726813366010874
265,0.1674785994219305
266,-0.07431790278651948
267,0.717311729164944
268,0.7562831112741858
269,-0.7562522528631063
270,0.7118838262577015
271,-0.7173125500390658
272,-0.03729911658866439
273,-0.7562832052098358
274,0.9999997615813118
275,-0.9999673984234914
276,-0.9193682595371212
277,0.9991926106955222
278,-0.7126907440442332
279,-0.20340146151138153
280,0.7126586140256277
281,-0.9999671869018969
282,-0.0557178744269716
283,-0.999224970073684
284,-0.9579805288067667
285,-0.9999995500598423
286,0.04031510002547822
287,0.9968867571483192
288,0.07931672844539628
289,0.7142647629080552
290,0.7119161640705735
291,-0.9999671906816802
292,0.9991926069282366
293,-0.07433320106635338
294,0.16442998761522234
295,0.037298288377832604
296,-0.7126584938679896
297,-0.16442998756607896
298,0.03549910497873477
299,-0.7554760505691328
300,-0.9534549082884839
301,0.9564075384288773
302,0.957227331961527
303,0.9999989689237251
304,0.7554762582985713
305,0.03265597345452407
306,0.717281488892516
307,0.03573311905651178
308,0.039565707223585676
309,-0.07928657747023003
310,-0.16439901202347354
311,-0.0038776296633661264
312,0.2064182729653133
313,0.9968874757868755
314,-0.006847146416922165
315,-0.20641744474215473
316,0.9556005612466331
317,0.7119161856246419
318,0.7119161602786674
319,0.960997336712106
320,-0.031977819768137516
321,-0.9999679577305943
322,0.035688034550462
323,-0.9213207897077077
324,-0.0065629437111552925
325,0.9991928146578002
326,-0.004233888391289348
327,-0.9556005612342601
328,0.9992251815830306
329,-0.7562508652215093
330,0.9968875306889589
331,-0.0394514188302283
332,0.9556003875265987
333,-0.04034690239172746
334,0.9968919368744209
335,0.9968895104363581
336,0.07626976946635311
337,-0.004210715633407906
338,0.9969188552197067
339,-0.7119161640583256
340,-0.9556005612467582
341,0.957078257949499
342,-0.0392777354598134
343,0.7562508690012929
344,0.9564073344542198
345,-0.006885053819268516
346,-0.003973259591660816
347,0.9969519744011573
348,-0.7555085313804896
349,0.9969511461410865
350,0.03726813730400307
351,-0.9556327204298022
352,-0.9168367747092149
353,-0.7142639674144775
354,-0.9579503740892938
355,0.0793175538818327
356,-0.9992249738410948
357,-0.037293688821132306
358,-0.7554761616113982
359,-0.9556003875265989
360,-0.16747777480534806
361,-0.756250865209262
362,0.9969201705504404
363,0.9999673984359894
364,0.03729829202147593
365,0.02305222619305139
366,-0.006882078207390618
367,0.031914461406084484
368,-0.7562830206262902
369,-0.20336965391823228
370,-0.004223773162651115
371,-0.0743789601322334
372,-0.20644924859299774
373,-0.9555746744112892
374,0.9609973062403638
375,-0.03980946399012744
376,0.7562514013712404
377,0.7119163680328513
378,0.9999989687552233
379,-0.16744762378091282
380,0.7532345897818578
381,-0.07623795920706782
382,0.040346074131530914
383,-0.9999997578016531
384,-0.9182994248748096
385,0.9572184851409963
386,0.2064182656655455
387,0.999967226295408
388,-0.037267711342373354
389,-0.9558011780168894
390,-0.9187697207590345
391,-0.711884008667188
392,0.7562508689887946
393,-0.9522628699927999
394,0.712658380898786
395,0.7555086483421256
396,-0.020726116435387198
397,0.7562506343224515
398,-0.07928657377706706
399,-0.9191572339927515
400,-0.9579803672540474
401,-0.03940545589648791
402,0.07626894494830848
403,0.0793175567057476
404,0.9999997971346818
405,-0.0068835931462772155
406,0.16442998176120507
407,-0.9556005990359543
408,-0.756250661259224
409,0.7118838224780428
410,-0.9187703658991331
411,-0.7118838262701997
412,0.9999989331852255
413,0.03216013886150091
414,-0.9563749372705133
415,-0.037268137353272085
416,0.7532036105473174
417,0.9564073004035875
418,-0.03726730904377698
419,-0.7126583809111589
420,-0.03985636456155224
421,-0.9213228289168713
422,-0.9556327204174292
423,0.9991928540238666
424,-0.9999997934042917
425,-0.9556325933452113
426,-0.20644843137594876
427,-0.13136801502228507
428,0.9992249700736835
429,-0.9556003534923232
430,-0.7532036105473175
431,-0.0717423003823678
432,0.9564072966239291
433,-0.7118840302201119
434,0.957949549472711
435,-0.996951181684456
436,0.999999761532043
437,0.0326340484238186
438,-0.7562830244058232
439,-0.9556007337893498
440,0.1674467955205612
441,0.7126586102460951
442,-0.07225449323756988
443,-0.20340063689495358
444,-0.20340146506009993
445,0.9564075081453981
446,-0.956407390365444
447,-0.7126584025040256
448,0.9991926069282363
449,0.07626975296446288
450,-0.03837596666363638
451,-0.0042607398591349415
452,-0.7562508652092624
453,-0.9199841749745911
454,0.9571774711341354
455,0.9579805324505354
456,0.9563749675402098
457,0.7532044350652078
458,-0.7126584062714366
459,-0.9991926069282367
460,0.7126586140133807
461,-0.07434719178570993
462,0.999999793404418
463,0.7562830243935762
464,-0.004584723790526207
465,0.7126907694179107
466,0.7119161894043008
467,0.9999997578291516
468,0.9999989650320735
469,-0.9529909228895408
470,0.9571405977375712
471,0.03573861561162027
472,-0.9563751449999516
473,-0.953037140291517
474,-0.9080330659686913
475,0.7562508420767609
476,-0.037342812208361185
477,-0.9197944229139193
478,0.9610282818310096
479,0.9999997971839507
480,-0.9556005952685434
481,-0.036951301555941944
482,-0.9185688595356332
483,0.07931672562163633
484,0.7562830244059489
485,0.7172807461389541
486,-0.006883961149405813
487,-0.7142338090037161
488,-0.9610291063982945
489,0.20641744844739357
490,-0.9969511816351871
491,0.9969519744504265
492,-0.20337047853466028
493,-0.9999997971348071
494,-0.9564075043658655
495,0.03392076906687131
496,-0.0372982920707448
497,-0.9999674340373512
498,-0.9530493752294826
499,0.95563292439208
