,0
0,-0.08878252944428598
1,-0.12665712423045655
2,-0.07055872532334366
3,0.25679069324972464
4,-0.14008297603334485
5,0.17526108029632587
6,0.15399053083600067
7,-0.10551405990065856
8,0.20254307344781214
9,-0.08236040490620564
10,-0.08323744060717583
11,-0.17566096257977648
12,0.16967280266131068
13,-0.08153606565456203
14,-0.11558456879481457
15,-0.13285018987573705
16,0.14163354596219685
17,0.16994424705006866
18,-0.09151182192123059
19,0.175694057371524
20,-0.054998540989774636
21,0.20934048371312564
22,0.18232081714345402
23,-0.0875946821321443
24,0.15227006156604367
25,-0.06746595272218278
26,-0.10267294563208257
27,-0.06302661272572398
28,-0.07142550219955941
29,-0.12320579813397162
30,0.264809147087813
31,0.15918150126097383
32,0.1825133094689995
33,0.1330994972472103
34,-0.05241915133384599
35,0.2277498396549343
36,0.23513084933036635
37,-0.08965788235596839
38,0.25255944465184305
39,-0.13974379800772158
40,-0.11424842153205518
41,-0.06534522255510683
42,0.171628709644297
43,-0.12124566751335294
44,-0.09635351241814483
45,-0.10395008346116787
46,-0.06391552329604752
47,0.18950388182603303
48,0.19305450425621584
49,-0.13016248902722016
50,-0.07991486981394212
51,-0.04520582803792297
52,-0.12258584617622928
53,0.16760957415056127
54,-0.10766791486219832
55,-0.13167167311089903
56,-0.1373511833340632
57,-0.07687558412190028
58,-0.08775332893524333
59,-0.07538443523990361
60,-0.06266151188122222
61,0.19162986347794814
62,0.20132794926589143
63,-0.03552238354745152
64,-0.11634733404943683
65,-0.10359173824320211
66,-0.10527128393192331
67,-0.15316192310103804
68,-0.08727821008460125
69,-0.13072999320030593
70,-0.0987000258939319
71,-0.10294233082268332
72,0.21462582434597754
73,-0.09143737595683796
74,0.22370176058881883
75,0.20780953843693956
76,0.1682853902060159
77,0.2230396243960338
78,-0.09133137982753142
79,0.13812521746508644
80,-0.1461679229348078
81,-0.10682387107651485
82,-0.077629811093538
83,-0.18482978933798844
84,-0.10052823650786555
85,0.1560684012786617
86,0.1989904454278657
87,-0.09759377486121835
88,0.21853037120488153
89,-0.09210771980082483
90,0.19184037799565937
91,-0.10745976435919008
92,-0.11837598879565858
93,-0.08318082928331835
94,-0.09258173219284985
95,-0.10230954076945739
96,-0.10900756538750411
97,-0.1364647537842116
98,-0.10684804004056427
99,-0.10111279675935794
100,-0.07979939511843544
101,-0.11306574681942615
102,-0.10708872757038879
103,-0.040433328703626224
104,0.16835934451917733
105,-0.05535373240598141
106,-0.12939627454807964
107,0.17914049871600096
108,-0.07771855318717937
109,-0.15428965247945628
110,0.17790802302205716
111,-0.09698361530392363
112,-0.14508389461235516
113,-0.06581172972318369
114,-0.07560298983564087
115,-0.09845817466854631
116,-0.10652901816998825
117,-0.07591869984786444
118,-0.07378055733000113
119,-0.03349262934922281
120,-0.06290927636366572
121,-0.11652747009892447
122,-0.11524689758754782
123,-0.08608831919942636
124,0.21869450723548522
125,0.2200495647018909
126,-0.11003364635437955
127,-0.10658206528499231
128,-0.11797878822008527
129,-0.0850496306259055
130,-0.09492410518881644
131,-0.06273841310432199
132,-0.13514855589327912
133,-0.06126204556231425
134,0.1980696802152956
135,0.16804021304504285
136,0.241044028882402
137,-0.09944549133285721
138,-0.034738625241215335
139,-0.10750319077300009
140,0.2128865759610823
141,-0.06434332395073608
142,-0.09247468668268594
143,0.1621612209538234
144,-0.10168852898396022
145,-0.07381117327254696
146,-0.06166086540335371
147,0.23693260034264468
148,-0.09500110011079818
149,-0.1198587079561883
150,0.23369368148012304
151,-0.07947340863239954
152,-0.17619758551756382
153,0.18287599426678924
154,-0.07239356008409895
155,-0.05931173503971827
156,0.20806484200078662
157,-0.01637809116076181
158,-0.1365378603362954
159,-0.11128036126358243
160,-0.0684530981829169
161,-0.090421786858415
162,-0.12387552779403413
163,-0.08949083078381584
164,-0.06993729162265006
165,-0.09670580503698231
166,-0.10304822561856163
167,-0.15926515762848203
168,-0.11099093485299746
169,-0.05248293226113353
170,-0.09987033037567591
171,-0.12761161535387044
172,-0.10348716175246164
173,-0.0972023616551094
174,-0.05730663385809602
175,-0.11284008919511904
176,-0.062422941672276376
177,-0.12742771954173604
178,0.1677212742550969
179,0.17867790081426993
180,-0.06951985306710265
181,0.2967740044747762
182,-0.10924331766979878
183,-0.08272743649406983
184,0.20572521876263905
185,-0.0958996336886637
186,-0.08131499069100376
187,-0.10576705437031547
188,0.1203007258722702
189,-0.1187305916832217
190,-0.08399543538530221
191,-0.06997957672404982
192,0.15538402142279378
193,-0.061915749240195314
194,0.22906935073202467
195,0.20512559723497792
196,-0.13072832908101292
197,-0.11390481105504242
198,-0.06140068926883999
199,-0.17116258959366745
200,0.18049687648095328
201,-0.10341270563374864
202,0.23333906680925984
203,-0.11145103310451951
204,-0.04421256319519548
205,-0.04539345079765834
206,-0.07223329405112876
207,0.17043600750249657
208,0.22642199712240973
209,-0.05614152740368187
210,0.15884676469483983
211,-0.04902693437409248
212,-0.13276009435583153
213,-0.05217469578832157
214,-0.08012661537392163
215,0.1821169149532342
216,0.19788198049708322
217,-0.0545558612303272
218,0.22568178890037194
219,-0.1122878409302466
220,-0.0011951543491023758
221,0.24031921147340085
222,-0.09338452531531954
223,-0.11592277174695285
224,0.193100437940466
225,-0.13370186410679302
226,0.25177112083603825
227,0.24117532512071155
228,0.19888058335965264
229,0.2756666630539097
230,-0.05920926279757319
231,0.1860047766845596
232,-0.05264451188126453
233,-0.09753275551651121
234,-0.08142180594325686
235,-0.08780208203806744
236,-0.09568555337477172
237,-0.07047378797151291
238,-0.09211575595082805
239,0.2025382732145114
240,-0.10154028619785577
241,-0.05971773219767812
242,-0.14392606884940098
243,-0.0826884397966845
244,-0.16608877208013828
245,-0.06038969192290304
246,-0.0676840163344469
247,-0.05503697839197021
248,0.16691304550132524
249,-0.07686783420577048
250,-0.06433311293883413
251,0.2331302838639014
252,0.24916910262622854
253,-0.05898657918841338
254,-0.13629274984595405
255,-0.10688116557569824
256,0.1917625766729602
257,-0.09711841561112931
258,-0.11456854500325075
259,-0.05879481062869752
260,-0.033301381776687906
261,-0.10901201708445468
262,-0.11309421717702305
263,-0.11383972851122351
264,0.2542011676381972
265,-0.08892709122455461
266,0.2141415749338166
267,-0.06554074548044171
268,-0.09164170281982247
269,-0.10877847301261777
270,-0.11614019303556734
271,-0.07417856884290229
272,-0.1340993391000701
273,-0.05943782038381727
274,-0.12018434129888328
275,-0.07976246438513909
276,-0.11271383124622422
277,0.1412372448205977
278,-0.12660130228987204
279,0.15868249753814112
280,-0.11834566940752653
281,-0.06920560551100961
282,-0.08964474895531513
283,-0.08534618403738536
284,-0.12389910487233251
285,-0.10769260147771603
286,-0.0989715247590506
287,-0.13740306098842103
288,-0.09285013312711374
289,-0.1045016037038918
290,0.16989161952124193
291,-0.09629082704999088
292,0.15611303807592508
293,-0.0918493437049702
294,-0.11301092760660301
295,0.19480196057682003
296,-0.11075143356555847
297,-0.11498646666166634
298,0.18932308837487294
299,-0.11112171002269397
300,0.23890155844425168
301,-0.1329398163744789
302,-0.07157333040455346
303,-0.13184713950395105
304,-0.03245640023271242
305,-0.06526896146336891
306,-0.1290947429248903
307,-0.06242834571616902
308,-0.07448212683245095
309,-0.14159133440333174
310,0.1381882334279147
311,-0.05416647074071756
312,-0.1389765286490939
313,-0.0692592203963232
314,-0.052321379181304736
315,-0.0698018664967188
316,-0.08165739123148871
317,-0.09779095267237953
318,-0.05840126459045341
319,-0.08565774986315984
320,-0.14060850544022113
321,-0.10512503241148462
322,0.12122205107171882
323,0.22008532908212997
324,0.15926420554966678
325,-0.08385697438702808
326,-0.09195493855172515
327,-0.09679627346732704
328,-0.07697102042628874
329,-0.08411476583342817
330,0.22892014287019768
331,-0.1318986490018917
332,-0.07114541797061864
333,-0.17285407577748665
334,-0.13623864600900684
335,-0.1201254395422339
336,-0.0660155524559904
337,0.18135765897222195
338,-0.14310432704681392
339,0.2550270702886195
340,-0.06591345862523523
341,-0.10105530681098042
342,-0.04374043300266453
343,0.14174407644100603
344,0.14408147603814708
345,-0.15195516560803235
346,0.18144011005489885
347,0.16383352391637923
348,0.20142134007857757
349,-0.09494425511023187
350,-0.08187841644955553
351,-0.07947655058611858
352,-0.11461322758659233
353,-0.0767165417339319
354,-0.10105396567082231
355,0.18277009166377295
356,-0.12471542563312854
357,-0.09934431936432404
358,-0.14089996070624672
359,-0.05812547254581075
360,0.18907876270621082
361,0.17166160186996893
362,-0.08606488680717334
363,0.2330202280404982
364,-0.14975748409534895
365,-0.1443175297897492
366,-0.13411610636924182
367,-0.09331029688326231
368,0.20875974387901503
369,-0.09923916746225873
370,-0.10212872069540718
371,-0.060532713525054446
372,-0.07742783882482997
373,0.21040996636186365
374,-0.07716084289912817
375,-0.047069638288798996
376,-0.08800019829927279
377,-0.10833873417679854
378,-0.1158748506031097
379,-0.13983172779087255
380,-0.04799764637152673
381,-0.06211633678156377
382,-0.07470320312138692
383,-0.09066005892360132
384,0.17731460317300388
385,0.24639201794658422
386,0.19189944431564637
387,-0.11815162594690413
388,0.16772055607408498
389,-0.07621039255722178
390,0.1874960024627681
391,-0.1328444574259678
392,0.19735036366205116
393,-0.06537557474467429
394,-0.08768701154915146
395,-0.11072776137501544
396,-0.06296895443243024
397,-0.0990321735006259
398,-0.13623203723803373
399,0.24180066923465715
400,-0.06733335031135007
401,-0.0898415650770929
402,-0.020409406459810233
403,-0.019008046751898582
404,0.14423979394212808
405,-0.08487082323930922
406,0.18191010353445553
407,-0.0867629943937682
408,-0.12564656227448423
409,0.17523983906102697
410,0.19151806865051854
411,-0.12718069815658795
412,-0.09838898316708321
413,-0.08190876010396166
414,0.19242034959163704
415,-0.13158974083008548
416,-0.09103353388698403
417,-0.10636568046030842
418,0.19800139336937642
419,-0.08744299239434451
420,0.2212933979010515
421,0.21490863580857264
422,-0.09070902885331583
423,0.23816615333605787
424,-0.0979540065707308
425,-0.07363643551401786
426,0.1771259290071764
427,0.16975530994554316
428,-0.11083067930481692
429,0.20539360104249893
430,0.22874985386447583
431,-0.16628083037961922
432,-0.09661185731872593
433,0.20626518328382198
434,-0.08216036866590866
435,-0.09697094249340035
436,-0.11405872809542544
437,0.15589345279765243
438,-0.10256405194110815
439,0.1724075704369414
440,-0.13332676246315545
441,-0.10453597847944174
442,0.2174635076517533
443,-0.07390511933263674
444,-0.07955842988634318
445,-0.07871375956574106
446,-0.08638149875210999
447,0.17324771669917788
448,-0.08012434624278655
449,-0.09424247182884589
450,0.15000305327497632
451,0.1940661529450754
452,-0.08526146177843782
453,0.18309345134025146
454,-0.0709967721963563
455,-0.1260809664172975
456,0.19551572961591004
457,-0.06664253936396561
458,0.15475073101323106
459,-0.12559414592473897
460,0.20708449477927843
461,-0.06020328715734731
462,-0.07848337877219028
463,0.2651638141578962
464,-0.06468068959708898
465,-0.07595301945451755
466,0.16101618460626338
467,-0.09485755217755042
468,-0.10799867072674812
469,0.16448533690157857
470,-0.09914146505724863
471,0.20145802585323175
472,0.13373027244127167
473,-0.12083721161372328
474,0.19498921028097937
475,-0.10278241500306684
476,0.18893107875717408
477,-0.09310807998401482
478,-0.12423638022059641
479,0.18261119318561647
480,0.21630931223343075
481,0.2294907022487248
482,-0.09181049778665298
483,0.16988575287044358
484,-0.09768858825097086
485,0.14098951782537172
486,-0.0985260077863431
487,0.20079739834387578
488,0.15749577008750693
489,-0.08934790276604795
490,-0.08203002290855146
491,-0.13779961060618323
492,0.1718621182472736
493,0.258901456578712
494,0.15389160465043367
495,0.15208370457885118
496,-0.138891500110275
497,-0.11257656623425365
498,0.19857033333028365
499,0.1724780151745292
