,0
0,0.3532567417376486
1,0.595554020097532
2,0.20473694329613626
3,-0.23023176351215766
4,0.34536287497387297
5,0.15289876405831113
6,0.6689714630754526
7,0.1256940703625014
8,-0.4088280602118885
9,-0.027914663656085244
10,0.035819652443734556
11,0.7957246160865318
12,0.27387077370265694
13,-0.04921212534943902
14,0.12746925474488646
15,0.2743709155392661
16,-0.5256168896670141
17,0.12057638395037364
18,0.4361191508803662
19,-0.07506489238992463
20,-0.20652826496613963
21,-0.3907304062777493
22,0.009494643139937853
23,0.39259271089424314
24,-0.7982427097056136
25,-0.33585239368506703
26,-0.05907046045956328
27,-0.23341035619965092
28,-0.498087336804041
29,-0.5676904343546101
30,0.006905039745812015
31,0.025469611481365922
32,-0.06806902903247189
33,0.016500104472944505
34,-0.35840385493981647
35,0.04212505259657222
36,-0.006873084242378609
37,0.08712474585270827
38,0.2356195172770876
39,0.019271980535589726
40,0.7660278762577836
41,-0.18229975453045819
42,-0.6129824324224439
43,-0.041999977482289466
44,-0.15579725635550143
45,0.9336256553748352
46,0.8599748450501072
47,0.33248901097081157
48,0.8399234192572717
49,0.2680660142253898
50,-0.03371506835259923
51,0.7059616534757919
52,0.1426137270307024
53,0.32424639705852965
54,-0.7982296919792209
55,-0.3422304727645102
56,-0.4264498890912739
57,-0.7929812868876551
58,0.9014825070418722
59,0.5643686641616937
60,-0.1588975489181874
61,-0.06933511050526009
62,-0.865324197265929
63,-0.012495199774514245
64,-0.016550587452535345
65,0.3357671248919327
66,-0.21654102979066894
67,-0.13778326895405424
68,-0.0564751092453496
69,0.8281897623633387
70,-0.57624059327934
71,0.10638344946200592
72,0.3007950611449999
73,0.15510301533890947
74,0.011777230597190913
75,-0.6801885215348851
76,-0.3371184135249885
77,-0.3290938978441085
78,0.11414633108616942
79,0.16855728421733565
80,-0.39266880163224
81,-0.2022060398556004
82,-0.14068677265680554
83,-0.3325159665785006
84,0.36655048878018026
85,-0.2076980136580574
86,0.8620465103388848
87,-0.01256744876283614
88,-0.8413650084674058
89,-0.7653151179229533
90,-0.3723745307010263
91,-0.10560968143557882
92,0.11854932034102285
93,0.7760783417487096
94,-0.7068706832034877
95,-0.3294406544806725
96,-0.40884197026916974
97,-0.00813857326487127
98,0.45202474464790404
99,-0.5565768966126848
100,-0.677768598046764
101,0.8871352783459852
102,-0.7696414638181223
103,-0.6696386008761153
104,-0.458846516884484
105,-0.10480116033954444
106,0.1665144811786264
107,-0.10182707641516402
108,-0.32424598289551304
109,-0.8781764872512348
110,-0.8652654485313928
111,-0.9060995321511608
112,0.33191784636692634
113,0.16969351838299415
114,-0.07773913495442085
115,0.004231279524488867
116,0.9254413499837326
117,0.07704491959620732
118,0.7743426242527227
119,-0.20221942229326478
120,-0.4235962543235143
121,0.07855721894424036
122,0.7163237135050252
123,-0.48492557203915765
124,-0.5565898658824135
125,0.4360717057331445
126,0.7974888869810076
127,0.7043414655774278
128,-0.9999141141353355
129,0.1354613326228857
130,0.06609329104966018
131,0.6406382102032446
132,-0.05617764411848997
133,0.48956762931040626
134,-0.07631087716189358
135,0.12222846458228763
136,-0.1062239818606507
137,0.33422474018380527
138,-0.17811960059726933
139,-0.9398691957094163
140,0.8698943887428222
141,-0.7997855084841697
142,-0.8344597582359085
143,0.37083218350859715
144,0.10182707632547179
145,0.8716251635027503
146,0.4689590887014307
147,-0.7982296918881265
148,0.6896992645559413
149,-0.2785719133409805
150,-0.5351707995214084
151,-0.10795315979497153
152,-0.2669651792359697
153,-0.42489364130901597
154,0.0755639310106198
155,0.37823333399339715
156,-0.10267500580033796
157,-0.5222499767455165
158,0.6894303716767284
159,-0.36030902601184006
160,0.2784993385450526
161,0.4675364840545533
162,-0.6697800037003421
163,0.4025845494270386
164,-0.36754064965582706
165,-0.014299082170689252
166,-0.32430521506440446
167,0.6883634573204866
168,-0.04115817263288613
169,0.7713772285634832
170,-0.17352853251836145
171,0.316288204044456
172,-0.5958080687960562
173,0.2798754603429427
174,0.9547592839689412
175,0.02685159900753129
176,-0.3324894367874494
177,-0.836182091214497
178,0.8878904974073523
179,-0.7069945167440089
180,0.6558652144832977
181,-0.39588424474841455
182,-0.9061099323844467
183,0.04701479098913141
184,-0.09846339045748641
185,0.12272339810913632
186,0.0014612493704259958
187,-0.7563402033144851
188,0.3580041176123787
189,-0.3339740498948396
190,-0.02696588666834558
191,0.5581322504446264
192,-0.769641484869968
193,0.036287972385723594
194,0.42966880854846845
195,-0.36452624508629516
196,0.05810692514965174
197,0.1404326798527889
198,0.02419492401642891
199,-0.030958438994087567
200,0.9267065866276626
201,-0.14130742418849068
202,0.003667486066027736
203,0.10802494734054503
204,0.5930661166372965
205,-0.12084372874902893
206,0.3774228595740051
207,-0.33687794871850363
208,-0.6997258594414506
209,-0.5930661580355292
210,-0.18362521682559457
211,-0.21293212930563507
212,-0.08103564101758777
213,-0.11466555265025163
214,-0.8144636286977299
215,-0.1415239501404576
216,0.2767416476445295
217,0.32476528051428416
218,0.30682191887231647
219,0.011735616810371986
220,-0.029719529344721714
221,0.11318711636534252
222,0.10738860165872487
223,0.01762693027855249
224,0.3580892863269918
225,-0.20943990095886963
226,0.3217870375034072
227,0.4212074404505106
228,0.9999997615814393
229,-0.23091986020471703
230,0.5793577151626967
231,0.8291092592372695
232,-0.2738703597205192
233,-0.27781274590441746
234,0.17475747254551827
235,0.008460841058677993
236,-0.27526693668631874
237,-0.10443330689390036
238,0.9383133275464898
239,0.3872024167763385
240,0.3399977213774059
241,-0.7631728483886954
242,-0.5171711877816462
243,0.09678049127302037
244,-0.153580208159244
245,-0.08645294364518252
246,0.10473424427228782
247,-0.16799359932524283
248,0.3406747169913559
249,-0.24823878472683908
250,0.14735360528033234
251,-0.8361098699167446
252,-0.21716358891551987
253,0.13833281516355939
254,-0.7628984638793067
255,0.8896112495803736
256,0.08094142212012043
257,-0.06940726131563314
258,0.1593493758924683
259,0.7714355544948563
260,0.21640840918182672
261,-0.026968125693308004
262,-0.40085098502430716
263,1.2576385756066016e-05
264,-0.1509843011227082
265,-0.5695346268476823
266,0.7059824770522931
267,0.2887448413454561
268,0.09722315996181506
269,0.16351304686110965
270,-0.6681312010591534
271,-0.7594119471312332
272,0.1053407681923095
273,-0.855359338737005
274,0.47029020119219156
275,-0.43100671058802087
276,-0.9826911597524346
277,-0.13284675414409766
278,0.577018548017043
279,-0.18977512236196534
280,0.7714355820512875
281,0.17012806855659032
282,-0.33154179657405725
283,-0.0003294184173069639
284,0.7035492413260453
285,0.6769745938400624
286,0.05642503501798869
287,0.8816505674293098
288,-0.5491258868263637
289,-0.5910791578463188
290,-0.20072237331155696
291,-0.6754786120539008
292,0.22856482541415676
293,0.09651768281209742
294,0.4585791719202222
295,0.16844565030044328
296,-0.027729787804609166
297,0.9048025147055395
298,0.37065933322057587
299,0.1143703125962356
300,0.29331416926396575
301,0.558725713406516
302,-0.14998283393605424
303,0.027668152834498867
304,0.3243186354055289
305,-0.20065017278051364
306,0.0762398150685988
307,-0.869952790592161
308,-0.7539924208907006
309,-0.4236065808990253
310,0.007180886094232005
311,0.3227493848963124
312,0.1315577330927197
313,0.34212704425415424
314,0.909372719922172
315,-0.4224106549395645
316,0.14254216932236938
317,0.36042180192589535
318,-0.14146397558613075
319,0.0768663264726312
320,0.1058160351888087
321,-0.10001961855647144
322,0.1753589274458177
323,0.00034140469242660955
324,-0.17068536588904784
325,0.6407620766973025
326,0.8443528806707173
327,-0.002257952929292314
328,0.28725541565784785
329,-0.06636942726540752
330,0.7349279770359827
331,-0.05736492963122498
332,-0.1863596956390133
333,-0.6606900831040964
334,-0.823647729384763
335,0.07871255066156736
336,-0.9367612265150355
337,-0.6759432941753181
338,0.12162311067124364
339,-0.015934342361906037
340,-0.4854710617459176
341,0.6759329261275598
342,-0.009217561302087415
343,0.004575504120436666
344,0.3608537921941793
345,-0.4682916714515675
346,0.3023682537779149
347,0.5949107415369799
348,-0.12161646162952755
349,0.832831740261827
350,0.23486116624711972
351,-0.36781772930981604
352,0.09505810537340117
353,-0.1414655389047753
354,-0.06596732222230907
355,-0.6670006865831735
356,0.6874560033501601
357,-0.03583213287943091
358,0.3724598006715074
359,0.6132712548401043
360,0.15098426510000418
361,-0.1808897054277684
362,-0.23038172890287748
363,0.42771692878406864
364,0.17117484379069475
365,0.04684138842629827
366,0.431078462673132
367,0.10331068870827076
368,0.40549297723330646
369,-0.002243960049562002
370,0.4408203233718044
371,0.7046228639572397
372,0.0025173201708197186
373,-0.14254217430764837
374,0.1883918811396869
375,0.980768694752252
376,-0.621267924315704
377,0.358138069756002
378,-0.8538030576244812
379,-0.8553593083752288
380,0.611065784649253
381,-0.8537178382796234
382,-0.3690968944011968
383,0.341847742501567
384,-0.007887895419197545
385,-0.9984304970794305
386,-0.7696418988505036
387,-0.054038718813431814
388,0.8715085896134355
389,-0.04864914198036093
390,0.11652182607513029
391,0.12188537912257334
392,-0.0035818526495282896
393,0.9185760500613277
394,0.7614710385106854
395,-0.000958803469835632
396,0.8330367197368097
397,-0.03496385787630836
398,-0.0767775374895234
399,-0.008867475773850117
400,0.1259551855678372
401,-0.18120451665447582
402,-0.9300116042916813
403,0.49473921709917285
404,-0.04712925230138349
405,-0.8896128537135313
406,-0.3243182213324054
407,0.4512519704491604
408,0.06638866437627554
409,0.1479677154341513
410,0.5359343322315547
411,0.46277383536735606
412,0.43428434785759734
413,-0.62229921493274
414,0.3911230042213809
415,-0.3340466654015778
416,0.3944140617153905
417,0.2872663453393439
418,0.2701747968215299
419,-0.7760779265922286
420,0.6427502011714813
421,-0.01335664958008272
422,0.549125821766539
423,0.7170876922025995
424,0.16061911623764263
425,-0.5920364230296057
426,-0.844438149644592
427,0.3138881643533902
428,0.8236461154461252
429,0.009086397795364607
430,-0.20025657372336708
431,-0.9014099431549208
432,0.10305389623386392
433,0.36915561242127126
434,-0.49119599438534667
435,-0.4261118418219922
436,0.012326972352138173
437,0.05061156456121379
438,-0.16576458159197943
439,-0.015944706803320628
440,-0.14105860059152442
441,0.230654087857097
442,-0.26702389706849894
443,0.28556310541822916
444,-0.005454505586484729
445,-0.45229362484833446
446,0.46731758812310703
447,0.16917603387213123
448,0.34171496895324244
449,-0.3371194224617698
450,-0.057228639119222026
451,0.500851459322482
452,-0.31236524701440743
453,-0.20896831471187255
454,0.07492601187430038
455,0.6427621459509333
456,-0.17929697588607957
457,-0.007879642642046557
458,-0.12333889657677033
459,0.09287464309750057
460,0.1759140236789834
461,0.18757786824256684
462,-0.32423259955368106
463,0.12281074996389439
464,0.18860757802250838
465,-0.137343781341538
466,-0.07807817600843785
467,0.18172402598716408
468,0.03709665592306317
469,0.0461165072441162
470,0.6606989201009705
471,-0.028553565238934882
472,-0.004575140604306232
473,0.640638224607714
474,0.11622241443249438
475,0.13847968751570133
476,-0.08152376007605035
477,0.6712246603860411
478,-0.4212795913509038
479,0.4246572249387581
480,0.0459724188747553
481,-0.671235093820835
482,0.002415150251130454
483,0.006216954906704076
484,0.29304679759432156
485,-0.40058548330286964
486,0.010773743130088382
487,-0.6609662649890471
488,-0.21804523786062344
489,-0.15361807272265657
490,-0.01217550281780542
491,-0.5202107754636989
492,0.3940269159735222
493,0.15112887615194856
494,-0.9185656907141642
495,0.5739003879133842
496,0.3227489327757494
497,-0.25120979922128933
498,-0.5221751074268656
499,-0.12862209303257174
