,0
0,-0.011334596531373397
1,-0.0030275449066019117
2,-0.030504585154859258
3,-0.02181752066234021
4,-0.028433949557730164
5,0.01572189375177443
6,0.07923811561751887
7,-0.1025715298143519
8,0.05817248396021595
9,-0.02787085534665797
10,-0.07933186226783072
11,0.010781234103797957
12,-0.13565941629372943
13,-0.026360335698459872
14,0.21852367311004992
15,-0.06491531788435403
16,-0.0904835631833035
17,0.25932628121351137
18,0.7447230199055964
19,-0.021241484154547106
20,-0.08273908252929775
21,-0.18303281925858675
22,0.10094366480686469
23,0.3170416140274703
24,0.08339287947805576
25,-0.22842256564875033
26,-0.0263914936981699
27,0.030031153660326174
28,0.15682864475318403
29,-0.006062202505020925
30,0.10523452563603858
31,-0.14349202701617345
32,0.0854468152381984
33,0.023263541211037266
34,0.13844647290870984
35,-0.00976898246405445
36,0.0552565875574485
37,0.05927164429081391
38,-0.061494341469672184
39,-0.004572599399667057
40,-0.030667951704974758
41,0.03983186730531108
42,-0.05000671851044586
43,-0.005099134922358071
44,0.10768449848284806
45,-0.11198718574217946
46,-0.05054992480709949
47,0.19870099834652255
48,-0.011962281991568386
49,-0.0800922201511791
50,-0.20015877381054822
51,-0.20942023786081596
52,-0.22155435356810796
53,0.13284056720431953
54,-0.2041476833252248
55,0.013806083680696857
56,0.06100722724569711
57,0.02999509146838802
58,-0.07589712588583197
59,0.39506550128594914
60,-0.08921283078210826
61,0.15112744077147408
62,-0.20647823436269308
63,0.04877237096401846
64,0.10328246268602115
65,0.019605653634711197
66,0.07050361681161056
67,-0.07601627820938972
68,0.002913512435707743
69,-0.026466145334895587
70,-0.2770226976194356
71,-0.010128555139678893
72,-0.03554094571322196
73,-0.02007351309840191
74,-0.1819266920313771
75,-0.2582742122193286
76,-0.023050424597653968
77,-0.06595266319320676
78,0.033793349386610876
79,-0.0014124957747528141
80,0.020692997113767084
81,-0.2038226906141584
82,0.15606397858357818
83,0.2165036391197843
84,0.027785438215898146
85,-0.10374168856071167
86,0.2671108497776463
87,0.15327344390857345
88,0.13969843488949854
89,0.9999934140694577
90,-0.08191955993002739
91,-0.003952972945457115
92,-0.1467048271583488
93,-0.0025731523967002395
94,0.046342909199627594
95,0.02919012466751094
96,-0.23449097832012422
97,-0.004933643703232597
98,0.3165125555113316
99,-0.060893142422053924
100,0.028624464284595093
101,-0.041044686777234
102,0.02520286776186398
103,0.02150067854084653
104,-0.08933846294659863
105,0.10188579899722021
106,-0.032072248011089446
107,-0.05295280730903702
108,-0.11350081633030432
109,-0.18720360526941315
110,-0.1757312487687234
111,-0.011879165613994243
112,-0.18650287012124972
113,0.16990376541880656
114,-0.11632482115372393
115,0.12494117454944074
116,-0.0713550900335481
117,-0.09912236772305405
118,0.06552952547218513
119,0.027182371270920005
120,0.07529208378003296
121,-0.07381650188838372
122,0.07050092626304076
123,-0.05681270291477981
124,0.06344819773870057
125,0.012539939345367106
126,-0.022952953011023687
127,-0.031284382479821196
128,-0.021940794648973052
129,0.029779399277986705
130,0.05276725117417985
131,-0.13325494845733007
132,-0.040863813088691296
133,-0.1697713579492729
134,-0.2543588025690062
135,-0.2659043283522503
136,-0.07858185449046434
137,-0.018536514835078698
138,0.06536639217830531
139,0.22454029386912774
140,-0.041403020070789935
141,-0.2517075478037955
142,-0.09324291514271174
143,-0.01332283163360781
144,0.12897606491996905
145,-0.18585495818693018
146,0.06590100565465302
147,0.2878414340309111
148,0.02447373606803508
149,-0.14629142632180664
150,0.16020118351705592
151,0.020958235361990322
152,-0.038533018417583643
153,-0.034351342680936016
154,-0.13481852822029497
155,0.05832793633536395
156,0.3416657292371511
157,-0.039807193344471144
158,0.25879612257706747
159,-0.016403468155720188
160,-0.062223916001009544
161,0.36548818087472446
162,-0.0351405442557811
163,-0.07773928639626744
164,-0.024926226171371836
165,-0.11220307731536565
166,-0.07088774031839634
167,-0.09893320558128123
168,0.1004899458671214
169,0.01411129214172136
170,-0.08017030316996379
171,-0.2217393610306977
172,-0.0014605453065633257
173,0.10734118722839173
174,0.10925930695746049
175,-0.16889192978044942
176,0.1014146306634319
177,-0.020102740482897917
178,0.027359398152997174
179,0.18641063462069962
180,0.1357303596577496
181,-0.04886560127106976
182,0.018916899525167754
183,0.04548438876086898
184,0.0008429360856321509
185,0.13817097491954236
186,0.025784815707815135
187,-0.13553843440240584
188,-0.27289626508779596
189,-0.047833881078130844
190,0.10919667502461916
191,-0.033502657726596594
192,-0.0882007525410819
193,0.13569998522299065
194,0.049664629188540886
195,0.053972119959874464
196,0.10711539340465626
197,-0.10559495427180789
198,-0.001814953000759591
199,-0.008605885535991438
200,0.11583175041526036
201,-0.03740405597668148
202,-0.3463958064150984
203,0.13566262112671204
204,0.05044029247094741
205,-0.10672346136536537
206,-0.008864859860954762
207,0.028140242929988936
208,-0.1382490264919916
209,0.08142430988456045
210,-0.008390359144705824
211,0.002138326354167743
212,0.05426376861820993
213,-0.03238645465774628
214,-0.20487878755819153
215,-0.23242879478060816
216,0.01101854998416299
217,-0.10489610289480143
218,-0.09302812318659141
219,0.11516856312844856
220,-0.11323472809748204
221,0.016518224089530263
222,-0.060627721884454935
223,-0.01586935007888148
224,-0.09525561270633405
225,0.06552596028298963
226,-0.017208165740709012
227,-0.08093686779995264
228,-0.24079457148742395
229,0.04420255950942127
230,-0.055573278339728104
231,0.03397026267389671
232,-0.17331594922107355
233,0.03675905438333081
234,-0.12551474100565238
235,-0.09853657749662084
236,-0.04020300687401247
237,-0.07031730024381934
238,0.04536728539855271
239,-0.020487701846467494
240,0.006077443298559562
241,0.019903860397101607
242,-0.2772432775865269
243,-0.021557135072947962
244,-0.02621635020006749
245,0.011372583260142049
246,0.025828757914387542
247,-0.0222556394799762
248,-0.07107073849839461
249,0.030089016829559005
250,0.04217927623305824
251,-0.1868639228924735
252,-0.024037959234559415
253,-0.0253755473086686
254,-0.22924692478290148
255,0.36782435361038035
256,-0.22186737551055938
257,0.03370177805931059
258,-0.22297908678923822
259,-0.12309731294063181
260,-0.07189654867972617
261,-0.13510742379670326
262,0.01510733445306348
263,0.12081028727651809
264,0.05445789507881068
265,-0.07702565684718397
266,-0.029061781647958602
267,-0.015903937032458654
268,-0.055072065135784845
269,0.2745469267777453
270,0.06254096688212606
271,-0.12975120662959785
272,0.01279671295457684
273,0.08650546156714224
274,-0.03845590885186114
275,0.13499253860176405
276,-0.22684808938425
277,-0.034967838625717555
278,0.31366144147514247
279,0.03394574001172059
280,0.037532814479696135
281,-0.0729662928710963
282,-0.011682267778786561
283,-0.006221038361892143
284,-0.0015362516463481855
285,0.07834164827924125
286,0.07967132446928374
287,0.08916914389517244
288,0.39299062674040536
289,-0.1377503377055904
290,-0.1109275968703611
291,0.04221497070783037
292,-0.00047458554129679105
293,0.09696353326307429
294,0.17383742819663292
295,-0.003675823464423501
296,0.05296383327629839
297,-0.2412361991738559
298,0.15099105539034313
299,-0.0960018415803994
300,-0.024485662671878947
301,0.002995706705155421
302,-0.0810872818526347
303,-0.014696090964146919
304,0.03496689556305342
305,0.029309762496708906
306,-0.061866973335781235
307,-0.00045929964147513455
308,-0.14632497848021578
309,0.020317427931099013
310,0.01664649669861844
311,-0.012768429033482314
312,0.03997514146988288
313,0.10241384207617928
314,0.06502092019362793
315,0.011553272935945968
316,-0.05086039341147993
317,-0.008630636445214715
318,0.1723852730458724
319,-0.15339411091980829
320,0.014270394925322645
321,-0.04820707510074501
322,0.017654589561944267
323,0.006361731336926237
324,-0.040086535701921035
325,0.016246802378857308
326,-0.053956867516868706
327,-0.132709826775665
328,-0.08375895860806151
329,0.00901493822353909
330,0.05254522716756517
331,0.013675275115184656
332,-0.10110252334700727
333,0.03794901196277311
334,0.1077716521099911
335,-0.08422616154225353
336,-0.07804369609826751
337,-0.15932071701228792
338,-0.1948935802618215
339,0.01295402910521314
340,0.21683776411259992
341,-0.21832380668427995
342,-0.031862466137880185
343,-0.0694772394441507
344,0.13452510227463074
345,0.0756251172078476
346,-0.06298620563916349
347,0.06270436806651539
348,0.005266859155703393
349,0.33385052426709727
350,0.9199752254472688
351,-0.018523574378609773
352,0.08296698951127662
353,-0.052945540600310134
354,-0.2095533215203455
355,-0.0940204764578353
356,-0.06933766273398093
357,0.04033226374654361
358,0.22035231733717203
359,0.02115135486536449
360,-0.05852315949963579
361,0.7935789043316668
362,-0.06743503363100982
363,0.15272752677303505
364,-0.1059853667244826
365,-0.13742345454243435
366,-0.07371493099722132
367,0.023340768913765717
368,-0.0483830507935164
369,-0.04418096379089153
370,-0.04719269357002048
371,0.014165011398063695
372,-0.11151294677580838
373,-0.014057061214822426
374,0.04891548623431921
375,0.03889284862482438
376,-0.013631875536830174
377,-0.16305031624540456
378,-0.03319223746377699
379,-0.17418762390831324
380,-0.4163840603142727
381,0.16516265158621132
382,-0.029370359093654163
383,-0.12391756549148711
384,0.08681491623959889
385,-0.04815991889693359
386,-0.2638057813078153
387,-0.003993206826639455
388,-0.09837214463451091
389,-0.02452601124451512
390,0.044604800352575504
391,-0.10383219119124085
392,-0.23183098984601797
393,0.07864316473543408
394,0.019994814750607773
395,0.005861914333988827
396,0.040309316431184815
397,0.13588675314426316
398,0.3214285134817413
399,-0.08277755065288032
400,-0.04679697447613383
401,0.13895189798109578
402,-0.0001612649437749323
403,0.054607265063858317
404,-0.021461594400506104
405,-0.2942196311200121
406,-0.01357480456161803
407,-0.036842948112504964
408,-0.02578581437156511
409,0.09847950460851047
410,-0.11482170038404096
411,-0.028584650419989886
412,0.07068884998712292
413,0.010352902303921888
414,-0.03832582390984489
415,-0.015282242806019475
416,-0.02320042966491041
417,0.25789709464614635
418,0.04025257091554182
419,0.07286170421579828
420,-0.13124517714363074
421,0.014075698068310702
422,-0.036280895139886936
423,-0.20924652883893147
424,0.02325156869015753
425,-0.035436992221277004
426,0.28978089464423745
427,0.06761800293298185
428,-0.22310935612046318
429,0.0012894842826535332
430,0.7462552517266092
431,-0.005659689386359569
432,-0.07092780235095458
433,0.12970176214870136
434,0.04748849971490195
435,0.009653279384789323
436,0.051894195108018605
437,0.03842901106554178
438,-0.04579549082163235
439,-0.25104677453023033
440,0.01511930559471458
441,0.007220362855546106
442,0.11740627753642936
443,0.06847349478442376
444,-0.06975450366919786
445,6.919061111336917e-05
446,0.16206641902877064
447,0.12235748021875385
448,-0.14919058655152115
449,0.1409730128743109
450,0.0805726063695135
451,-0.016022826145971333
452,0.038114847850806384
453,0.005064375560993647
454,-0.17702394055449172
455,9.368664221207505e-05
456,0.018506259425504656
457,0.9849375432464857
458,-0.03569735832133889
459,-0.03689853393700831
460,0.07300639149803669
461,-0.1326948945272729
462,-0.002169598247309002
463,0.06340673736550072
464,0.021746704608969044
465,-0.04403310963793818
466,0.18856273711949542
467,0.04668099072589565
468,-0.18774807380341504
469,0.047296000713724355
470,-0.062065959616588715
471,0.08042994876270568
472,0.20336641283639198
473,0.05630702517384789
474,0.012000785732432875
475,0.08914345775475109
476,-0.0915969200974907
477,-0.11751426976782516
478,-0.05456331669936759
479,0.15276253570460518
480,0.13461055731495672
481,-0.0004180718515544306
482,0.07161005485572858
483,-0.004776420862475665
484,0.08936998195097358
485,-0.043613210058051
486,-0.085908169565142
487,-0.09668339225332308
488,0.04478596477428977
489,0.0257272437979415
490,0.20329298453253983
491,-0.00465832134468497
492,0.18280341060895122
493,-0.10261589578669093
494,0.08145946293782592
495,-0.11642227056679878
496,0.05482484822134352
497,-0.09295796468888634
498,-0.09959533894756877
499,0.08729924840772448
