,0
0,-0.9999997615814353
1,0.9999997615814359
2,-0.9999997971840758
3,-0.999999761581436
4,0.999999761581436
5,0.9999997615814353
6,0.9999997971840756
7,0.9999997615814356
8,-0.9999997615814353
9,-0.9999997971840757
10,-0.9999997615814367
11,0.9999997615814359
12,0.9999997615814368
13,0.9999997971840755
14,0.999999761581436
15,0.9999997615814353
16,0.9999997615814356
17,0.9999997615814368
18,-0.9999997971840753
19,0.999999761581436
20,0.9999997971840751
21,0.9999997971840748
22,-0.9999997971840744
23,0.9999997971840756
24,-0.9999997971840756
25,-0.9999997615814367
26,-0.9999997615814364
27,-0.9999997615814367
28,-0.9999997615814353
29,-0.9999997615814353
30,-0.9999997971840758
31,-0.9999997615814379
32,-0.9999997971840751
33,0.999999761581436
34,0.999999797184075
35,-0.9999997971840756
36,0.9999997615814356
37,0.9999997971840744
38,-0.999999761581436
39,-0.9999997971840755
40,-0.9999997615814356
41,0.9999997615814356
42,0.9999997971840748
43,-0.9999997615814356
44,-0.9999997971840757
45,0.9999997971840751
46,-0.999999761581436
47,-0.9999997615814353
48,-0.9999997971840756
49,-0.9999997971840744
50,-0.9999997615814358
51,-0.9999997971840755
52,-0.9999997971840747
53,0.9999997615814356
54,0.9999997971840755
55,0.9999997615814359
56,-0.9999997615814354
57,0.9999997615814356
58,0.9999997971840756
59,0.9999997615814368
60,0.9999997615814353
61,-0.9999997615814353
62,0.9999997971840756
63,0.9999997971840746
64,0.9999997971840757
65,-0.9999997971840746
66,-0.9999997971840744
67,-0.9999997615814368
68,-0.9999997971840744
69,-0.9999997971840746
70,-0.999999761581436
71,0.9999997615814359
72,-0.9999997971840746
73,-0.9999997615814353
74,0.999999761581436
75,0.9999997971840753
76,0.9999997971840758
77,0.9999997971840751
78,-0.9999997971840756
79,-0.9999997971840746
80,-0.9999997615814367
81,0.9999997971840752
82,-0.9999997971840755
83,0.9999997971840745
84,-0.9999997971840751
85,0.9999997971840756
86,0.9999996285967048
87,0.9999997615814356
88,0.9999997615814378
89,0.9999997615814364
90,0.9999997971840757
91,-0.9999997971840744
92,0.9999997971840745
93,-0.9999997971840746
94,-0.9999997615814359
95,-0.9999997971840745
96,0.9999996285967058
97,0.9999997615814367
98,0.999999761581436
99,-0.9999997615814356
100,-0.9999997971840754
101,-0.9999997971840763
102,0.9999997971840758
103,-0.9999997615814356
104,0.9999996285967048
105,0.9999997971840758
106,0.9999997615814359
107,0.999999761581436
108,-0.999999797184075
109,0.9999997971840756
110,-0.9999997615814369
111,-0.9999997971840744
112,-0.9999997971840763
113,0.999999761581436
114,0.9999997971840751
115,0.9999997971840748
116,-0.999999761581436
117,-0.9999997971840748
118,0.9999997971840745
119,-0.9999997971840745
120,-0.9999997971840745
121,0.9999996285967058
122,-0.9999996423721641
123,0.999999797184075
124,0.9999997971840748
125,-0.9999997971840751
126,0.9999997615814368
127,0.9999996285967053
128,-0.9999997971840751
129,-0.9999997971840758
130,0.9999997615814368
131,0.9999997615814368
132,-0.9999996423721655
133,-0.9999997971840758
134,-0.999999761581436
135,0.9999997971840748
136,-0.999999797184075
137,-0.9999997971840745
138,0.9999997615814359
139,-0.9999997615814356
140,0.999999761581436
141,-0.9999997615814367
142,0.9999997971840748
143,-0.9999997971840758
144,0.999999761581436
145,0.9999996285967051
146,0.999999797184075
147,-0.999999761581437
148,-0.9999997971840748
149,0.9999997615814353
150,-0.9999997971840758
151,-0.9999997971840748
152,0.9999997971840744
153,0.9999997615814371
154,0.9999997971840746
155,-0.9999997971840753
156,0.9999997971840758
157,0.9999997971840744
158,-0.9999997615814356
159,-0.9999997615814368
160,0.9999997615814358
161,-0.9999997971840744
162,-0.9999997971840744
163,0.999999761581437
164,-0.9999997971840755
165,-0.999999761581436
166,-0.999999761581436
167,0.9999997971840751
168,-0.9999997615814356
169,0.9999997971840745
170,0.9999997615814368
171,0.9999997971840747
172,-0.9999997971840755
173,0.999999797184075
174,0.9999997971840744
175,0.9999997971840756
176,-0.9999997615814368
177,-0.9999997615814356
178,0.9999997971840758
179,0.9999997615814359
180,-0.9999997615814356
181,-0.9999997615814367
182,0.9999997971840744
183,-0.9999997971840744
184,0.9999997971840756
185,-0.9999997971840751
186,0.9999997615814358
187,-0.9999997971840751
188,-0.9999997971840746
189,-0.9999997615814353
190,0.9999997615814356
191,-0.999999761581436
192,-0.999999761581436
193,0.9999997615814368
194,0.9999997615814357
195,0.9999997615814368
196,-0.9999997615814367
197,0.9999997971840744
198,-0.9999997615814356
199,-0.9999997971840746
200,0.9999997615814353
201,0.9999997971840753
202,0.9999997615814367
203,-0.9999997971840746
204,-0.9999997971840751
205,-0.9999997971840746
206,-0.9999996285967071
207,0.9999996285967071
208,0.9999997615814353
209,-0.9999997615814358
210,0.9999997971840748
211,0.9999997971840755
212,-0.9999996285967057
213,0.9999997615814353
214,0.9999997971840757
215,-0.9999997971840746
216,-0.9999997971840746
217,-0.9999997615814368
218,-0.9999997971840745
219,0.999999761581436
220,-0.999999761581436
221,0.9999997971840751
222,0.9999997615814353
223,-0.9999997971840758
224,-0.9999997971840755
225,0.9999997615814368
226,0.999999761581436
227,-0.9999996285967057
228,-0.9999997615814367
229,-0.9999997971840748
230,-0.9999997971840752
231,0.9999997971840746
232,-0.9999997615814353
233,0.9999997971840744
234,0.9999997615814368
235,-0.9999997615814367
236,0.9999997971840751
237,0.9999997971840757
238,-0.999999797184075
239,0.9999997971840744
240,0.9999996285967057
241,0.9999997971840746
242,-0.9999997615814356
243,-0.9999997615814353
244,-0.9999997615814359
245,-0.9999997971840758
246,0.9999997615814359
247,-0.9999997615814356
248,-0.9999997971840751
249,-0.9999997971840769
250,-0.9999997615814353
251,-0.9999997615814368
252,0.9999997971840746
253,-0.9999997971840744
254,0.9999997615814353
255,-0.9999997615814356
256,0.9999997615814356
257,0.9999997615814367
258,0.999999761581436
259,0.9999997615814356
260,-0.9999997971840745
261,-0.9999997971840746
262,-0.9999997971840745
263,0.9999997971840744
264,-0.999999797184075
265,-0.9999997971840745
266,-0.9999997615814367
267,0.9999997615814368
268,0.999999642372165
269,-0.9999997971840751
270,0.999999797184075
271,-0.9999997615814356
272,-0.9999997971840748
273,-0.9999997615814367
274,0.9999997615814359
275,-0.9999997615814353
276,-0.9999997615814356
277,0.9999997615814353
278,-0.999999761581436
279,0.999999761581436
280,0.9999997971840748
281,-0.9999997615814368
282,-0.9999997971840752
283,-0.9999997615814364
284,-0.9999997971840746
285,-0.999999761581436
286,0.9999997971840744
287,0.9999997971840756
288,0.9999997971840744
289,0.999999761581436
290,0.9999997615814371
291,-0.999999761581436
292,0.9999997615814356
293,-0.9999997971840751
294,-0.9999997971840746
295,0.9999997971840752
296,-0.9999996285967052
297,0.9999997971840758
298,0.9999997971840769
299,-0.9999997615814353
300,-0.9999997615814368
301,0.9999997971840751
302,0.9999997615814356
303,0.9999997971840758
304,0.9999997615814353
305,0.9999997971840745
306,0.999999642372165
307,0.9999997971840756
308,0.9999997971840746
309,-0.999999797184075
310,0.9999997971840748
311,0.9999996285967058
312,-0.9999997971840758
313,0.9999997615814358
314,0.9999997615814366
315,0.9999997615814368
316,0.9999997615814367
317,0.999999797184075
318,0.999999761581436
319,0.9999997971840746
320,-0.999999761581436
321,-0.9999997615814368
322,0.9999997971840756
323,-0.9999997615814356
324,0.9999996285967058
325,0.9999997615814356
326,0.999999761581436
327,-0.999999761581437
328,0.999999761581436
329,-0.9999997971840769
330,0.9999997615814367
331,-0.9999997615814354
332,0.9999997971840755
333,-0.999999761581436
334,0.999999761581436
335,0.9999997971840753
336,0.9999997971840745
337,0.9999997615814353
338,0.9999997971840755
339,-0.999999761581436
340,-0.999999761581436
341,0.9999997971840748
342,-0.9999997615814358
343,0.9999997971840755
344,0.999999797184075
345,0.9999997615814353
346,0.9999997615814368
347,0.9999997615814368
348,-0.9999996423721642
349,0.9999997615814359
350,0.9999997971840746
351,-0.9999997615814356
352,-0.9999997971840756
353,-0.9999997971840748
354,-0.9999997971840758
355,0.9999997615814368
356,-0.9999997615814356
357,-0.9999997971840751
358,-0.9999996285967051
359,-0.9999997971840753
360,0.999999797184075
361,-0.9999997971840746
362,0.9999997615814368
363,0.999999761581436
364,0.9999997971840758
365,-0.9999997971840746
366,0.9999997971840763
367,0.9999997971840752
368,-0.9999997971840752
369,0.9999997615814368
370,0.9999997971840758
371,-0.9999997971840758
372,0.9999997615814354
373,-0.9999997971840746
374,0.9999997615814354
375,-0.999999761581436
376,0.9999997615814356
377,0.999999761581436
378,0.9999997971840756
379,0.9999997971840756
380,0.9999997615814362
381,-0.9999997615814368
382,0.9999997615814368
383,-0.9999997615814368
384,-0.9999997971840745
385,0.9999996423721638
386,-0.9999997615814353
387,0.9999997971840748
388,-0.999999797184075
389,-0.999999797184075
390,-0.9999997615814369
391,-0.9999997615814356
392,0.9999997971840758
393,-0.9999997971840744
394,0.9999997615814368
395,0.9999997971840753
396,0.9999997615814368
397,0.9999997615814368
398,-0.9999997971840756
399,-0.9999997615814368
400,-0.9999996285967058
401,-0.999999797184075
402,0.9999997971840752
403,0.9999997971840758
404,0.9999997971840745
405,0.9999997615814371
406,-0.9999997615814353
407,-0.9999997971840746
408,-0.9999997971840748
409,0.9999997971840755
410,-0.9999997615814356
411,-0.9999997971840758
412,0.999999761581436
413,0.9999997615814357
414,-0.9999997615814353
415,-0.9999997971840753
416,0.9999997615814359
417,0.9999997615814368
418,-0.9999997971840744
419,-0.999999761581436
420,-0.9999997971840758
421,-0.9999997971840753
422,-0.999999761581436
423,0.9999997971840744
424,-0.9999997971840756
425,-0.9999996285967051
426,0.9999997971840755
427,-0.999999761581436
428,0.9999997615814353
429,-0.9999997615814367
430,-0.9999997615814378
431,-0.9999997971840758
432,0.9999997615814353
433,-0.9999997971840755
434,0.9999997971840746
435,-0.9999997971840753
436,0.9999997615814359
437,0.9999997615814353
438,-0.9999997971840755
439,-0.9999997615814356
440,-0.9999997971840758
441,0.9999997971840744
442,-0.9999997615814369
443,0.9999997615814353
444,0.9999997971840744
445,0.9999997615814368
446,-0.999999642372165
447,-0.9999997971840753
448,0.9999997615814353
449,0.9999996285967058
450,-0.9999997615814371
451,0.9999997615814356
452,-0.9999997971840748
453,-0.9999997615814356
454,0.9999997615814379
455,0.9999997971840755
456,0.9999997971840746
457,0.9999997615814356
458,-0.9999997971840755
459,-0.9999997615814368
460,0.9999997971840752
461,-0.9999997971840744
462,0.9999997971840746
463,0.9999997971840757
464,0.9999997615814353
465,0.999999797184075
466,0.9999997971840756
467,0.9999997615814353
468,0.9999997971840746
469,-0.9999997615814357
470,0.9999997971840755
471,0.9999997971840756
472,-0.999999761581436
473,-0.9999997615814356
474,-0.9999997971840758
475,0.9999997615814353
476,-0.999999797184075
477,-0.9999997971840755
478,0.9999997615814366
479,0.9999997971840744
480,-0.9999997971840757
481,-0.9999997971840745
482,-0.9999997615814353
483,0.999999761581436
484,0.9999997971840755
485,0.9999997615814356
486,0.9999997615814364
487,-0.9999997971840756
488,-0.9999997615814356
489,-0.9999997971840746
490,-0.9999997971840744
491,0.9999997615814367
492,0.9999997615814356
493,-0.9999997971840746
494,-0.9999997615814356
495,0.9999997615814369
496,-0.9999997971840751
497,-0.9999997971840746
498,-0.9999997971840745
499,0.999999761581436
