,0
0,0.018300208853085222
1,-0.01668856697054615
2,0.024245781212133333
3,-0.016151573566936875
4,0.01351572873861339
5,-0.019710302371175242
6,0.038648845722553365
7,0.006433637544306703
8,-0.05219173213088149
9,0.027035824942018408
10,-0.031229256296604856
11,0.012198263678430524
12,-0.02089887303960356
13,-0.023049850205334753
14,-0.031676850437106
15,-0.008584377836774432
16,0.006019151535566519
17,0.033387776790271356
18,-0.007586634944681109
19,-0.016129157200528214
20,-0.02109975651344859
21,0.028353801575806328
22,-0.016678840563921465
23,-0.014760574174631325
24,0.0007279637508591612
25,-0.011118824860946336
26,0.01937467893264604
27,0.01056235728038292
28,-0.05404536917907992
29,-0.0029681683318586
30,0.03450998749724439
31,0.007444914004786091
32,0.0034484768852025213
33,0.0044632870590943265
34,0.059467825473141646
35,0.029239476352868974
36,0.022525822405101453
37,-0.009677869797802554
38,-0.020965508233465893
39,-0.028606494444319622
40,-0.021070140292139054
41,-0.02292299477271831
42,0.027238896162800542
43,0.046096194362253574
44,0.017957494946848687
45,0.008213268189787092
46,-0.024655002145798202
47,0.043926829417433096
48,-0.00836265975341991
49,0.03409526895140392
50,-0.03175807784672109
51,-0.0369374134623596
52,-0.05690626649334225
53,-0.021435125124810224
54,-0.03772802278512567
55,-0.02229133867194278
56,-0.05567086651321887
57,0.0007827984462110095
58,-0.02358616499705409
59,0.0265283611960936
60,-0.03179603820341695
61,-0.004103561185794894
62,-0.024030202111566583
63,-0.001852516252404856
64,0.021490059908775443
65,0.004039877951938588
66,-0.0296926151137617
67,-0.033511277395054176
68,0.0313127206588833
69,-0.014659771960354697
70,0.06807542899102359
71,-0.012260242645411819
72,0.008978039094555811
73,-0.01361488994880538
74,0.04023333023657612
75,-0.0046435167904371345
76,0.05568217598493527
77,0.013511216631726452
78,0.031431380437648794
79,0.003906403334787806
80,-0.020823781081928783
81,0.0494261564980913
82,0.054727050224525745
83,-0.014107107969694067
84,-0.010091590272856749
85,0.0015515572208091091
86,-0.00968950404872028
87,0.0005686125299084327
88,0.002865273973466952
89,-0.0164586729938911
90,-0.014462706477077444
91,-0.020809841053092838
92,0.028728807742765313
93,-0.025842041413526216
94,0.0035051419656475097
95,-0.015644586714362467
96,0.008070212167246507
97,0.03393889168575134
98,-0.02463376305776235
99,0.010487836091091496
100,0.014487960519546823
101,0.0011877165966296607
102,-0.008469415553607761
103,-0.006187642590739513
104,-0.023913624884844185
105,0.003709853536303336
106,0.05432760974768336
107,0.03455460722937694
108,0.016412122050693912
109,0.02859107537863321
110,0.0004498133795915807
111,-0.021585828951237986
112,-0.04996929612392113
113,-0.016231043944506758
114,0.034965211233040305
115,-0.0025880035850011068
116,-0.00047607267473477165
117,0.007050846885212748
118,0.023109052182019255
119,-0.013905794530832575
120,0.01662832927967881
121,0.02466595908043003
122,-0.025224551237541602
123,0.022709056123131052
124,0.03839399890411725
125,-0.007437851662985041
126,0.013776035086949709
127,-0.018211021922190852
128,-0.007511955671961087
129,0.002872073695132555
130,0.01662749397350384
131,0.014893465452158297
132,0.008380513700525415
133,-0.01282843681533731
134,0.02752266891506882
135,0.021700112300028933
136,0.008957097622476746
137,0.03365707873065574
138,0.009875260932339598
139,-0.02262515779947465
140,-0.008014749791782138
141,-0.009534548592820036
142,-0.005548279286880509
143,-0.019939177316357946
144,0.012270371566284336
145,-0.03110751773087589
146,-0.011797860126882468
147,-0.05364404066565036
148,-0.0248656135575297
149,0.00555320419383776
150,0.008121695151086704
151,-0.031677458219602404
152,-0.03936668994560039
153,0.02379212967045346
154,0.004714061742487563
155,-0.046158254958628256
156,-0.009889344242594179
157,-0.005918276684612643
158,0.016750244755460386
159,-0.06105309013209337
160,-0.034674013442402604
161,-0.018406504347490707
162,-0.023110341863185755
163,-0.010462056617683416
164,0.025106333920935538
165,0.013006760765997091
166,0.02961312370099473
167,0.009802623857750693
168,0.012847600741859245
169,0.026176485234460853
170,-0.010983845578599544
171,0.050583468490867804
172,-0.014941187195618176
173,-0.02342136559625978
174,0.004291208968289172
175,0.02337070971651571
176,-0.04771325428143936
177,0.03796974890454008
178,-0.0585633747146517
179,0.015655917678928332
180,-0.008487602928486096
181,0.03731627504868627
182,0.010453929322055782
183,0.012164556800970196
184,-0.005903595183694594
185,-0.0005130849817927361
186,-0.023000960906198433
187,0.04977581264840608
188,0.03771534097643956
189,0.032393301679773064
190,0.0021103345338107787
191,0.0021658633763492006
192,0.03671952007807866
193,0.04373917250572139
194,0.0036166772835608957
195,0.016928761186565278
196,0.03944717190893091
197,-0.050752701888737886
198,0.005952438799837721
199,0.004945581172297549
200,-0.03979123003959665
201,-0.016731338829796265
202,0.005635747722862357
203,0.00846709482810515
204,0.037607102964042294
205,0.007402237599917973
206,0.01891013600344016
207,0.01271518411327888
208,-0.04365499665524215
209,-0.010991199375628018
210,-0.026933727828560745
211,-0.05170602670194885
212,-0.039109790079932136
213,0.043552866642271634
214,0.019791116377868137
215,0.03230805595709915
216,-0.009127692649769589
217,-0.035211589943378745
218,0.01108655889800639
219,0.006520376164491467
220,-0.014148533789047053
221,0.0094158967900119
222,-0.024888049260860606
223,0.020400298763063734
224,0.014107677301529568
225,-0.013731688931636716
226,-0.018127999159166935
227,-0.05181118154966105
228,0.048805945343310043
229,0.0028216894381806407
230,-0.01723315701931335
231,0.002820876044665077
232,0.0026212251213734647
233,0.0018795496182729228
234,0.008415065517291289
235,0.0025333150864583036
236,0.006856615294036045
237,0.049310290715861356
238,0.004381653973606518
239,-0.012479709402539818
240,0.005864858058449815
241,0.024825078526275406
242,-0.008180522679119819
243,0.00822529148290771
244,0.010817661327276316
245,-0.01598763099213118
246,-0.02206984364215687
247,-0.005176470223272108
248,0.008170267809750813
249,0.02142788413540185
250,-0.014054700825082554
251,0.02249549927585983
252,-0.01502882879258439
253,-0.01234292568409102
254,-0.00046487518684368984
255,-0.012729156111084014
256,0.0030274554907903694
257,-0.03248225324243331
258,-0.022303004790943826
259,-0.012627499064119715
260,-0.028405837305804413
261,-0.03263447596266711
262,0.016059861968656455
263,-0.019759435357395754
264,0.03184567210714499
265,0.04536646711172257
266,0.007301374774482077
267,-0.01985411798967
268,0.008443821738196824
269,0.02338823833727519
270,-0.011812453963068634
271,-0.007000751137689353
272,-0.014072323261413944
273,-0.002648968880535795
274,0.002756177451244915
275,0.0009202195728175103
276,-0.01393350237204906
277,0.034145985182315035
278,-0.03008072752874961
279,0.006983027308842406
280,0.02961926222743737
281,0.0054169552052176564
282,-0.017230081634296027
283,0.008782853036448313
284,0.05578394008058671
285,0.037494126669671626
286,0.016327649696982582
287,0.02578966117816041
288,0.005892384547620037
289,-0.008000412894875604
290,-0.01690936217274017
291,-0.005262321436959698
292,-0.016850386293654453
293,0.025417296946191142
294,0.02545409188194034
295,-0.033106004803895916
296,0.044359023812798465
297,-0.0027447233133607255
298,-0.047353139123160415
299,0.022612358463297715
300,-0.00931809794105265
301,0.011677891609308617
302,-0.0034118150592259075
303,0.006379264320712636
304,0.0262387551789937
305,-0.05317857958541914
306,-0.06786990655999624
307,-0.0032069868153683286
308,-0.06246540952293423
309,-0.02889380260554473
310,-0.017531505888983882
311,-0.027837574265139543
312,0.04268667456760705
313,-0.003126469243254889
314,-0.0073203581125464365
315,-0.04344181004956806
316,0.02027327539992673
317,0.031572571489370024
318,0.021338543818208783
319,-0.03733887664241381
320,-0.014229473882122992
321,-0.0737708087852372
322,0.015626284297220676
323,0.03140027973899934
324,-0.011526863279427894
325,0.06322793719577548
326,-0.03852365023687812
327,-0.026447115306690725
328,-0.00034689344699611463
329,0.020266141629811024
330,-0.009184511771097314
331,0.03695436259738968
332,0.004446772468790387
333,-0.010602915448412912
334,0.05850940269680312
335,-0.0019498303952688
336,0.030001778729783803
337,-0.005384667051916046
338,-0.026755518204062443
339,-0.024164726460274805
340,-0.04054950760134188
341,0.034769275234471306
342,0.01193103570493099
343,0.027438402065733832
344,-0.015974144516876097
345,-0.00449220260386511
346,-0.01593602015959307
347,0.005828632879913927
348,0.024621008247114433
349,0.004497403818062648
350,-0.009202524356543257
351,0.011604353403648763
352,0.0032335673125518955
353,0.03151406931899413
354,-0.004157070196930424
355,-0.0032635482542229394
356,0.007874658966699663
357,0.02480303833097822
358,0.028100867919410917
359,-0.0066865248965335385
360,0.06685143413986377
361,-0.033937669933618284
362,0.018990607902339512
363,-0.014170047834742197
364,0.05047492855607165
365,-0.0474403778502518
366,-0.04940425106362729
367,-0.034084656772386084
368,0.02069341662922351
369,-0.002915456269388609
370,0.020576357633259254
371,-0.002249777796563341
372,0.005399535935736071
373,0.03194707909132061
374,-0.024934050770985757
375,0.03197548560174586
376,0.034250749695647634
377,-0.024201446101835222
378,-0.007210807486492339
379,-0.012603146339327805
380,-0.050898385482465225
381,-0.009907221407427138
382,-0.02359259892976027
383,-0.018129256904012327
384,-0.031768577669549845
385,0.011454965965042415
386,-0.0222737686839101
387,-0.002636669122074612
388,-0.016943249858123996
389,-0.03323372859868373
390,0.0290068188733517
391,-0.02728876110241943
392,0.005336139741345487
393,-0.007984616299656654
394,0.01875204756405299
395,0.04007973239430322
396,-0.012726162997861973
397,-0.018843633855914685
398,-0.020581460004245322
399,-0.056027390088965
400,-0.002309364075409972
401,0.002937169143718943
402,0.0119596804466257
403,0.03079167012013385
404,0.009021847007271806
405,-0.01624759478463539
406,0.00362637373960916
407,-0.004376238648005827
408,0.0058189277713525805
409,-0.012162424405431773
410,-0.03207593002910964
411,-0.004028857010123718
412,0.014778136452124785
413,0.02468635087294002
414,-0.007078561427683856
415,0.034820606816894376
416,0.004541548799497523
417,-0.00815073047507032
418,0.049336470684405095
419,-0.03866571408303167
420,0.0018520894847194134
421,0.026300420479927186
422,-0.04047771219043461
423,-0.04232388765296514
424,-0.03003834564478686
425,0.022158067999320283
426,-0.0357550735855884
427,0.013139958181351207
428,0.018477196701468086
429,-0.012196066987160985
430,-0.004668139364074629
431,0.03384418071689859
432,0.021134726138712714
433,0.01876220077407121
434,-0.005430385667200253
435,-0.04817737117770726
436,0.022932438582831303
437,-0.028748961796806333
438,-0.058102694795759996
439,-0.05675223190094153
440,-0.008883933516615906
441,-0.036571275413272694
442,0.020327083057816622
443,0.013123020514814794
444,0.008528677748472787
445,0.0035905337393356534
446,-0.021632065855380512
447,-0.0036306404555197045
448,-0.042940492932646596
449,0.012764184076550101
450,0.03521541551288617
451,-0.00714098739009693
452,-0.0032260024434839045
453,0.026554549022130742
454,0.005459998498566959
455,-0.0060071611737837465
456,-0.04179913094351127
457,0.010032944273060836
458,-0.02271721701874229
459,0.05802620756959555
460,0.023969245264119806
461,-0.01929253848179602
462,0.00909503395645397
463,-0.008194788383482877
464,0.014592299418744549
465,-0.00034285975176589524
466,-0.012936997488357763
467,-0.01063122500460997
468,-0.03227187442040994
469,0.01529308868764755
470,-0.023902658546914847
471,0.03887630800061409
472,-0.0019025725467992976
473,0.028823963582230303
474,-0.016202871548557655
475,-0.0009838419006615012
476,0.004618267773899745
477,-0.0015687526004888007
478,-0.0018937682851067443
479,-0.02948723381803279
480,-0.004324817540806063
481,0.015249570232309762
482,-0.01714883796296129
483,-0.020766202494122775
484,-0.048010156948759874
485,-0.006040506656707658
486,0.01730023720130387
487,0.014648283470866847
488,0.01043380526478363
489,0.0533399336655666
490,-0.007377200110253239
491,0.03465937279083385
492,-0.004818689600768176
493,-0.00504172561829485
494,-0.005013400543475727
495,0.0041387896204541155
496,-0.013801019522843481
497,-0.00025774083644476004
498,0.01601364672560003
499,-0.0029683275158197114
