,0
0,0.5986776803241223
1,-0.22306050646798173
2,0.34262559689904876
3,-0.26046000670113323
4,-0.18085171888462717
5,0.3628454954945774
6,-0.5644187553111011
7,0.22650114784955516
8,0.33267118615748476
9,-0.016443678743822042
10,0.7856072740985395
11,-0.223226992047289
12,0.3060986983962533
13,0.8629636206360015
14,-0.023265017840353574
15,-0.16830938700038667
16,-0.8695928446999158
17,-0.09191024143377455
18,-0.5169987452904284
19,0.5533292526443405
20,-0.27719460425482917
21,-0.06749746151292364
22,-0.05225390867159218
23,-0.6703053340900383
24,0.3208451690808259
25,0.08149532047791691
26,-0.16662570776614283
27,0.3446152671104137
28,-0.9039488381460653
29,-0.620530523113892
30,-0.1772887878732925
31,0.6464527804636799
32,-0.1802600574042801
33,0.026919161247499573
34,-0.874049675632024
35,-0.6297826647925343
36,0.5591005150250986
37,0.7856049868786157
38,-0.21866275051859654
39,0.29157159078528394
40,-0.5620217886667885
41,0.40860946096105993
42,0.9587838777306272
43,0.6726338282812147
44,0.9996352479700172
45,-0.17322855438786813
46,0.0104864733139293
47,0.21854795892163623
48,-0.5956696701763337
49,-0.18099964110526676
50,0.3342019336282807
51,-0.08351879871838379
52,0.9801374495623393
53,0.19832997710468978
54,0.8551520065873157
55,-0.6297849363007766
56,-0.07502076565662177
57,-0.9574114560082959
58,0.9955940652806192
59,-0.07766175590584609
60,-0.9034214044551934
61,-0.03415731178899387
62,-0.9946197424938154
63,0.7790522270503598
64,-0.3395476005067298
65,-0.3696342479063031
66,-0.5134284701471522
67,0.6294915797878261
68,0.8781418359145365
69,0.18339045407311247
70,-0.5371777922639349
71,0.1815229811656111
72,0.030791747955896957
73,-0.32408102971164043
74,-0.05339106849831115
75,0.7681770947478868
76,0.007507646267354134
77,0.1222672486135581
78,-0.7053537703447869
79,0.09171012519578976
80,0.38601477373016546
81,0.5848427775303802
82,-0.15749328571461021
83,-0.1232296896449547
84,0.11444360172338129
85,0.9831604533776014
86,-0.2021369937259747
87,-0.8205900151318202
88,-0.992968891051899
89,0.32407126533521924
90,-0.319615742980738
91,-0.3047872549259628
92,0.1393238646292275
93,0.09326070684693823
94,-0.07703224405307368
95,-0.34545244237100525
96,-0.01225276662145121
97,-0.02870444521782713
98,-0.3463659345729702
99,-0.8576547476032746
100,-0.92018771362237
101,0.3230272355081417
102,-0.7521917687571754
103,-0.5632630626635179
104,-0.9974716408543367
105,0.0027806304361873953
106,-0.09241607793402733
107,0.8552204396386335
108,-0.9445764164649403
109,-0.9808114108444786
110,0.41086589734809476
111,0.4108659095825942
112,0.8571817977621855
113,0.341087681271858
114,-0.41366433244734896
115,-0.9172661140514042
116,-0.8542382024102995
117,0.12605452047368076
118,-0.0062770343876735035
119,0.2264253060297021
120,0.9067730572941785
121,-0.0421270016659139
122,0.6484956854548986
123,0.7843330572300415
124,-0.7402669584558565
125,0.6594395073079188
126,-0.7587518980284894
127,-0.34890201840560475
128,-0.64646016064929
129,0.03826810793473405
130,0.09455231539392248
131,0.07741373759684253
132,0.3746532679231279
133,0.1997529144932576
134,-0.9567787710446992
135,-0.9851111000034848
136,-0.22831899295744432
137,-0.9474009550004501
138,0.1138519181578046
139,0.10972700707449033
140,0.7763764690566047
141,0.7215792515151247
142,0.5834517999618077
143,0.7807724804473535
144,-0.35723783398448045
145,-0.9834690055205271
146,-0.8162455275367954
147,0.4688615279352284
148,-0.1157148619875536
149,-0.19959525995989635
150,0.2211922937805981
151,0.25264877302714195
152,0.659654515701671
153,0.6333657054567602
154,0.10646104103113135
155,-0.8181131203396985
156,-0.7819838482883956
157,0.08435762582049702
158,-0.6372355793822642
159,0.3447103132662939
160,-0.504538099755727
161,-0.34450812213021026
162,-0.6545652058497106
163,-0.5153824876023272
164,-0.1516548242638201
165,0.36956621639844034
166,-0.07733214438586579
167,-0.4880464193389544
168,-0.14333118278846743
169,-0.5478180583400994
170,-0.4026939450716605
171,0.3392568900427625
172,-0.0021624496099427425
173,-0.1696732616939123
174,-0.2205050749799422
175,0.5452151125889065
176,0.17995183843354148
177,0.036516474517411565
178,-0.9003407585633852
179,-0.042309219849285255
180,0.9838950975748632
181,0.021897892801834254
182,0.8222261097070563
183,-0.22853895347113468
184,0.07161383911784927
185,0.9949100652154332
186,-0.14386746529281327
187,0.23416891626452624
188,-0.6613312882863897
189,-0.05049897300937234
190,-0.010140384828794391
191,0.5354749776937109
192,0.10924715369550105
193,-0.624994854443612
194,0.761448009632257
195,0.0006259085272944662
196,-0.9464439791498079
197,-0.8719962828753622
198,-0.41016748676555626
199,-0.197117977779954
200,0.6652190924845233
201,-0.42149465858674345
202,0.5983049560104846
203,0.05330402817656961
204,0.7381611306341456
205,-0.09752233415553012
206,-0.6262260520077797
207,0.22468316096799898
208,0.07608028466913093
209,0.25113709984445076
210,0.6831100370849654
211,-0.014110050313615376
212,-0.8602150692532731
213,-0.15063741055250907
214,-0.09150646215175313
215,0.1133784677683419
216,-0.029754105064577072
217,-0.152360526235586
218,0.08708025245852687
219,0.980705332284087
220,0.7804857743523873
221,-0.6328056747467149
222,-0.49959047071240525
223,-0.3215942877279353
224,-0.016220395674558498
225,-0.6487859848372617
226,-0.6173325847789338
227,0.9081404600314105
228,-0.1585574177298746
229,0.05526807277267178
230,-0.02761982076358208
231,0.7682478023551429
232,0.11369463133281396
233,-0.5910678674830646
234,-0.23249747347085253
235,0.10076820217830554
236,-0.7351776738136634
237,0.007801918329197687
238,0.04897866414566933
239,-0.8722869591539516
240,0.8300946493542485
241,0.7464121124320756
242,-0.03645347856579187
243,-0.13647698988257587
244,0.036557536613324185
245,0.28206213314480516
246,0.10373336775501318
247,0.036168663702468865
248,0.516736253711936
249,-0.030485895313555538
250,-0.04489160898933649
251,0.145052654033192
252,0.00796321056175557
253,0.7409591442510736
254,0.07665273640747121
255,0.2341715881487128
256,0.49989630676263574
257,-0.9132439940603815
258,-0.24658864167441488
259,0.849840054329053
260,-0.026696925385570308
261,0.4366278964675727
262,0.04139850432319921
263,-0.0402888374410687
264,-0.7820249534368667
265,-0.6850606171689972
266,0.6205995822863739
267,-0.13498131183381384
268,0.03096335896641506
269,0.365305759764455
270,0.3144434702666572
271,-0.01622266716122845
272,0.7064479997134313
273,-0.07174487892916878
274,-0.23751607136550462
275,0.04900062960425393
276,0.34653358537919443
277,-0.2657692909490313
278,0.021827158211543407
279,-0.021932809619995716
280,-0.26927512346986765
281,0.8662353509435997
282,0.11342121303296596
283,-0.05137305323964292
284,-0.44580283877933957
285,0.596507459850262
286,0.038460984908866784
287,-0.01910524431366177
288,0.5338512301251855
289,-0.21557809702367617
290,0.004113900516543867
291,0.4300840057078485
292,-0.17785093047099768
293,-0.7272271086119132
294,-0.13960232960508734
295,-0.06983159136870228
296,0.9954461488744548
297,0.36934397166949906
298,-0.8587818078526744
299,-0.2203710953256183
300,-0.051616940721131745
301,0.7221504663421174
302,0.380356224836634
303,-0.12312254457393794
304,0.9048443346936091
305,0.026621864046254985
306,0.1039438425262004
307,-0.16560732859004684
308,-0.12809765218687777
309,0.9949077594785254
310,0.8146540397325213
311,0.9996352847072708
312,-0.5850518604991786
313,-0.5422614790195848
314,0.544748535574192
315,0.7071036971011916
316,-0.7408861346589923
317,-0.3381128185498477
318,-0.5868801584345467
319,0.03842574911645073
320,0.4928230589573057
321,0.03368342450001214
322,0.013919008555451846
323,0.13302217206338776
324,0.7942275176525657
325,0.9459203356403516
326,-0.014401987802520388
327,0.998821405879422
328,-0.19833970647754262
329,0.6334337480050253
330,0.6279860981707783
331,0.9816115241374531
332,0.5779950149097796
333,-0.17792006980427658
334,0.8670191399600371
335,-0.5576264977370291
336,-0.1507515020955021
337,-0.106173248054397
338,0.9433236211645165
339,0.9999357391574785
340,0.5601135121428802
341,-0.2687472343576231
342,-0.11503938128567869
343,-0.013631889423014075
344,0.3521605589798326
345,-0.3464597612821512
346,-0.011658659243836578
347,0.094796915583646
348,-0.3803584988214222
349,0.023159489376280717
350,0.07918570002975583
351,-0.5721346392692287
352,0.5128875342666644
353,0.10373644681683045
354,-0.5570990229949095
355,0.9573703417105609
356,0.7449276984944029
357,-0.014086238156834041
358,-0.6280541619331454
359,0.5112877771773726
360,-0.6235820356377311
361,0.258028360293645
362,0.41791060418849985
363,-0.9132440253814968
364,-0.24334416942000886
365,0.0174128218775501
366,0.24877351594821187
367,0.027610982909003615
368,-0.05388742912522706
369,0.7833548537183207
370,-0.17943653823661676
371,-0.32062636569024333
372,0.0752950441259026
373,-0.2663180148072911
374,-0.6373557781841992
375,-0.6184820202239198
376,0.8629846086446081
377,0.8699306190649609
378,-0.5110258651895319
379,-0.0507652855579076
380,-0.6860635858542573
381,0.2622231560350398
382,-0.5113585303376188
383,0.6484953085351551
384,-0.9579385606852306
385,-0.5627694014325292
386,-0.254696426191084
387,-0.4829109301720343
388,-0.005042241155526301
389,0.30685261262919306
390,-0.9083542096147694
391,-0.26251384167298575
392,-0.7401962719105333
393,-0.009720118525987349
394,-0.11557445537993256
395,-0.5142953763022036
396,-0.9790834044024216
397,0.09900813369465089
398,-0.07349312805415004
399,0.14487071766615398
400,-0.8751968506321292
401,0.26965989438841514
402,-0.746045757171267
403,0.7539334893458508
404,0.4802324964576372
405,-0.1474869707642092
406,0.41709576401009957
407,-0.8709840873000578
408,-0.1784523938420952
409,0.14156363650953677
410,0.673777853282671
411,0.21430660520510572
412,-0.09195137205894886
413,-0.7870036440887646
414,-0.0869428021923298
415,-0.8176267518108148
416,-0.040071899393985894
417,0.19433912499125366
418,-0.05165625391006205
419,-0.19409467394761012
420,-0.1330885044360544
421,-0.23955120585925344
422,0.013795962566088152
423,0.4951707712741867
424,0.9433139430781853
425,0.0017361320566830225
426,-0.5556456489790954
427,0.19334587188006253
428,-0.12395138878531244
429,-0.4933298763483574
430,-0.37709027942487844
431,0.8724584438394253
432,0.6722697703933249
433,-0.5085627719814444
434,0.5992029196063609
435,-0.010886050294090462
436,-0.1525789675926814
437,0.002353514909136385
438,-0.6350868844427547
439,-0.292592555466299
440,0.08946526600679788
441,0.46704043756819236
442,0.35829187086071757
443,0.12286746964443689
444,-0.7803929279038611
445,-0.5784923624094293
446,-0.04656934780481605
447,-0.02842505163478345
448,-0.6095205315752321
449,-0.04045101167055326
450,-0.5927687135898974
451,-0.5809848823178704
452,0.6844723518351653
453,-0.9760834989203695
454,-0.05034132937579072
455,-0.035866869044298755
456,0.0880514322267203
457,0.5505563269180443
458,-0.6861039948265493
459,-0.9587293755152408
460,0.5115788902663283
461,0.1105096979396925
462,0.47478176683368983
463,-0.9973039423403406
464,0.8686670305261739
465,0.021830249092233404
466,0.009648815513667731
467,0.8209916673209722
468,-0.8700364160584968
469,-0.9434816338706338
470,-0.09191024143377455
471,-0.7108537062159624
472,-0.015975385667637242
473,0.8578774206149313
474,0.21899264236185284
475,-0.8754141504238164
476,-0.15346278768496696
477,-0.7762847584744539
478,0.347435739542996
479,-0.218396559137146
480,0.024539407503166563
481,-0.586156005023598
482,-0.1267358714615935
483,-0.7108031899129238
484,-0.7912395206347502
485,0.047957250111231045
486,0.7852458651507161
487,0.7802249955690385
488,-0.6426182775200286
489,0.9425331348869935
490,-0.5357399531577022
491,0.223745307987894
492,-0.09448118271488534
493,-0.2722537365420391
494,0.9838982349656761
495,0.13171419059055745
496,0.793266354474281
497,0.5948094515143799
498,-0.6295180451357819
499,0.9001234655385276
