,0
0,0.9999873101139992
1,0.9999873101118334
2,-0.995020591293176
3,0.9950205454827883
4,0.9999997971840768
5,-0.9800871123061469
6,0.9999997971819118
7,-0.9999873283980067
8,-0.9950081329038242
9,-0.9999748873069372
10,-0.9800871471998446
11,0.9999997615814359
12,-0.9800870984554095
13,0.9950081329038235
14,0.9800746400785758
15,0.9800746400764113
16,0.9999872962610934
17,0.9800746262235505
18,0.9800746262235587
19,0.9950205947588939
20,0.9999873283980079
21,-0.9999748517073456
22,-0.9950205947588933
23,0.980087133351271
24,-0.9999997615792704
25,0.980087077673717
26,-0.9950080905479033
27,-0.9800995709939415
28,-0.9999872893322609
29,-0.9751203442113875
30,-0.9800871471998421
31,-0.999974887309098
32,-0.999987275518288
33,-0.99999979371836
34,-0.999999797181911
35,0.9950080905500683
36,-0.9999873249322974
37,0.9950080870843505
38,0.9999872927979784
39,-0.9950205809059904
40,-0.9950081225114401
41,0.9751079100582372
42,0.9800995603122004
43,-0.9999997615814367
44,0.9800746262257157
45,0.9999997833311702
46,0.9999997477263243
47,0.9751079309239229
48,-0.9751203442135543
49,-0.9950080974788997
50,0.9950205593335267
51,0.9751079100582376
52,-0.9999872893322618
53,0.9999873283980074
54,0.9999873284001731
55,0.9999873491797444
56,-0.9751078962096656
57,0.9999873101139974
58,0.9751203442113897
59,-0.9950205593335281
60,-0.9800995571777669
61,-0.9950081259728232
62,0.9999873318632887
63,0.9950205809081553
64,-0.9950205593335254
65,0.9751203789282544
66,-0.9800995952063403
67,0.9999997971819112
68,-0.9800871122715819
69,0.9999873318632886
70,0.995008087084351
71,-0.9999749011230683
72,0.9999873249366227
73,-0.9999872893322626
74,-0.980087098457575
75,0.9950081259749889
76,0.9950205593335271
77,0.9999997581157214
78,0.9800746611189689
79,-0.9999873249366233
80,-0.9999873283980077
81,0.9800871125695764
82,-0.9950205947567277
83,0.9800870984554092
84,0.9999997581157214
85,0.9999872997246453
86,-0.9950205593335278
87,0.980087126422437
88,0.9800870776737154
89,-0.9800995360976434
90,-0.9999872893322616
91,-0.9999873491797441
92,0.9999872927979785
93,-0.9999873249344542
94,0.9999872962589287
95,0.9800995603122007
96,0.9800995464614628
97,0.9999997615792723
98,-0.9950205809081553
99,0.9999873135753831
100,-0.980087133351263
101,0.9999997615792704
102,0.9999997971819113
103,0.9800871264202726
104,-0.9999873353290077
105,-0.9800871122694234
106,-0.9999873537675196
107,0.995020594758892
108,-0.9800871333491046
109,0.9751203789282545
110,0.9950205947567292
111,0.9999872893322616
112,-0.9950080974767347
113,-0.9950081259749904
114,0.9999997615814374
115,-0.9999997833333384
116,0.9999997833311713
117,-0.9800995360998034
118,0.9999997971840757
119,0.9950205947588936
120,-0.9999997971819101
121,0.9751203580621259
122,0.9950080974767362
123,0.9751078962096633
124,0.9999997971819105
125,0.9800746749718289
126,-0.9999873111204837
127,-0.9800871122715825
128,0.975120358064291
129,-0.9999997581178873
130,-0.9800995709939404
131,-0.9999872893322612
132,-0.9999748873069386
133,0.9751079309239217
134,-0.9999873111204837
135,0.9999873249366225
136,-0.9800995222857888
137,-0.999974887309096
138,0.995008146754562
139,-0.9999873111183238
140,0.9999997477285336
141,0.9999873491775783
142,0.9800746262235521
143,0.9999997615792704
144,-0.9999997477285358
145,-0.9999873111183252
146,0.9950080974767355
147,-0.9999748873069374
148,0.9999872893322616
149,0.9999872893344269
150,0.9800995464614627
151,-0.9999748517073439
152,-0.9950205947588942
153,-0.9999997477306991
154,-0.9800995571799253
155,-0.9950205454827877
156,-0.9999872755183973
157,-0.980087098457576
158,-0.995008122511439
159,-0.9950080905479028
160,-0.9751203442135521
161,-0.98008713335127
162,-0.9999748655191549
163,-0.9999873135775489
164,0.9950081225114394
165,-0.9800871122694246
166,-0.9800871184675358
167,0.9950205454827885
168,-0.9751079309239229
169,-0.9800871471631192
170,0.9999997581178875
171,0.9999997615814371
172,-0.9800995360976448
173,0.9999997971819108
174,0.9800870984554094
175,0.9800995952063408
176,-0.999974865521314
177,0.9999997971840746
178,-0.9800871333512634
179,0.9999997615814368
180,-0.9950205593313618
181,-0.9999748655213139
182,0.9800871125695761
183,0.9999873457161936
184,-0.9800871123083128
185,0.995008125974991
186,0.9999873457161932
187,0.9950205454827885
188,0.980099560310036
189,0.9751079100582365
190,0.9999997937183599
191,-0.9999873353290053
192,0.9950081225114408
193,0.9800995813534383
194,0.9999872893322606
195,0.9751079309260885
196,-0.9999873111204824
197,-0.9800995360976449
198,-0.995020555867811
199,-0.995008122511439
200,0.9999997615792723
201,0.995008125972825
202,0.980087091526571
203,0.99502055933136
204,-0.9950080905500677
205,-0.9999997615814353
206,0.9999873135775478
207,0.9950205947588919
208,-0.99998734917758
209,-0.9950080870843522
210,0.9999997581178885
211,-0.9999872927979787
212,0.9800871264224357
213,0.9999997971840778
214,0.9999997971819113
215,-0.9999873284001725
216,-0.9950081225092744
217,-0.999999761579271
218,0.9751079309239219
219,-0.9800871472020076
220,-0.9950081259749901
221,-0.9999748517073441
222,0.9999873284001729
223,-0.9800995571799261
224,-0.9950205912931771
225,0.9800870984575729
226,-0.9800871123061474
227,0.9800995952063397
228,0.9751203789304185
229,-0.9999748655191573
230,-0.999987292795813
231,-0.9950081259749912
232,0.9999997971840762
233,-0.9950205809081556
234,0.9999997833311716
235,0.9950080974767344
236,-0.995008087086518
237,0.9950081225114403
238,0.9999997581178851
239,0.9751079100582362
240,-0.9999873111204843
241,-0.9751078962096638
242,-0.9950080870843522
243,0.9999997971840766
244,-0.9950205454806255
245,-0.9999997971819096
246,0.9950081329038226
247,-0.9999997581157195
248,0.9999873101139993
249,0.9950080974767354
250,-0.9950081329038228
251,0.9800995952041752
252,0.9950081113296372
253,-0.98009959520634
254,-0.9950081225092731
255,-0.9800870984554113
256,-0.9751079100604012
257,-0.9950205947567269
258,-0.9950205947588936
259,0.9999997477263682
260,-0.9999872997246456
261,0.9950205593335258
262,-0.9800995464592964
263,-0.9800871471998435
264,0.995020555867808
265,-0.9999997971819103
266,0.9950081225114398
267,-0.9999997937183609
268,0.995008132903822
269,-0.999999793720525
270,0.9999997833290072
271,0.995020591295343
272,0.9950081259749907
273,0.9751079309260878
274,0.9999997971819103
275,-0.9751078962096646
276,0.9999872893344276
277,-0.9999748655191568
278,-0.9950205558678095
279,-0.9800995709939394
280,-0.9999873249322968
281,0.999987296258927
282,0.9999872893344275
283,0.9950080905500678
284,-0.9800871472020078
285,0.9800995603100364
286,-0.9950205947588934
287,-0.9950205947567291
288,0.9999997833290055
289,0.999987299724645
290,0.9950205947567264
291,-0.9800871333491044
292,0.9999997615814378
293,0.9800746262257157
294,-0.9800995813556018
295,-0.9800871471631187
296,0.9950081329016575
297,0.9950080974767349
298,0.9800871123061471
299,-0.9800871333491042
300,0.995020545482789
301,0.9950080905479012
302,0.9751203580621266
303,-0.9999873283980065
304,-0.9999872893322609
305,-0.9999873491797435
306,-0.999987311118326
307,-0.9950081225092752
308,-0.999987275518118
309,0.9800870776758808
310,0.980074626225716
311,0.9751203580621264
312,-0.9950081113296376
313,0.9751078962096649
314,0.9999873249344553
315,-0.9999997581178858
316,0.9950081225114401
317,0.9999997971840751
318,0.9950081329038242
319,0.9800746262235522
320,0.9950205454827892
321,0.9950205809059891
322,-0.9950081225092741
323,-0.9999748655191579
324,0.9950205947567278
325,-0.9999872755161319
326,0.9999997615792713
327,-0.9950081329016605
328,0.9999997937183618
329,-0.9800995360976451
330,0.980099560312201
331,-0.9999872893344277
332,-0.9999748870031036
333,0.9999873283980079
334,-0.9800870984554102
335,0.9950205912931771
336,0.9800870915287565
337,-0.9999873249366233
338,-0.995008087084351
339,0.9999997581178881
340,0.9950205593335274
341,-0.9800995360976451
342,-0.9999997971840761
343,0.9800871264224379
344,-0.9950081329038225
345,-0.9800871122715811
346,0.9999873135775477
347,-0.9950205947567271
348,-0.9999748655191568
349,0.9999873353268409
350,0.9999997833333386
351,0.9999872927979786
352,-0.9999748517051846
353,0.9751203580642899
354,-0.9999872893322617
355,-0.999974865519157
356,0.9999997937183588
357,-0.9999873491775786
358,-0.9751203927811563
359,-0.9950081225114397
360,0.999987328398007
361,-0.9950081259749892
362,0.999999797184076
363,0.9999873318611231
364,0.9999997937183588
365,0.980087147199843
366,-0.99999979718191
367,-0.9751078962096655
368,0.9999873249366227
369,0.9999997937205246
370,0.9999872927958119
371,-0.9751079447768238
372,0.9950081113274737
373,-0.9999997477306981
374,-0.980087147165279
375,0.9800871125674105
376,0.99500812251144
377,-0.9950080905500673
378,0.9950081259749911
379,0.9950205912931767
380,0.995008090547902
381,0.9751203789282529
382,0.9950205593335266
383,0.9999997971819118
384,-0.9800995709939421
385,-0.9751079447746595
386,-0.99502058090599
387,-0.9800995360998022
388,-0.9950080974789001
389,0.9999873284001731
390,0.9751078962074993
391,-0.9800979153504258
392,-0.9999872755182909
393,0.9800870776758821
394,-0.9999872794010627
395,-0.9950205454827884
396,0.9950080905479025
397,0.9800995464592999
398,0.9800746611179793
399,0.9800870915287421
400,-0.9751078962096629
401,-0.9800871122715816
402,-0.9950205558678102
403,0.9800870915287425
404,-0.9950205593335286
405,0.999987328398005
406,0.9999873457161887
407,-0.9950205947567277
408,-0.975107910058237
409,0.9950081225114408
410,-0.9999749011230953
411,-0.9999872927958124
412,-0.9800871471652779
413,0.9999872893344268
414,-0.9999748873090973
415,-0.9800995709939399
416,0.9999873249344546
417,0.9751203580621255
418,0.99999975811572
419,-0.975107896207501
420,-0.9751079447746618
421,0.9950205593335265
422,-0.9950205912953437
423,-0.9800995571777672
424,-0.9999748873090959
425,0.9999873101139966
426,0.9999873457140275
427,-0.9800995222836315
428,-0.9999872893344266
429,-0.9999873111207762
430,-0.9999997615814376
431,0.9999872893322619
432,0.9800746262257155
433,-0.9751079447768252
434,0.9950205593335266
435,0.9999997615792718
436,-0.9950205809081542
437,-0.9950081225114404
438,-0.9999748655213141
439,-0.9999873284001726
440,-0.9999873249344552
441,-0.9950205947588932
442,0.999987292795812
443,0.999987289332261
444,-0.9999997477306991
445,-0.9800871122715805
446,-0.9800995813534361
447,0.9999997971840766
448,0.995008122509275
449,-0.9999872893304417
450,-0.9800871333512712
451,0.9800870776758803
452,-0.9800995952041747
453,0.9800871264224358
454,-0.9999997937183587
455,-0.980099557179926
456,-0.9999873249344556
457,-0.9800995231306693
458,-0.9950080974789016
459,0.9751078962074979
460,-0.9800870984575755
461,-0.980087112271582
462,-0.995008087086518
463,-0.9950205947567274
464,0.9800995603122004
465,0.980087126420272
466,0.9999997615814376
467,-0.9751079309239227
468,-0.9950081259749911
469,0.9950205558699763
470,-0.9999749011230682
471,-0.9800995360998026
472,-0.9950205912931765
473,-0.999974887309098
474,0.9999997615792724
475,0.9999873318611227
476,-0.9999872997246465
477,0.9999997971819107
478,0.9999873101139978
479,0.9999872997268106
480,-0.9950081259749902
481,0.9999873101118327
482,-0.9999748873090964
483,-0.9800871471631203
484,0.9800746400764091
485,-0.9999872893301023
486,0.9950205912931763
487,0.9950081467523976
488,-0.9800871123083122
489,-0.9950080905479016
490,0.9950081225092731
491,0.99998733186329
492,0.9751079447768252
493,0.9999873249366222
494,0.9800995464592991
495,0.9999997615792738
496,-0.9999872893322627
497,0.975107910058236
498,0.9751203789282546
499,0.9999997581178859
