,0
0,-0.218905038004165
1,-0.27923884310187347
2,0.7411777332277667
3,-0.7363067475689441
4,-0.043920845702451576
5,-0.8231854626764216
6,-0.8970673748646703
7,0.14119973101184516
8,0.4779009496984402
9,-0.6203216982798492
10,-0.22199917462812005
11,-0.5262191449613689
12,-0.18996082853131213
13,-0.5903136310607836
14,0.5976552562970062
15,0.12605067253131633
16,0.08831180025750658
17,0.29055136293072215
18,0.5940906581845158
19,-0.4345068270393805
20,-0.3690170355180241
21,0.6784612031510878
22,-0.35066959698610695
23,-0.21421035438294414
24,0.6596959666150194
25,0.20858308348467647
26,0.28580061523535183
27,-0.20018917317125307
28,-0.20080800809578345
29,0.27238311792783
30,0.8020161278599797
31,-0.14010180670282418
32,0.9642756699940253
33,-0.19664280778975154
34,0.05752427909100091
35,0.5769724100370669
36,0.027352154589685075
37,-0.7363070645894826
38,-0.5908966508490354
39,-0.477910099779038
40,-0.567380102920325
41,0.11894740468752152
42,-0.9418646600878039
43,-0.22422164625022478
44,-0.12349827544094584
45,0.599916480108633
46,0.7441866092173808
47,0.6453885822004702
48,0.0273527250947001
49,0.9438152598119639
50,-0.09531891101833048
51,0.13610955926480192
52,-0.5380469562899859
53,0.3846193816541292
54,-0.062111373277560604
55,-0.575674426193654
56,-0.2534897479345791
57,0.21583520332058492
58,0.7189279702128604
59,0.7893165875586875
60,0.6173946103971939
61,-0.4849174834007208
62,-0.5263973040023433
63,-0.13779935741775945
64,0.7741286561118764
65,0.8562988692411609
66,0.4805514358356949
67,0.29024386565631055
68,-0.15070031528259256
69,0.43727337114698833
70,0.7235285024359412
71,-0.8303899148269
72,0.12809738807287896
73,-0.2780615144754844
74,0.37335216486781386
75,-0.4305578443140596
76,-0.14459734559567802
77,-0.535317784143349
78,-0.17654044233796415
79,-0.4390432871348205
80,-0.7589159231557342
81,0.914680783482954
82,0.11608698238577743
83,-0.22251489976987782
84,-0.27951442776157587
85,-0.375691116206766
86,0.3580542979743748
87,0.8602519401333265
88,-0.15089351041799046
89,-0.06964186149386745
90,-0.014856819699328339
91,0.3415149081662729
92,-0.26847661768516295
93,0.3873386893441898
94,-0.25951645104134713
95,-0.6757851240964178
96,-0.6221218477562707
97,0.3830797773412503
98,-0.7391135304085328
99,0.2653822089354449
100,-0.538826356502258
101,-0.32563186350552165
102,-0.8260263272289464
103,0.034071802331302144
104,-0.24691147529157692
105,-0.12341252729605598
106,-0.15966894742141816
107,-0.020517322067451438
108,-0.2789003613248613
109,-0.5832105997580357
110,-0.09819921247752944
111,0.2855799308295629
112,0.8143305775148574
113,-0.5221913461154977
114,0.44314642224665457
115,-0.34919828210328974
116,-0.36949724123372807
117,0.6534181945536115
118,0.2532289582379888
119,0.7129363130324012
120,0.039044878863398136
121,-0.7403055294826696
122,0.3534819738327635
123,0.5977307542342014
124,-0.21856587051157106
125,0.15231131439009235
126,0.7305483899172814
127,0.5637663567584213
128,-0.5977320391108827
129,-0.6791034244297329
130,0.2557186008739398
131,-0.8002507810277603
132,-0.07367066336440185
133,-0.43454706036458934
134,0.9335120964637281
135,-0.5531712547156752
136,-0.07028748765956608
137,-0.09683605416994531
138,-0.0028896205405515157
139,-0.9013635163925843
140,0.17610613808170256
141,0.5494531647812356
142,-0.16511365502658953
143,0.36283424069444836
144,-0.29025526786123984
145,-0.8122999753942549
146,0.7595115272516124
147,0.8759916552868334
148,0.2014699976685242
149,0.5826940037166022
150,-0.195401707770448
151,-0.8022416648691768
152,-0.2681548278149424
153,0.22322697702297553
154,-0.5063027702493658
155,-0.8758636073955399
156,-0.4163621166431937
157,-0.21740071235735586
158,0.8129796319734008
159,-0.5163831252186664
160,-0.6224916210832592
161,0.28362964944880026
162,-0.14956478757862626
163,-0.2905609653023194
164,0.8009240100411974
165,-0.12892521864144754
166,0.3578608342238203
167,0.4870637753228285
168,-0.11189278503820858
169,-0.13174088966844932
170,0.2971307716868847
171,-0.7847845979271895
172,0.6232696037945031
173,-0.19379099304200748
174,-0.27043099089117867
175,0.9398629255165092
176,0.9265342367466051
177,-0.9158396746108347
178,0.8242059392330556
179,0.5976552034045955
180,-0.35241806714558466
181,0.31458754204448064
182,-0.8150598040895821
183,-0.40455949126685364
184,0.27639925546933986
185,-0.39920125499522086
186,0.7840769255805197
187,0.1988193283258906
188,-0.058943970210996684
189,-0.5457019591855916
190,0.6664500094399993
191,0.4154335457459366
192,0.9125683624059343
193,-0.4543983631221345
194,-0.14347522706370555
195,-0.3731877665039055
196,-0.16260258834487842
197,-0.4940240582722453
198,0.886257288754774
199,0.4903413557055037
200,-0.3251969693323388
201,0.661336138836336
202,-0.5779416633096197
203,0.21965853395661744
204,0.0004009011608784865
205,0.49516121240778777
206,-0.16110887592995202
207,-0.0630818731749696
208,0.6757541480213456
209,-0.7860578890728885
210,0.0998898223162099
211,0.32801114512147206
212,-0.6826151030659388
213,0.3251224692846583
214,0.5976456732498804
215,-0.40861500999061634
216,0.7032184488663576
217,0.31810574668522884
218,0.21423069082728824
219,0.3174236110623806
220,0.8362961217598409
221,0.3054011256149765
222,0.311088796208999
223,0.6106398120398991
224,0.49566052296236274
225,-0.3936836807423068
226,0.7628003254537113
227,-0.2317889585492623
228,0.16131368315025243
229,-0.11023136041506386
230,-0.7398431144736295
231,0.14137336416314666
232,-0.5879558548143656
233,-0.35227021877105685
234,0.2577391376041369
235,-0.1328915050629169
236,-0.1040252796618522
237,-0.5881439578009093
238,-0.1647604229185046
239,0.6340109128910835
240,-0.7676650919071287
241,-0.6540049720210339
242,0.08276915830320415
243,-0.7575299176861485
244,0.5276733557815393
245,-0.14328044021352243
246,0.3278640741556229
247,0.5514753634035642
248,0.7411777748751104
249,-0.8433460656912168
250,0.5711513779172777
251,-0.3158643682288731
252,-0.4961097225274773
253,-0.4477198516221432
254,-0.13933829833095987
255,-0.083212151362313
256,-0.062380877534568294
257,-0.31309522519465177
258,-0.8370952807265256
259,-0.10653850403548559
260,0.1688556350329214
261,0.8062345911947355
262,0.579984007650732
263,0.28529059199118456
264,-0.23736497286364577
265,-0.18978062217983857
266,-0.06045053387622197
267,-0.6660152058468849
268,-0.22690842992901378
269,-0.4394367991671886
270,-0.9146794717093427
271,-0.16553171760545252
272,0.8973490524820068
273,0.12262583449666405
274,0.9999997915023338
275,-0.0018149267126584608
276,0.27971395438009544
277,-0.5485577603305055
278,-0.8311991933930877
279,-0.031830338252962026
280,-0.4638031840942927
281,-0.7587118615648627
282,0.7014739603712445
283,-0.19710096986007838
284,0.5213450348487386
285,0.7468759787347166
286,0.5660729672440772
287,-0.35434393954709464
288,-0.7382975771254483
289,0.8150594913225956
290,-0.24467928615276
291,0.6207828700732113
292,-0.5264914630512021
293,0.31755520671179005
294,0.3737639399635463
295,-0.5163831764877744
296,-0.5062346905451702
297,0.5233763697130028
298,-0.903599580721585
299,-0.21409231760507877
300,0.046610051528390706
301,0.2144722187130942
302,-0.8828356393147415
303,-0.3937557678235531
304,-0.5827039611624335
305,-0.5136438584549619
306,0.897688203585957
307,0.6112628192526431
308,-0.4085689393446522
309,0.6734107599168244
310,-0.12716426094041494
311,-0.15450522586469806
312,0.6164177344010279
313,0.25376762414265963
314,-0.10893983769121578
315,0.18050859734678293
316,-0.6114871110251303
317,-0.3074518526385958
318,-0.8723504377913333
319,-0.22662055149174978
320,-0.5227218989839941
321,-0.632377154525801
322,0.13075338406339584
323,0.4022123230753834
324,0.6291843180487608
325,0.0643478068407419
326,-0.2333968136361281
327,-0.5429238420061568
328,0.8702675070664065
329,-0.19660872853678088
330,-0.5153368624853346
331,-0.7101068389549223
332,-0.16633515166226023
333,0.5087477563740466
334,0.02663413037828259
335,0.313777975716224
336,0.11607264343169797
337,-0.7334584615494664
338,-0.2986584337930783
339,-0.14261919181249338
340,-0.20600818974943177
341,0.9044151185847831
342,-0.08367226817450787
343,-0.03775507373512191
344,0.645692297202628
345,0.10285564179880688
346,0.7511932438740377
347,0.4895864926858976
348,0.038455097875753026
349,0.24033036335875685
350,-0.03424387148537179
351,-0.17088392305313488
352,0.4133234615580131
353,0.751429473590637
354,0.07119197250291298
355,-0.08705762540963975
356,-0.04345617313612229
357,-0.8163017495554936
358,-0.14934708740886002
359,0.1320766151702486
360,0.6476739067712709
361,-0.47501814190368924
362,0.39701246614629515
363,0.3833859122030255
364,0.16473221218586562
365,-0.6340016703313756
366,-0.22618981605467892
367,-0.22182820992366237
368,-0.2026969072411806
369,0.3671623697298763
370,-0.15977211098540922
371,-0.16542753455293185
372,-0.2702155093827378
373,0.9991904828739936
374,-0.6497124123204309
375,0.5631238862519677
376,-0.5277135503903145
377,0.8005217284403826
378,-0.07199287380649452
379,-0.5999375974784199
380,-0.304634687752337
381,-0.48701264101171743
382,0.897963207785637
383,-0.09730242788625193
384,0.9445935621152357
385,0.3618693008349972
386,0.28481095381309957
387,0.11231762757645912
388,0.2716495076036921
389,0.9971905203321878
390,0.31897727266128384
391,0.12459841774722599
392,-0.07962802543227501
393,0.37908291359206764
394,-0.2517934666001878
395,0.29714032288392583
396,-0.5819748065870975
397,-0.2877720497646315
398,-0.2850241397511239
399,-0.023556253770362964
400,-0.05406338260682988
401,0.631663939185801
402,-0.3424117219351162
403,0.6792689055445005
404,0.7340629113376247
405,-0.17098648223049373
406,0.4161235167917853
407,-0.2015955526667174
408,-0.23841938297955362
409,-0.7616509685051978
410,-0.1098897250317009
411,-0.34941285603305744
412,-0.27708628253152345
413,-0.5704517393420128
414,0.016261665781139148
415,-0.7587704960298718
416,-0.8264966994368328
417,0.2844813045874306
418,0.8793799390592577
419,-0.26583443609954255
420,-0.9284759589739208
421,0.5332593149903642
422,0.5597271166132003
423,-0.47668802941098465
424,0.5069631118497981
425,-0.10610153179627266
426,0.17021314252220607
427,-0.1815567966448831
428,-0.09674466285318391
429,-0.19212899586781573
430,0.5742488126358037
431,0.8150996072638089
432,-0.7510469291198134
433,-0.03805888427398525
434,-0.6494072460373462
435,-0.6080571617946284
436,-0.606016545092867
437,-0.913879855193531
438,-0.8110225182063968
439,-0.9647527654919368
440,-0.19070578972215074
441,-0.5956149894729782
442,0.4912525283543718
443,-0.04850275603216005
444,0.733037130283592
445,-0.5019921053970591
446,-0.44602117071165787
447,-0.16319832501916282
448,-0.31128832783597354
449,-0.3379004466818057
450,-0.04982675149006778
451,-0.12347043235321553
452,-0.06934456830695587
453,-0.3672025643400834
454,-0.5762492564639137
455,0.7946830206721605
456,-0.06162908256622305
457,-0.17618975109402638
458,-0.519475913784436
459,-0.39534034603053386
460,0.11736461934757021
461,-0.1479910384755582
462,-0.13288485776525163
463,0.5201514068469238
464,-0.4636468008493374
465,0.5464358846532563
466,-0.04016275869399595
467,-0.4163994379303366
468,0.02315939118871787
469,0.5038058780685516
470,-0.18169865563374996
471,0.060720674617410667
472,0.8724275612507542
473,0.7594808927947192
474,0.49489707221614593
475,0.3681312259851354
476,0.2315718392970889
477,-0.24567129209354419
478,-0.2579520135275367
479,-0.3502342415781175
480,-0.5107505382814721
481,0.5322580402394018
482,-0.1422289936245431
483,-0.8390952773819647
484,0.6469175506758688
485,0.03973403466943022
486,0.6373500828897419
487,0.34265862918232254
488,0.4417987277670463
489,-0.9045534652708728
490,0.12013137027072625
491,0.15958074768364555
492,-0.1152229627952648
493,0.4390436432572902
494,0.12710339693386838
495,-0.07603248530446474
496,-0.9125680003846922
497,-0.7286808844201976
498,-0.8717079782709949
499,0.5754349053120993
