,0
0,0.7706214881919815
1,0.16397148574692105
2,-0.07450071429946543
3,0.8669677654181572
4,0.00043096902241928346
5,0.1139839411124298
6,0.37433841342761737
7,0.47330582655657
8,-0.8138873874115315
9,0.7724264246322947
10,0.1188056225958177
11,-0.9508748898586958
12,-0.8745273713014106
13,0.9658981305318707
14,0.8109832494345416
15,-0.07224883023614569
16,-0.8948885793517871
17,-0.11427773393082069
18,0.8206914745718467
19,-0.7088614069907491
20,0.23937631899440423
21,0.5987710440370746
22,-0.11214166670580734
23,-0.29432480475015727
24,-0.5684184724600538
25,0.04862241918216887
26,-0.13826381411409333
27,-0.33487965025031097
28,-0.30836462003614673
29,-0.35906735002503926
30,0.3620357179832884
31,-0.32960190170876325
32,0.23939729548767089
33,-0.4545798024577758
34,0.19169951305010668
35,-0.36190695062060135
36,0.6254879641168571
37,0.4156044217607346
38,-0.9924180610546854
39,-0.16396529696557816
40,0.2027838461809536
41,0.17583160227414799
42,0.8518766791635143
43,0.1715463717635856
44,0.5102967593580057
45,0.1008782572909167
46,-0.2756284444520835
47,-0.6663529510958115
48,0.28317927296913004
49,-0.32760803214572615
50,-0.42365405080468366
51,-0.1759400667990917
52,-0.46134179426340444
53,0.015453556818929287
54,-0.6661892241316316
55,-0.7754157405516611
56,-0.1306820782556733
57,0.4621546742367657
58,-0.4844890433393107
59,0.14049432303855092
60,-0.5434833330844303
61,0.032044233545323236
62,-0.015454212043809798
63,0.4545797867881515
64,-0.05326361636924788
65,0.534035199067555
66,-0.9665411546855933
67,0.5893200840635331
68,0.13456618914123622
69,-0.357197962808461
70,-0.30160260064074534
71,-0.07177697462808871
72,-0.3135238613948489
73,-0.024289092968159898
74,0.19573683551128862
75,-0.17866036627962145
76,-0.5863521689293234
77,-0.5911905427200079
78,0.15588564936800448
79,0.007383014675553667
80,-0.4545736223598204
81,0.6470666692315082
82,-0.8868592672006838
83,-0.9764133600758753
84,-0.6719772653603645
85,0.03113846831119722
86,-0.5094845514693233
87,-0.7807734227918334
88,-0.33123565046978976
89,-0.36733991936644594
90,0.6600652760581809
91,-0.3666280702373275
92,0.0507434168368113
93,-0.6320869233400701
94,0.7806096704025114
95,0.4890896235155342
96,0.7287743676040167
97,-0.23017695488625733
98,-0.7649747182135337
99,-0.06599605297465935
100,0.5028849160293285
101,-0.032852258370546804
102,-0.4621374835498949
103,-0.0776410676724508
104,0.2776931202312741
105,0.9799568539699002
106,-0.18039727793874086
107,0.8280970952620242
108,-0.20377146303946753
109,0.40329289912650723
110,0.794988612047942
111,-0.4209809270308136
112,-0.36391035888603135
113,-0.5892634392133922
114,0.7374096141527706
115,0.04091208105265822
116,-0.008006511445794404
117,-0.12242766884464734
118,-0.7807789042154213
119,0.2708188737007507
120,-0.061528114182489616
121,0.254895229271881
122,-0.4126354497383549
123,0.33407230707054686
124,-0.48768758405187834
125,0.7723801221416239
126,0.7224786333422384
127,-0.30078972302394535
128,-0.457586894689996
129,-0.22592033245571116
130,-0.13454645492882866
131,0.8594323442472297
132,0.11202748440032358
133,-0.5245836574639978
134,-0.48448849892969825
135,0.1566930100372772
136,-0.11878520872144462
137,0.2576196116068506
138,-0.016852396872329943
139,-0.22184504586983342
140,-0.015623461508387827
141,0.9657344192800827
142,-0.0783261492538575
143,0.4621608367331939
144,-0.17048273863238922
145,-0.4686140968782698
146,-0.3340667821974833
147,-0.20965298458520162
148,-0.9346720773866714
149,-0.45916956727983577
150,0.02428842526806345
151,-0.05159028228631811
152,0.9998427599493702
153,-0.011462280014886101
154,0.5217450692891038
155,-0.02303527781193989
156,-0.10935460635880513
157,0.009266506355534611
158,-0.13004461454849117
159,0.007383577170665959
160,-0.19126456782383985
161,0.1367376591046121
162,-0.4878623294167036
163,-0.11583423994855405
164,-0.2966001985830824
165,-0.01183461921751937
166,0.20360290389446087
167,-0.06154959743666505
168,-0.8314731939133847
169,-0.19236266408349006
170,-0.025101302913817153
171,-0.48622962649647944
172,-0.0958802883238714
173,-0.016183734756477282
174,0.6320876087388649
175,0.14894271900166475
176,0.17123164150809153
177,0.3418177399951888
178,-0.4658540914449543
179,-0.4868753935172728
180,-0.42380379281506947
181,0.37121923301532445
182,-0.8205215539855811
183,0.5986422439116441
184,0.14812983100702284
185,0.9999997971140369
186,0.36376805956250746
187,-0.3696173577673585
188,-0.011288377597330965
189,-0.3015964336103423
190,0.03186947485229662
191,-0.5018979628127737
192,0.12050202458003866
193,-0.31306833058591255
194,-0.47332064569234034
195,0.3030827820987509
196,-0.1110487632910186
197,0.3266314403828422
198,0.294161105135613
199,0.8669671719348586
200,0.11753416845627966
201,0.7363088996202835
202,0.11751329977422953
203,0.23653727153321996
204,-0.12021668668143991
205,0.12229706184662005
206,-0.9999992333951065
207,-0.7874075616052336
208,-0.7741884737244163
209,-0.17429809945416574
210,0.7600755142546146
211,-0.11484659833761644
212,-0.45914863139679024
213,-0.2036022413961371
214,0.7880456961858686
215,0.7679849525848669
216,-0.11544956087494535
217,0.04403019197610367
218,-0.6396983428767239
219,0.9589607435092502
220,-0.3266259340559619
221,0.861673496468761
222,0.14694467138748324
223,-0.027150762921061757
224,-0.9657344548081302
225,-0.0016135851625133882
226,0.8221509736862901
227,0.5628718485666714
228,-0.5058502752583922
229,0.03930078969831332
230,0.3017663516647687
231,0.9924187319291898
232,0.6676585257149126
233,0.06152867577899737
234,0.032857767562318174
235,-0.36950900530553227
236,-0.6405167296787988
237,0.931703687702589
238,-0.7741670465374031
239,0.721193246372036
240,-0.01544804814772135
241,-0.28658002851545655
242,0.4732122932343721
243,0.08377205180417861
244,0.30594280629119774
245,0.3309494733666284
246,-0.45376139712483965
247,-0.15669852931347636
248,0.6424446386916259
249,0.3424662511354915
250,0.08388793072188942
251,-0.015093463507118819
252,-0.06555385237632924
253,-0.34246622325519366
254,-0.49544407745279573
255,-0.5986626007589423
256,0.5420847931252242
257,-0.22057369356514672
258,-0.990678129667388
259,0.5357519441460585
260,-0.5678465285806895
261,0.15934796927299388
262,0.3424668930023087
263,-0.48448842458440644
264,-0.19520895259202167
265,-0.6568850408668113
266,-0.4656102671836927
267,0.489239834592785
268,0.7732432038199667
269,0.031719217742440756
270,-0.13993182491513434
271,-0.19619106636841757
272,0.34262996355349445
273,0.07552005725257206
274,-0.11191891788277393
275,0.6730766985781115
276,-0.16829515269143352
277,0.9999997971840267
278,-0.1390495155442626
279,0.4592774691179085
280,-0.026722543022347896
281,-0.4694331222551927
282,-0.5287442963554648
283,-0.17857948124688655
284,-0.07044569625017692
285,-0.4750678768197478
286,0.9508810531034689
287,-0.36493049047184906
288,-0.4149356453361388
289,-0.8837196729537872
290,-0.9922494824575586
291,0.5028849305515622
292,0.521162743252465
293,0.6471094886130578
294,-0.03187498292192895
295,0.4892393104836996
296,0.5648362836040641
297,0.12638668783175294
298,-0.20828352414276124
299,0.14894889793404162
300,-0.39573273926852226
301,0.5670611093564467
302,-0.0872143533077108
303,-0.07913201910716221
304,-0.28759023297635156
305,0.5339052872459534
306,0.5770179647045643
307,-0.008994817780817104
308,-0.2933420317063916
309,-0.6405160694317403
310,-0.049803653048502164
311,0.14770983264693344
312,-0.4771834548580739
313,0.15588631909818926
314,-0.5028849160462696
315,-0.12337636334979772
316,0.6403468261546977
317,-0.11149108243035408
318,0.13735174769399425
319,0.12823340072361197
320,0.436546847994797
321,-0.5104666834206568
322,-0.4868754080225664
323,-0.019151721350765805
324,0.984970994854134
325,0.9999781712872802
326,0.10284825432141823
327,0.12995304613639252
328,0.3573058203374979
329,0.9991861985478857
330,0.1483045751777911
331,-0.5293261913522914
332,0.8515709818596024
333,-0.3250803399154409
334,-0.5309165264452772
335,-0.08247246006853767
336,-0.233793894921277
337,0.7631193268196602
338,-0.2035973885988731
339,-0.02861398317496166
340,0.3135028950338665
341,-0.051461515880080175
342,-0.3601867425821016
343,0.30176635282909986
344,-0.1619202235495635
345,-0.5210339219483382
346,-0.07089997679251465
347,0.46943245250807686
348,0.8792578432569245
349,0.45169691050285166
350,-0.6546262523134418
351,0.12995298544269762
352,-0.9441067025095012
353,0.5722880196756825
354,0.30177185014228863
355,-0.4537607285600124
356,-0.1809937297536915
357,-0.6322561357964157
358,0.008012689196900487
359,-0.8950173216214873
360,-0.9667158487870866
361,0.1477153418501642
362,0.06108104617959812
363,-0.4130790443762685
364,-0.06280069369693979
365,0.764403311477282
366,-0.9315534380421296
367,-0.11501585308039025
368,0.3987017248816416
369,-0.08032702251083096
370,-0.3679785931438089
371,-0.23574803406086597
372,0.3083652886009878
373,-0.4320845269203961
374,0.8206914745887903
375,-0.4610180359859421
376,-0.7874027221311367
377,0.780779588431904
378,-0.8130752229768028
379,0.010605356587251136
380,-0.3666274525824359
381,0.9765770522703136
382,0.779797489094395
383,-0.4144115131242388
384,0.6663577511573626
385,0.12683488013499006
386,0.1096126724938606
387,-0.5788789487003679
388,-0.46134795676976337
389,0.38368040142075743
390,0.02384815462660455
391,0.5256251181125707
392,0.31985774670677997
393,-0.931704250320451
394,-0.5722880196756827
395,-0.42677277956397947
396,0.493701721476512
397,0.0021632659791506505
398,0.5936224006443093
399,-0.6470457827258961
400,-0.4696017020106357
401,-0.3957117768643891
402,0.33217515702288486
403,-0.9875380100928192
404,0.16192020904324303
405,0.3353736467982184
406,0.17171559225453029
407,0.8325920248827892
408,0.04229019032258193
409,-0.5534272501127715
410,-0.8278644625611589
411,0.10468922819746798
412,0.9998643189545791
413,-0.017834526354288418
414,0.8205215551499095
415,-0.9581471753627381
416,-0.13745643494269283
417,0.6703435800573508
418,0.5340555369729334
419,-0.4069010963633924
420,-0.7956274458854609
421,-0.29334291646423116
422,-0.982967208949281
423,-0.18942754744448675
424,0.6454344889432819
425,0.9764085072786254
426,-0.4796589615954065
427,-0.410325366936312
428,-0.6479285596855091
429,-0.6587718612236032
430,0.48734845640455626
431,0.9922487907436973
432,0.9241225664005217
433,-0.5623622692577183
434,-0.5384975714801212
435,-0.11865593665245727
436,-0.00885000615304636
437,0.11484727331997205
438,0.012083143453887028
439,0.6547561756832089
440,-0.41298615498042224
441,0.16290233732693207
442,-0.3148274164500838
443,0.35732730469081625
444,0.6729870877490935
445,-0.2749241291414369
446,-0.32635743957451285
447,-0.039300227011349845
448,0.5104604706267107
449,-0.34246071521527766
450,0.11501650422837002
451,-0.8904464877474871
452,-0.5005115332623145
453,0.7817695390303432
454,0.11582938595000736
455,0.4657252515004906
456,0.6573714852807448
457,0.1477994040481346
458,0.5164327604640091
459,-0.053937520487726216
460,0.7958022034141574
461,-0.32496947717222485
462,-0.6320869378453635
463,0.1665575080685333
464,0.9898428729514821
465,-0.7730230950499806
466,0.7882210967745362
467,-0.13201238764409262
468,0.19856835493995414
469,-0.9665472992065597
470,-0.46275632188346305
471,0.489110562524782
472,-0.6586026262453463
473,-0.3192141040512954
474,-0.31808271560857804
475,-0.48749932571093635
476,0.8616975592321425
477,0.13745094024456034
478,0.06910917702705666
479,-0.5863313033307351
480,-0.007491422937781921
481,0.47989733997881306
482,0.4733206615837585
483,0.9999997971840746
484,0.2653836428181054
485,0.41261509185909184
486,0.015622791189080549
487,-0.12180880415315198
488,0.2552046017689056
489,-0.3760998855535958
490,-0.18793048002333512
491,-0.8390537270950944
492,-0.8280977944736434
493,-0.36723376792518414
494,-0.9316827671363156
495,-0.30401951662920684
496,0.528635399959504
497,-0.4204007819197566
498,0.9969889132346543
499,0.1283935017355357
