,0
0,-0.5519723811643431
1,0.41631765535761267
2,0.3696519527820756
3,0.9983102632950659
4,-0.06533111451389707
5,0.6547073091278138
6,0.5520137961881103
7,-0.9999553735435632
8,0.9359601833959038
9,0.4162740516026658
10,0.11754910303220731
11,0.526358049498012
12,0.251963344913204
13,0.9493891908308093
14,0.3711819630145068
15,-0.45473127410449393
16,-0.027379448928566374
17,0.06817157123184817
18,-0.3657514462694962
19,-0.18721217253136005
20,0.18721213937203554
21,-0.7668809558117293
22,-0.16002950148662431
23,-0.5381637879426031
24,0.17142962896693448
25,-0.06533107426183438
26,0.8040367694018918
27,-0.3787513862412388
28,-0.6308555551868334
29,0.5849736823767607
30,0.37832234526907205
31,-0.17701124337433918
32,-0.4163176553576129
33,0.2347010936819396
34,0.20954278551214595
35,0.4002062057616511
36,0.06490201982039125
37,-0.7809001090435918
38,0.39436582271805415
39,-0.1958922959118941
40,-0.10574623527632757
41,-0.7103969788126855
42,0.4037502654639025
43,-0.2001104943255381
44,0.28281571217332985
45,-0.6359245532787011
46,-0.9373702841611562
47,0.6354969765794963
48,0.07837538781044545
49,0.5849300239767835
50,0.36961065021972184
51,-0.9448771678614943
52,0.29335555942842423
53,-0.014720583587842263
54,-0.9864835127200632
55,-0.18721496041311325
56,0.791479346037778
57,-0.6201562063202077
58,0.6671995945748933
59,0.45308517012167976
60,-0.946633384343466
61,0.07833106750735871
62,-0.3657507430069625
63,-0.9319758578540457
64,0.6701353632314468
65,-0.36527877323582
66,-0.3657514726448585
67,-0.10738671503665041
68,-0.9383656928210401
69,-0.46853923646157924
70,-0.9995707422998661
71,0.39526597532190083
72,-0.06817441882885197
73,0.6359245537061915
74,-0.2520871604978469
75,-0.014335877870095009
76,0.9493884945661657
77,0.6489688558048562
78,0.014335147721803427
79,-0.07833102811027712
80,-0.0664926195822126
81,-0.39530767280818835
82,-0.5849729727104696
83,-0.20098800725961027
84,0.39525668604668435
85,-0.7980152496609576
86,0.4508558746250055
87,0.38525688205826414
88,-0.18556887880667172
89,0.4288892441504454
90,-0.3610529746581409
91,-0.3460199445725938
92,0.7120788034112149
93,-0.9422217489965472
94,-0.376325511781996
95,-0.9995714723652788
96,-0.38194918734555405
97,0.3783667198376681
98,0.635540577529765
99,0.9999969073353082
100,0.7921752122912991
101,0.07837395880769775
102,0.4669901116560126
103,0.4289335923637461
104,-0.41589003602915614
105,0.29135672922184885
106,0.64854053141355
107,0.814273343222485
108,0.027379449903347036
109,-0.9490037545372803
110,0.21289356353911498
111,-0.07790201349340606
112,-0.9364860249149093
113,-0.9995278186299754
114,0.3652795435532961
115,-0.21122459227893992
116,-0.06648981174990573
117,-0.3783231151590581
118,0.9983128852514142
119,-0.36575074300696225
120,-0.014720584539424257
121,0.9489608664547525
122,-0.18553037328472066
123,-0.9416607872367884
124,0.7905152008286942
125,-0.8057157186244388
126,-0.014335838045521162
127,-0.2742965323693885
128,0.9363456590865146
129,0.38506542756504536
130,0.27261189280436143
131,-0.6354969367549242
132,-0.945217899547352
133,0.999999027294089
134,-0.4685748919607076
135,-0.4158456730090695
136,-0.5854012766874307
137,0.9893322570082761
138,0.6485834194976043
139,-0.34457331328969654
140,0.9363456525983253
141,0.7446102803725596
142,-0.45837677501271007
143,0.10522587796201459
144,-0.598017253945627
145,0.7905442923718683
146,0.286723055718711
147,-0.1844396392440142
148,0.4691823587805569
149,0.562176200170028
150,0.46693444820170693
151,-0.28741233354562606
152,-0.3649244632800326
153,0.635496998777381
154,-0.2814670983792443
155,0.6387702059692699
156,0.7206007836490932
157,0.06528671736639385
158,0.7921660574800595
159,-0.6165117645912298
160,0.6473691801711294
161,-0.5854012572772023
162,-0.06485917198992583
163,0.5605300165966755
164,-0.014335147294313445
165,-0.5279628775824577
166,-0.44905286101616987
167,-0.9869561497605076
168,-0.19797387513355735
169,0.5279628377578841
170,0.9489609062793242
171,0.6485405481483629
172,-0.3019360090850167
173,-0.6585810753518371
174,0.987644728554014
175,0.5984019810509732
176,-0.999570707139993
177,0.4293183388439512
178,0.3986860069216414
179,0.28281566227977006
180,0.6354969987773813
181,0.949004558641803
182,-0.5849729727104693
183,0.7905700280507961
184,0.9999561790346086
185,0.30119199243756434
186,0.9359166050725615
187,-0.05615209401678268
188,0.9869118413717788
189,0.6427571981755296
190,-0.7652720227786743
191,-0.9869561853262496
192,0.5050937254504989
193,0.004539962729757898
194,0.5365204942179147
195,0.5980172136935648
196,0.39812031231078654
197,0.378795004816643
198,0.8023190408384218
199,0.635968941745645
200,0.6707856501956609
201,-0.46489366595484394
202,0.4289329021229323
203,0.20098800010390566
204,0.8158809815065518
205,0.23511097024788835
206,0.3936615290008005
207,0.261012353706401
208,-0.06490279202106113
209,0.649011760179457
210,-0.42936118710190685
211,0.6591633287278006
212,-0.9983151478533654
213,0.9864842821825592
214,0.4583739624405062
215,0.6540614228631114
216,0.37376853501976454
217,0.5984019814784638
218,-0.7446103467072306
219,0.2285189965696071
220,0.06648980938269253
221,0.36570713745169964
222,0.5853576395552255
223,0.9999997213293735
224,0.18553319008971336
225,-0.7360940403108428
226,0.7222796931068425
227,0.3653231084442298
228,-0.36105586450690835
229,-0.7745813247084753
230,-0.2584113522657028
231,-0.4973311629006423
232,0.20669294575188968
233,0.4293619324537145
234,0.9869118413717783
235,0.8040753035510516
236,-0.2509297541201797
237,0.28285420762629315
238,-0.5519724209889154
239,0.2260726079642037
240,0.4727600200059185
241,-0.49306359944874
242,-0.3783222814886901
243,-0.5519752311884355
244,-0.3783667202651585
245,-0.17515235197976659
246,0.6717156688046433
247,0.027335102115957875
248,0.3696106370606047
249,-0.6598090743977617
250,0.37836598977228214
251,0.01476420173575656
252,0.6354962293148856
253,0.7462536006658513
254,0.23894896185105474
255,0.3973040835997748
256,-0.4546899583815516
257,-0.6577438154404097
258,-0.2503347990138625
259,-0.8057157473100522
260,-0.36527881348788394
261,-0.9995271241503993
262,-0.7644612781389335
263,-0.9313906537772246
264,0.31464795686438984
265,0.3967944220670232
266,-0.6490117601794572
267,0.5365204734948916
268,0.3783223317997954
269,-0.3851039330883673
270,0.10574342131196204
271,-0.3850653877404717
272,0.15764348148954913
273,0.45308517012167954
274,-0.51953419056058
275,-0.18557173543760888
276,-0.4566921631339904
277,-0.9363893109998568
278,0.9999553731160729
279,-0.07790197601486012
280,-0.36109146732565084
281,-0.6434181587172786
282,-0.3787950442137252
283,-0.7920547418281298
284,-0.6520231633338556
285,-0.5280013643075335
286,0.9490045586418028
287,0.19739959651135008
288,0.3947282674801854
289,0.41589007585372967
290,-0.9363885077719608
291,0.9881169933532036
292,-0.46492937687235825
293,-0.282851317777629
294,0.20954279297242376
295,-0.9493891912582992
296,0.46731862948982156
297,-0.6490117207823752
298,-0.29608031893126324
299,-0.3787506561758522
300,-0.6359253235961776
301,-0.4163183998175456
302,-0.49119370802545825
303,0.41627401220558263
304,-0.45472844771533705
305,-0.5605300365530285
306,0.8028768170572813
307,-0.27918165666321926
308,0.41584644289902817
309,0.7927003539418856
310,-0.5979729270217451
311,0.19706060119823043
312,-0.6605120627116071
313,0.8010202916391529
314,-0.36109437003023026
315,-0.7462564506900443
316,0.9869126070013559
317,-0.3657078281200288
318,0.2619060420212077
319,0.3696519527820756
320,-0.9869561853262494
321,-0.2601099044505379
322,-0.9292538470773251
323,0.9983536178326555
324,0.05327489855946266
325,-0.3787514399778551
326,0.35941253089914066
327,0.027807773304623105
328,-0.3657507425794721
329,-0.17697269802781593
330,0.3987003481178793
331,-0.7120816534354084
332,-0.5984448478288071
333,-0.330654796960687
334,-0.8168998968708439
335,-0.2007860985254226
336,0.11594720049307518
337,-0.536517623470698
338,-0.0653303446239386
339,-0.36105586450690824
340,-0.36105300162827203
341,-0.49225936680765014
342,0.8028759262366857
343,0.21663151176364343
344,0.3657514462694962
345,0.3851038932637936
346,-0.36575144626949635
347,0.4530495146225514
348,0.6485833964063186
349,-0.5984455996279309
350,0.014335148232172778
351,-0.9897602870778917
352,0.5854012368628583
353,0.06817446108061555
354,-0.5979728659077537
355,-0.6163504004007961
356,0.07837249796178097
357,-0.11759045857972292
358,0.07790201583943365
359,0.18721217253136016
360,-0.5381994036158902
361,0.9869561497605068
362,0.46493218707187806
363,0.9490045248547291
364,0.06813591330690105
365,-0.5263552392983926
366,-0.027335101688467575
367,-0.4163183998175455
368,-0.04903517630165693
369,-0.73609119028675
370,-0.1789002446162572
371,-0.42893290255042255
372,-0.9159456323445465
373,-0.21122740247855998
374,0.01429148932182685
375,-0.18158469931680898
376,0.38228459187753105
377,-0.35784933481876335
378,0.02737940910399405
379,0.9363448896240464
380,0.8142733432224851
381,-0.1871764772089291
382,-0.6808499645184029
383,-0.5382022218918505
384,0.5382023126259811
385,0.06817441882885217
386,0.41584641745219825
387,0.2925850003894319
388,-0.7222797072163459
389,0.45837683596984474
390,-0.9379388204155928
391,-0.9897988324244146
392,0.661172520072662
393,-0.9567247186628519
394,-0.7206364391482222
395,0.4404482602879397
396,0.9881555386997265
397,0.6371297224441012
398,0.6490124133040089
399,0.37129524650676377
400,0.5849293545610027
401,0.8028371391107868
402,-0.7222439656202793
403,0.5979728867696811
404,0.47439851980906517
405,-0.8025947284312459
406,-0.6489688725244197
407,0.5503676523807232
408,0.2010264816616275
409,-0.36532243120986074
410,0.01429148983064132
411,0.18721217253136013
412,-0.18721217919660893
413,-0.4632860433230973
414,0.21118893677981176
415,-0.6485841260442147
416,-0.42888925984752874
417,-0.9374787756665982
418,0.3594096252340361
419,-0.5143444085951747
420,-0.49328905233801823
421,0.6699445002879502
422,0.17858577685058394
423,0.6388086716666487
424,-0.01433583804552141
425,-0.31520100735803974
426,-0.45837393130331044
427,-0.7925268417247864
428,0.9983088801301321
429,0.06528672647602404
430,0.11094326280668124
431,0.9363456525983256
432,-0.9864842821825592
433,-0.2411008149312128
434,0.014335837962617923
435,0.9489600504441847
436,-0.6490124739543236
437,-0.6523017873240939
438,0.6359245532787012
439,0.23334775215418108
440,-0.2735848288848339
441,-0.9376440079908358
442,-0.7462949960379405
443,0.19409312129561407
444,-0.7104383596522144
445,0.6485405314135496
446,-0.3652787602309287
447,0.1445525371123854
448,-0.4288900144678946
449,-0.9864834775986394
450,0.9999997217568646
451,-0.2037576609222407
452,-0.9149834475061684
453,0.9877296186941975
454,0.39096643190525554
455,-0.9983536178326557
456,0.9490045248547286
457,0.5980172539456273
458,0.06648981174990562
459,-0.19938036897554479
460,-0.41588927567461204
461,0.11759045857972278
462,-0.3712924495262377
463,-0.37879431414833886
464,0.9359165652479897
465,-0.7360555609944177
466,-0.014335877787189932
467,0.41631763035505004
468,-0.1993803618770758
469,-0.2251122003967362
470,-0.4967882325434294
471,0.7899420507219993
472,0.8010616205412455
473,0.598444848256297
474,0.06648981174990577
475,-0.07794636448180384
476,-0.415845687386786
477,-0.4163184002450362
478,-0.34491392110320634
479,-0.492079806294807
480,-0.9441146843225482
481,-0.31388534022323306
482,0.9876684750145072
483,0.6555583623621803
484,-0.7975173648531038
485,-0.4566921631339902
486,0.39233902603259746
487,0.01476416191118441
488,0.32154293947949253
489,0.9999990666911724
490,-0.8040339081789624
491,0.9999997213293738
492,-0.1753323003940858
493,0.8056800918109243
494,0.9999997217568644
495,-0.5805811115947028
496,0.6635209077266904
497,0.9869125667492917
498,-0.4649293370477854
499,0.6490124508477614
