,0
0,0.9999873101113116
1,0.9800995464592976
2,-0.9800871333512697
3,-0.9999749000949743
4,-0.9800871333512698
5,-0.995020594758893
6,-0.9800995603122005
7,0.9950205593313608
8,-0.9800995571778137
9,0.9751203580642902
10,0.9950205947588926
11,-0.9800871123061465
12,-0.9800995222880969
13,0.9999997477263685
14,0.9999997581178864
15,-0.9999873283980061
16,0.9950080870865174
17,0.9950080870843506
18,0.9999997615792707
19,0.9950205558699765
20,-0.9999747325365989
21,0.9751078962074997
22,-0.9999997615814361
23,0.9950081259749899
24,-0.9800871123083114
25,0.9999873491797431
26,0.9999873284001723
27,-0.9800872346865037
28,0.9800746749696642
29,-0.995020591295342
30,-0.9999997937183597
31,-0.9800871333491054
32,0.9950205947588927
33,0.9800870915293582
34,0.9950205593313608
35,-0.9950205947588933
36,0.9999871770520027
37,-0.9800871472020077
38,0.9800870915287416
39,-0.980099536100591
40,0.9950204270109538
41,-0.9999748873069378
42,-0.9950205947567282
43,-0.9800995709799206
44,0.995008090547902
45,-0.9800995222857879
46,-0.9999872997246453
47,-0.9999873283980065
48,-0.9800871333512693
49,-0.9999872893344276
