,0
0,0.19649227762963156
1,0.01188308668305607
2,-0.5766268998821
3,-0.049504918876065965
4,-0.3996042598609906
5,0.20302417213045262
6,-0.20255364803178466
7,-0.18127757636078407
8,0.3494280911705436
9,-0.0657054067049234
10,-0.17244726685714035
11,-0.037536522686256686
12,0.03980719602008029
13,0.11448356104499953
14,-0.23551694828135103
15,-0.34950100003647283
16,0.3804589823071921
17,-0.3606264223120224
18,-0.22506863593114124
19,-0.28002635306228557
20,0.1737332236010577
21,-0.00879574198160039
22,0.019811920228465275
23,0.028490332046779247
24,-0.10211483919749921
25,-0.03661185313459927
26,0.3341030611429033
27,0.21069614910621753
28,0.047814401694777395
29,0.7926125485444244
30,0.14427370163334308
31,-0.4181100657001192
32,-0.04457529218955412
33,-0.04172424106947686
34,-0.05488776148885281
35,0.05361357904350773
36,-0.02037353736472043
37,-0.1142789937610959
38,-0.006060394375314483
39,0.1067986215895369
40,-0.06074073583627968
41,0.34777577900624485
42,0.3296685078644765
43,-0.01489947535688654
44,0.22563238234413235
45,0.14702369221329856
46,-0.4130882563392452
47,-0.038887606779267524
48,-0.19894317524937208
49,-0.0020209901002462317
50,-0.15328346027383455
51,0.025382850784799536
52,0.05444633173479535
53,-0.6205029089887093
54,-0.12653296652482504
55,-0.1965120001295364
56,0.5067602346699209
57,-0.03298401455402474
58,-0.0877211048080883
59,0.9999490172276835
60,-0.010089257804605
61,0.1968061052086434
62,-0.08505435315577128
63,0.026179790235102852
64,0.0030760638474779307
65,0.05402685137700142
66,-0.04610240334243637
67,0.03684451537394522
68,0.14056683924361707
69,0.1692286340933136
70,-0.05955214833301243
71,0.03790437589385717
72,0.5107565019740116
73,-0.048566874216292515
74,-0.41332928338602015
75,0.04110050863729784
76,-0.024742903644563885
77,-0.033329900158366774
78,-0.2399727915352564
79,0.1933945413000016
80,-0.10501968214735051
81,0.17608887629255057
82,-0.06147275788680776
83,0.019328066012041942
84,0.999425697567168
85,0.01785571158259535
86,-0.06917016439566162
87,-0.1511882811166322
88,0.030091369728380758
89,-0.05314020122539912
90,0.018451761798388065
91,-0.28485538604544525
92,0.04326433614865296
93,0.8209068446167723
94,0.18002625199034575
95,0.1114845477734089
96,-0.17481772685263253
97,-0.2369497245394367
98,0.042120769296371686
99,-0.056025798412097504
100,0.14620038579311276
101,0.08084872213987776
102,-0.0056579888009581965
103,-0.09687416766562515
104,-0.10896565997154553
105,-0.39452014596087026
106,-0.21430942591375693
107,-0.13724397649569284
108,-0.3781212785262304
109,-0.058309438553485346
110,-0.31394161259922937
111,0.03141856548282695
112,-0.400836269887857
113,0.13054008476424347
114,-0.326047670569929
115,-0.1064670271665271
116,-0.11812976218671865
117,0.05229775995885767
118,0.4788416390442661
119,-0.008087750396486354
120,-0.30738109977147793
121,0.020335691617842398
122,0.022261400852590783
123,-0.5628521349715859
124,-0.43512659417256955
125,0.20953702436762395
126,-0.04933733336180151
127,-0.6222636084159474
128,-0.3380529451796846
129,-0.34573649985777316
130,0.9944312529780014
131,0.28981453786060996
132,-0.3723648356771893
133,0.06377697254838145
134,-0.039830583219319225
135,0.12896874107814293
136,-0.014837944163258026
137,0.09670594590693753
138,0.0015507891519246763
139,0.37923199896974724
140,0.47472787304396347
141,-0.09713837012960849
142,-0.3044354072761927
143,-0.23119090331247724
144,-0.1315096627987837
145,-0.013008385385623147
146,0.0721898440621392
147,-0.01965681469832959
148,0.1493231121133882
149,-0.4325684395106267
150,0.9596675679593385
151,-0.03388947625272374
152,-0.3763192805249044
153,-0.5695774817708945
154,-0.2391574146353488
155,-0.02145637602502348
156,0.103784549381924
157,-0.04715523925631094
158,0.052080020239360765
159,0.07445846014301305
160,0.4806299830738139
161,-0.37836522150946106
162,-0.2387145061951479
163,-0.001279503374676664
164,-0.1078384909475882
165,0.23346950619529713
166,0.022480417414764937
167,0.04691077967714731
168,-0.1313668511168616
169,-0.02456624369544917
170,-0.16435510779018872
171,0.11776942307521195
172,-0.01641475152207654
173,0.052216886444927876
174,-0.0781240090499251
175,0.014687541175688892
176,0.0036489875271279743
177,0.25266624426096107
178,0.17547644363521844
179,0.06184411934545747
180,0.336007802481346
181,-0.40944284271165926
182,0.016848920978713287
183,0.01541544507674381
184,0.00946113246012836
185,-0.4114925017508695
186,-0.20181968511317153
187,0.8216671210772404
188,-0.08279964761072259
189,0.35113510300841827
190,-0.4553640081086103
191,0.019340929623883327
192,-0.04057641444137764
193,0.30065561360861065
194,-0.2882027414189753
195,0.22970998931863423
196,-0.3940139488296618
197,0.9993789595300312
198,-0.17643917311416735
199,0.13811939719903643
200,0.0026402888054779185
201,0.012385538711023537
202,-0.009634292247663996
203,-0.06358455330708884
204,0.9944367012993249
205,-0.039822322659737924
206,-0.08903804926765012
207,-0.3205858031830462
208,-0.25767501403348914
209,0.32950793201418177
210,-0.006145922903861355
211,-0.5585992421638681
212,0.22508591202365283
213,0.33086965770994053
214,-0.07556190882517147
215,-0.07298749708710094
216,0.06965706513263276
217,-0.0946920520111687
218,0.3191586215566387
219,-0.2321976263456131
220,0.35644737509851215
221,-0.5659190482841322
222,0.28538018655828784
223,0.28252054585958636
224,-0.062187495121862835
225,0.001427150516684433
226,0.2821119497781941
227,0.13864632922633308
228,0.04438456020850341
229,0.17046845465784516
230,-0.13884154605115767
231,0.2106614850290929
232,-0.04730417270182589
233,0.006982940899198505
234,0.1764619309348213
235,-0.07359366359288999
236,-0.42673542498263045
237,0.34081530816726496
238,-0.0009755652502254232
239,-0.04557326864337216
240,-0.0021142275863221143
241,0.1625801842392737
242,0.010247928835703534
243,-0.17176972330032553
244,0.34954559563170007
245,0.03208019826756385
246,-0.035515306627056896
247,0.051739142455683854
248,-0.4009166614947668
249,0.3768033893607847
250,-0.3347646919577168
251,0.02849601521961632
252,-0.38789076862782906
253,-0.025976274514362213
254,-0.2455956522442722
255,0.3079694499076804
256,-0.5636732519640986
257,0.21364481220192064
258,-0.28292995744945665
259,-0.043812605889895946
260,0.29310238616548584
261,0.3518645927170256
262,0.2693906998762837
263,-0.016568270861727324
264,-0.0840381715746028
265,-0.023944837944765575
266,0.18739790217451271
267,-0.17010871496022567
268,-0.315219819174407
269,0.028162248268926618
270,-0.052461002647647526
271,0.15278695193035538
272,-0.1319414334844908
273,-0.025816246305643126
274,-0.08991571989045452
275,0.20015197688308403
276,0.15731810996910606
277,-0.0230361992354929
278,-0.04073188470679873
279,-0.3868056483221783
280,0.0063415415540889935
281,0.0864203000658257
282,-0.3954071087692727
283,-0.03808119651048708
284,0.18032019332583404
285,0.09269057469969752
286,-0.21763829386044647
287,0.007867247562870315
288,0.0067036926736399
289,0.025029951520121187
290,0.022247512343520078
291,-0.40093329642948056
292,-0.09463357902071108
293,-0.34667000950396826
294,-0.10253580683385831
295,0.7930560639878054
296,-0.010732849192175088
297,0.194171911615562
298,0.06683701002140471
299,-0.38598514354333574
300,-0.03957534352702912
301,-0.3356228013220291
302,-0.09274645656124332
303,0.026036776147621316
304,-0.1411921926094337
305,-0.012812834640288939
306,0.18175581417035674
307,-0.39560540496589747
308,-0.04911889834507354
309,-0.3765024730485318
310,0.010384821712307382
311,0.1537242337254909
312,0.17931679801641834
313,0.31702029587287706
314,0.012170775556137476
315,0.3794244559787019
316,-0.11517747862866032
317,-0.001379954842915658
318,-0.3903760806442019
319,0.37725216762639585
320,-0.165344191726631
321,0.7950521864912068
322,-0.05740978585523045
323,-0.28539586607599454
324,-0.2192483796934441
325,-0.07630397377988606
326,0.025777788155413386
327,0.3574090596055627
328,-0.08429677207650743
329,0.3070351114986728
330,-0.004404913590110674
331,0.01739398500709561
332,-0.031771595607474744
333,0.0101537472311292
334,0.0370153112599015
335,-0.060956641539378215
336,0.12139502364872246
337,-0.3845251018108644
338,-0.017682038234911757
339,-0.0193259828947868
340,-0.33587295863724426
341,-0.04411310812262095
342,0.19989155748276635
343,0.10548229534033132
344,0.26659864271123707
345,0.034669731734939015
346,0.012829811443259667
347,-0.17167222196291418
348,-0.00023853774790000564
349,-0.032336894026465855
350,0.02796365797678117
351,-0.008585035919999139
352,-0.11437015442119933
353,0.1967606742802671
354,-0.02404841543649488
355,0.2546042349740587
356,0.3772489629062807
357,0.014223651843482005
358,0.3886231135386961
359,-0.3323726319801419
360,0.026880074053605364
361,0.1320176396518158
362,0.01744859429944891
363,-0.23201636423706096
364,0.13460575314487677
365,-0.2187063831371756
366,0.20815093012132121
367,-0.2294050066640862
368,0.04186350351014155
369,0.021619184500539332
370,-0.25099040169468867
371,0.015723704198492984
372,0.20268415232360176
373,-0.19097575343093678
374,-0.00965579275850492
375,0.38302136479876325
376,-0.3722638662290634
377,-0.11404362086176119
378,0.020438038525312043
379,0.3220839439696783
380,0.28480798717072253
381,-0.06500676721899006
382,0.17864689293100808
383,0.031471232454305685
384,0.007007393229909319
385,-0.05412688360552634
386,-0.004660434767469972
387,0.01913122336644213
388,-0.40703506205090273
389,0.12194494216633768
390,-0.0932003710202421
391,-0.0861977728961343
392,-0.23781117898771795
393,-0.3897535396943792
394,-0.18287722359373157
395,-0.4225171571697267
396,0.1319239072677247
397,0.22423829640639215
398,-0.12024181618929616
399,-0.044870612980983465
400,0.9647336675331136
401,0.08558941427287595
402,-0.20733001606997759
403,0.019304200120232557
404,0.30915795069894414
405,0.022387307768003396
406,-0.04807009279297533
407,0.37887012638041534
408,-0.10016876884508205
409,0.27846439394495076
410,0.14324058199604373
411,-0.338778374666935
412,0.20192619394707803
413,0.821193799553823
414,-0.3217929726691712
415,0.10828644462920202
416,-0.38574038968743585
417,0.22709065546376844
418,0.3263171808644734
419,-0.20733166351661705
420,-0.04047285146270793
421,0.007111214703131107
422,0.2936791087767757
423,0.13204331515482806
424,-0.041625913112110044
425,0.33670458766853567
426,0.015768290386851583
427,0.11913035400201769
428,0.10387339755863013
429,0.3358749684736258
430,0.07721162079361292
431,0.3189196506711117
432,-0.13048464362273404
433,0.21242793759536366
434,0.19119940093159082
435,-0.45110472668287155
436,-0.39268060456874687
437,-0.013832585639510325
438,-0.012988162077905192
439,-0.06112375020270112
440,-0.08014060894783237
441,0.33614537186985005
442,0.0019867378600231587
443,0.0021898525665940824
444,-0.025121163137909772
445,-0.2774566389121033
446,-0.07017862264010355
447,0.9999995791202944
448,-0.2350500820550804
449,-0.033197574176155535
450,0.324314292613578
451,-0.012043821410557959
452,-0.3350268777747564
453,-0.024460120595355433
454,-0.0048105645054748285
455,-0.39432365126872915
456,-0.2339041655450805
457,-0.1997969255036042
458,0.1722529158196045
459,0.011135340169361286
460,-0.14508219233550496
461,-0.07520583647752768
462,0.014424210535219553
463,-0.20436775588087025
464,0.011453843726536026
465,0.17768107978179234
466,0.36958056732058125
467,-0.05345170507239159
468,0.27627847417699086
469,0.11059980811891976
470,-0.005463232568590741
471,0.3503550622963333
472,-0.32953845235565854
473,0.13403507413909502
474,0.03368672657637704
475,0.024023749675208074
476,0.06657831939170124
477,-0.0047056233949848
478,0.37016041305822717
479,-0.08688678511850169
480,0.7845631096873251
481,-0.10673452337693201
482,0.3445632408549286
483,-0.057434323475206106
484,0.9993755801978458
485,-0.10342009344589323
486,-0.07578004400553644
487,0.9641762246876698
488,-0.6248062724718095
489,-0.04175704177763896
490,0.28225275920529264
491,-0.25001119030367935
492,-0.6205868961495434
493,-0.027067050295384098
494,-0.1027723401285464
495,0.13562196570985854
496,-0.09402352807866454
497,0.037048494349873354
498,0.1860114134899348
499,-0.002127555679100984
