,0
0,0.30367775329794877
1,-0.11508517813220913
2,-0.625008504785372
3,0.06475940661494838
4,-0.3816610409434771
5,0.31634633481193186
6,-0.05098326715666871
7,-0.24125857616156968
8,0.44263549051152823
9,0.03375040095521321
10,-0.028682135244784888
11,-0.023486461284978763
12,-0.14613440705852906
13,-0.05735285321226786
14,-0.4896893628734884
15,-0.35843578113203656
16,0.44816617841684864
17,-0.39412369654194324
18,-0.5015306961569418
19,-0.009361751169762627
20,0.2895686884464407
21,0.011332070482272905
22,0.20034003389412047
23,0.05972726369960818
24,-0.1009278022933056
25,0.09341191098557342
26,0.6349405086893596
27,0.12663107144468985
28,0.11443960726288312
29,0.9171870680825682
30,0.10318049742831283
31,-0.07703663701079835
32,-0.0504110982849115
33,-0.1038728434905854
34,-0.05840227911490263
35,0.06408449656763585
36,0.23139147029566165
37,-0.09894920771096832
38,-0.06888839275412335
39,0.2561454913987557
40,0.10711853389083174
41,0.451717282342727
42,0.38902535363407764
43,-0.08028289126245192
44,0.1362020575147664
45,0.2818178714739472
46,-0.3921958142947595
47,0.07773244130091966
48,-0.24666784959616483
49,-0.12366986671298548
50,-0.08780451832443723
51,0.0658066769277198
52,-0.13319009209589175
53,-0.6544189225827508
54,-0.22649105257482732
55,-0.2496049177382455
56,0.7076410533114155
57,0.0064137123070170145
58,0.002554667367183768
59,0.9999936688346776
60,0.0806216558903098
61,0.11504804913803013
62,-0.06427253740555838
63,0.11927824682107631
64,-0.04188567894905468
65,0.0495428446020483
66,-0.10884920820937645
67,0.14477249527651728
68,0.31300030083322167
69,0.10942296517311134
70,-0.2256036371965033
71,-0.13547640288251622
72,0.70915761698602
73,-0.04641647955131031
74,-0.0719469553668258
75,-0.12251150837785468
76,-0.14312844565870173
77,0.07997922097690413
78,-0.06566974447690573
79,0.3140876849329185
80,-0.07682968315961516
81,0.10370177338498096
82,-0.04739199160337678
83,-0.12517831131156
84,0.9999065001675737
85,0.08073863287589648
86,-0.057288474564341565
87,-0.10506724544746567
88,-0.11833246945766698
89,0.07375230811633271
90,-0.027799048187109154
91,-0.010740069076306577
92,0.020030137720752742
93,0.9260307201190965
94,0.1112439645248193
95,0.2590801330324346
96,-0.2771178576584484
97,-0.13062144737699213
98,-0.14661542877130512
99,0.04498783725340533
100,0.27498307683154066
101,0.23195111162430365
102,0.025894892749359192
103,-0.02387537583277021
104,-0.056014456101853835
105,-0.6691695370214633
106,-0.5228708920445996
107,0.028169906202334033
108,-0.6302949211802399
109,0.05867967489714059
110,-0.4297726533717242
111,-0.03771287982025538
112,-0.37716014896916306
113,-0.06230618662108896
114,-0.4595168078338039
115,-0.1120766697773632
116,-0.08730709484067947
117,0.1439771238195146
118,0.7007302092697792
119,0.1886373628679392
120,-0.025097725998425125
121,0.02727194227855317
122,-0.03422891188776444
123,-0.6171167107696862
124,-0.0781047763283877
125,0.11463521082530591
126,0.042125809773746414
127,-0.6561570359017281
128,-0.30723838547256693
129,-0.36681258487495616
130,0.9987785005476457
131,0.36691408670287823
132,-0.6596816230417338
133,0.07259736769100814
134,-0.0073475737925005205
135,-0.04569957538990473
136,-0.03387927278825151
137,-0.05914532472845863
138,-0.05555989866254102
139,0.4701196467787986
140,0.6989546668911715
141,-0.21217351080943184
142,-0.02119564357078456
143,-0.5063667297269444
144,-0.09675336964385158
145,0.0407263295356263
146,0.07591190744674042
147,0.06945330206080985
148,0.08762460643080944
149,-0.08373638906021892
150,0.9882204996017989
151,0.055247457447926564
152,-0.661943662141591
153,-0.625894821885555
154,-0.5273968841948811
155,0.020039387589093093
156,-0.07263247022388818
157,-0.031863059953815345
158,0.1457550531805808
159,-0.07741032346421174
160,0.6999273178426956
161,-0.3949507115787213
162,-0.5044934801097677
163,0.007674292036319413
164,-0.08241105235570999
165,0.3402795083063593
166,0.19953452658729512
167,0.041192907621851474
168,-0.11498584320569143
169,-0.01920342232083719
170,-0.12118957322946865
171,0.0013725345857682203
172,0.09516763371732803
173,-0.1302263480961139
174,-0.08503257413010532
175,-0.09736991148683308
176,0.0970574679757698
177,0.36668498297562335
178,0.10096980151387783
179,-0.06049949889750691
180,0.39985031792356246
181,-0.39183546857900414
182,-0.07028938247412049
183,-0.15569871660935117
184,-0.13290461316459046
185,-0.48856815012618937
186,-0.5007382739954797
187,0.9263273072279508
188,-0.21685392010607057
189,0.6419845754528317
190,-0.09480079439673002
191,0.13195481789055058
192,0.018890609323892398
193,0.3820337979529025
194,-0.013992538338204154
195,0.33442977682891456
196,-0.6685343698578592
197,0.999900846386451
198,-0.24631328465148125
199,0.25073464738616363
200,0.07001910873530043
201,0.001924098910049597
202,-0.0414417939716783
203,0.06607239236829593
204,0.9987781968035119
205,-0.06677207509122184
206,-0.0780056384064401
207,-0.4411833777877997
208,-0.5072271631354287
209,0.6335005410194985
210,-0.026010620740801238
211,-0.6206979354473872
212,0.1074680365943274
213,0.38915391940543115
214,-0.06578884950282964
215,-0.08255793973358508
216,-0.08010265060655691
217,-0.10990290953329146
218,0.3867241548515578
219,-0.0834503261339374
220,0.43107370950766427
221,-0.6155967423379846
222,0.16118368199411526
223,0.36806654635920827
224,-0.2139770236376254
225,-0.041896927601358
226,0.15628556497926943
227,0.08321054965075182
228,0.06439089227903146
229,0.27496452010995603
230,-0.09875547161335535
231,0.11634831262086431
232,-0.21538932319809082
233,-0.13256923625374317
234,0.2670629345345006
235,-0.2580158587043227
236,-0.07803835306873039
237,0.37009132148774676
238,0.11520070635733616
239,-0.0474448847189026
240,-0.03998841325852459
241,0.28641619539240337
242,0.08013730121874166
243,-0.10697024949743798
244,0.6415497963345673
245,0.04867319875238863
246,-0.030714908795761182
247,0.14927693524332866
248,-0.4680300778624391
249,0.4659925571459003
250,-0.4439594365864948
251,0.1148371010524244
252,-0.6660006978867259
253,-0.1799668960606453
254,-0.10765610569753988
255,0.38333833773096626
256,-0.623689138461712
257,0.10822773899747118
258,-0.5434695110672779
259,-0.056397523774924206
260,0.15786422283930365
261,0.40158429364134446
262,0.15513405037535127
263,0.001083498066809317
264,-0.07698310851740787
265,-0.033867077351350056
266,0.09834644294218464
267,-0.0762092930485913
268,-0.023780784112995827
269,0.11774499274151998
270,-0.02094068026792934
271,0.03322089074259813
272,-0.21971479822698495
273,-0.04325119712246771
274,-0.052006462409634885
275,0.31440765657495495
276,0.2839388661360026
277,-0.17094328386359256
278,-0.04226641699578052
279,-0.3890156978641903
280,0.08865640336948581
281,-0.0763908449633857
282,-0.48411623945753296
283,0.06089224744870754
284,0.28421975788842085
285,-0.0818699991642855
286,-0.07292619274442927
287,0.07315719030861272
288,0.11636719992989397
289,-0.12949187889075675
290,0.1547395339651861
291,-0.4652694241829087
292,-0.15566622662081683
293,-0.3474500744036011
294,-0.1310225962069741
295,0.916920015046651
296,-0.040031183163849446
297,0.3146265022126276
298,0.171836777134783
299,-0.6600239098952625
300,-0.051577075582040686
301,-0.4563313159695251
302,-0.23739326751338088
303,0.10661889918776457
304,-0.09194694920991697
305,0.11373255622436511
306,0.3131235768888126
307,-0.6693970885313003
308,-0.0724800744185401
309,-0.34660166012780164
310,-0.09292711042339899
311,0.26017513001686393
312,0.11169657400573176
313,0.36776584463847195
314,-0.03691612317911384
315,0.46979567845892956
316,0.018066699147977684
317,-0.04146688400287598
318,-0.664211569391446
319,0.47279792941601906
320,-0.05062617848303538
321,0.9183241075251473
322,-0.22951009221735744
323,-0.016598398737720788
324,-0.23349845433552927
325,-0.13935512403668374
326,0.03339105507920038
327,0.6428435393651927
328,-0.07845927563457751
329,0.37287775623129554
330,-0.1424702640590362
331,0.016691900115274962
332,0.07375417947215435
333,-0.05805640574258571
334,-0.13452526817474295
335,0.028824909505636372
336,0.2934263954814772
337,-0.6676768739039375
338,-0.046929995051050055
339,0.18904767572054623
340,-0.35299502593032234
341,0.07189048892325195
342,0.11409304582352126
343,0.07544498422792012
344,0.3414729760190262
345,0.035327874434848416
346,-0.15453760682433776
347,-0.2790962123116565
348,0.19067200411559365
349,-0.04208316192602549
350,0.08880334752681482
351,0.07856203681983719
352,-0.07585533552103199
353,0.3358340062243659
354,-0.1831061484343496
355,0.14426871219550605
356,0.4453838464797824
357,0.02598065147959493
358,0.4646934249035557
359,-0.444590538497045
360,-0.10424589642818939
361,0.2532814237323993
362,0.1277159398872643
363,-0.057622356953948885
364,0.25360873870473727
365,-0.5075368128112461
366,0.3210994649695319
367,-0.08323332100859149
368,0.13687237511202763
369,0.19870428157669515
370,-0.5238238036574919
371,0.13454260240146879
372,0.11360300489841482
373,-0.2578133649915536
374,-0.20793766188378493
375,0.44766221497036773
376,-0.47637102056487635
377,0.01650152779398407
378,-0.11785941334764383
379,0.40670571350755047
380,0.3476598705808355
381,-0.04356357791310269
382,0.30301213720405745
383,0.05869225860952419
384,0.12578463787995342
385,-0.06165500587025017
386,0.013267008434322452
387,0.04366030551901853
388,-0.39756528037465044
389,-0.057946105318690884
390,-0.06939149545489787
391,-0.07414327866103332
392,-0.47882370328814305
393,-0.48122413825206595
394,-0.22417559591645958
395,-0.07381422684422642
396,-0.046049704607935664
397,0.3541626488117299
398,-0.07973846139969441
399,0.06816129536615537
400,0.9893652208466104
401,0.10022515143119747
402,-0.2691271057180527
403,0.0905306236201425
404,0.40943696376199346
405,0.19753984836948554
406,-0.09681441950346781
407,0.4569875462187093
408,-0.07503609000712747
409,0.15834447216346476
410,0.3314110264678597
411,-0.632587448824701
412,0.29715876045246337
413,0.9263318895308124
414,-0.4390172927624712
415,-0.06942176230003225
416,-0.6630304496938295
417,0.3131212196327314
418,0.4398106550601063
419,-0.4768720075451267
420,-0.056446383623520356
421,-0.15870405987540223
422,0.3829124809788293
423,0.09408374069745776
424,-0.219144171764038
425,0.4294194689668244
426,0.016942920193268037
427,0.22952708813511147
428,0.24620761786642817
429,0.39166695733273216
430,-0.08047649680789969
431,0.37731699867829804
432,-0.13400816818810393
433,0.1438568026671334
434,0.3254519021785954
435,-0.08627715082244708
436,-0.6684457073683017
437,0.09288321874317079
438,-0.040382353611695954
439,-0.07236780981134024
440,-0.0865212665670903
441,0.416800034755791
442,-0.17930158427600143
443,-0.04490306108185508
444,-0.1508747348571533
445,-0.5386864269511773
446,-0.04381220821272387
447,0.9999997491868738
448,-0.514391540617526
449,-0.1029311164710106
450,0.4316592589562606
451,-0.008713394274048483
452,-0.6291252079518194
453,-0.15259323885143694
454,0.1926192985391388
455,-0.66451009420628
456,-0.049593852712917504
457,-0.23794870147944439
458,0.0966550038009787
459,0.013008941879157914
460,-0.2159061229116713
461,0.018200067663456384
462,0.014061481578472288
463,-0.4926244742670433
464,0.10211680866741824
465,0.09166771383324565
466,0.4557120669486239
467,-0.050637532820050055
468,0.14794036101642266
469,-0.05378788567237198
470,-0.04007746325358087
471,0.6407478485981567
472,-0.3664070690042865
473,-0.05539821556584075
474,0.13617136571864694
475,0.12724377307379067
476,-0.102596405204345
477,0.048940490133258525
478,0.44309699121075313
479,-0.061222849700178515
480,0.9151318564977287
481,-0.0616340857244821
482,0.4268739260749752
483,0.07835183574628828
484,0.9999003464891513
485,-0.1420351749086197
486,-0.21753858860928055
487,0.9892869629279398
488,-0.6597661460362881
489,0.06455310406536431
490,0.15404906400993
491,-0.5140439193238238
492,-0.65256353992774
493,-0.12306810760450346
494,-0.07194866035809107
495,-0.04657972357015374
496,-0.07241149692333058
497,0.06473547580465276
498,0.11972386245747879
499,0.19053836625313722
