,0
0,0.8874946943320636
1,0.38320154048869765
2,0.9820853777850148
3,0.5024640068225531
4,0.6418141840481516
5,-0.2923839866327306
6,0.9999816024841831
7,-0.8602773196850947
8,-0.5073635686201877
9,0.314945928486808
10,-0.7765182180553647
11,0.6246619643912571
12,0.6372911931802047
13,-0.2924018322000189
14,0.8692589164574238
15,0.981757328902929
16,-0.8479553599826197
17,0.6326911279006251
18,0.9996276142966639
19,0.3147735166561922
20,-0.40968248363398196
21,-0.8920175480914112
22,-0.8648006048273489
23,0.5073592003137628
24,-0.9954720990566904
25,-0.5028405729463518
26,-0.8648050994094609
27,-0.7639589947893769
28,-0.865176994062809
29,-0.5205208938785763
30,0.31494534998953966
31,0.8696551928035228
32,0.8648004458279887
33,-0.8600505728518807
34,-0.38284196040821067
35,0.8695872841890703
36,0.3148438086459818
37,0.8741337536055522
38,-0.2748597371812167
39,-0.7762901423295736
40,0.6376588497288793
41,-0.4100264943417152
42,-0.4003838934911384
43,-0.8602661878817891
44,-0.7641884724199732
45,0.9999996371599493
46,0.9954722580944532
47,0.5073590412952443
48,0.6246621426553042
49,0.8871424969870059
50,-0.7762717356999523
51,0.9996399128598201
52,-0.8602774014431921
53,0.5028362056261378
54,-0.9954720990566908
55,-0.6418141830808791
56,-0.8651724677241407
57,-0.6243202495314839
58,0.64218638783221
59,0.3828596376278504
60,-0.7641828004667555
61,0.8602819584294018
62,-0.9954766244090608
63,0.8648006038602197
64,0.38766202134521927
65,0.5028405729462784
66,-0.8919998968045131
67,-0.426885766130324
68,-0.5166622238811985
69,0.6421818614743046
70,-0.5205309621641601
71,-0.5069871954947183
72,0.9951000407652809
73,0.8874796603693847
74,-0.7762902299877303
75,-0.5085618333904052
76,-0.5073590422816121
77,-0.5373560889369844
78,0.9817390785331445
79,0.8916580036620451
80,-0.38318369167033767
81,-0.6372866441524463
82,-0.426859058240873
83,-0.5373488535813377
84,0.8874946915241394
85,0.2748598892937714
86,0.9999951108213537
87,0.864800603860147
88,-0.6421862288136828
89,-0.6243200751917614
90,-0.9951046025320726
91,-0.6326911465331716
92,0.3147118817980871
93,0.6376631943274302
94,-0.7581973018566392
95,-0.3828418082770026
96,-0.5073635866836746
97,0.8692407700582876
98,0.7406553424041334
99,-0.865177122259502
100,-0.5205136615105938
101,0.9821336229307134
102,-0.6421817024749447
103,-0.7406731814546479
104,-0.4007079372096992
105,-0.4271861779845502
106,-0.5069870364761919
107,0.5069871964810129
108,-0.5028362056261374
109,-0.6421862367060147
110,-0.9954765889673879
111,-0.6421863659550392
112,0.8874943898896707
113,0.8874766974854084
114,0.633015052386503
115,-0.7762876893876363
116,0.9954767479859802
117,0.8741336054240799
118,0.6421816805980163
119,-0.6372866441524467
120,-0.7406552166427903
121,0.38744278265618676
122,0.7410150745660113
123,-0.8651726267234306
124,-0.8651771222595009
125,0.9821034931739901
126,0.7585393510043174
127,0.6376586679888516
128,-0.9999997971840042
129,0.8871306253645626
130,-0.6330152005871955
131,0.40038404560341195
132,-0.4268821183842931
133,0.8651726277097985
134,0.3019156750115205
135,-0.8602773121271237
136,0.29272589016591016
137,0.5028405729271157
138,-0.41000956247584175
139,-0.9999996025629176
140,0.9954765899537553
141,-0.9954720990758555
142,-0.6421818396165349
143,0.9951045670845512
144,-0.5069871964810129
145,0.9821336540037646
146,0.5073637276387085
147,-0.9954720990566898
148,0.7410149224723911
149,-0.6372911941666429
150,-0.7585213289052951
151,0.5069871774254667
152,-0.6372868041573334
153,-0.8651724369025483
154,-0.6501973783469742
155,0.40071028911578876
156,-0.4271859557967844
157,-0.8477402096849205
158,0.741014948854198
159,-0.8916756906379274
160,0.6372911714773185
161,0.7406553726669327
162,-0.9821158188464044
163,0.507363585678072
164,-0.9996230533359728
165,-0.6505394274641138
166,-0.5028362056262083
167,0.400725950940716
168,0.3876762081731652
169,0.6376632160434899
170,-0.41002626255379354
171,0.4004672573385295
172,-0.6418265005824535
173,0.8871484489170115
174,0.9999996055383665
175,0.869587043480611
176,-0.5073590593585701
177,-0.637663353345948
178,0.9821336579156308
179,-0.999639912878468
180,0.40072595186204485
181,-0.5028407140623427
182,-0.6421863888185744
183,0.5338444431842683
184,0.5024687100687939
185,0.8871512553341
186,0.30168242493688285
187,-0.5201876439540107
188,0.8606494243317144
189,-0.6372913295094703
190,-0.2748777322745151
191,0.8651771222786667
192,-0.6421816796115767
193,-0.5069917218142191
194,0.8606539813117792
195,-0.9996230523688403
196,-0.8352489385343236
197,-0.6326731328265452
198,-0.8600513300428615
199,0.30476113758873896
200,0.9999952708261743
201,-0.8599682603357437
202,0.864804972166727
203,-0.5069871774253947
204,0.3828598033895895
205,-0.632691127900912
206,0.3831836877771177
207,-0.5330787786621006
208,-0.6376586670024855
209,-0.38285980338958947
210,-0.7639591390937857
211,-0.5163381659454912
212,-0.5377008277933174
213,-0.4271859997323662
214,-0.6418443396522511
215,-0.7641987353700901
216,0.4004842882512858
217,0.5342043045775671
218,0.8741515926939969
219,-0.7762902023502755
220,-0.2752194693617424
221,0.9817390755861632
222,0.8695139924023861
223,0.8692398898885657
224,0.8606494243317883
225,-0.4096992720129353
226,0.8741515654648221
227,0.8606495843174372
228,0.9999997615814382
229,-0.5166799253211107
230,0.7585214849297185
231,0.9996532215026646
232,-0.6372911931802063
233,-0.5338624304728338
234,-0.502464182743759
235,0.31494582060233645
236,-0.6418096577288115
237,-0.8741337575360668
238,0.9999996025437511
239,0.89167581098582
240,0.534204327489875
241,-0.5201874577683318
242,-0.7581796149180491
243,-0.6326732888503975
244,-0.8916579680237244
245,-0.5377008278360416
246,-0.5024687090631894
247,-0.4100263461852224
248,0.6418142059119986
249,-0.5166799108564536
250,0.8696048563645753
251,-0.637663376048381
252,-0.6505572626394824
253,0.8696050016188311
254,-0.5201873377460535
255,0.9824753600176522
256,-0.8602775911091894
257,0.8602819584293302
258,0.8696050014207293
259,0.6376631933410631
260,0.6505572857826816
261,0.86924077318397
262,-0.6418143649305948
263,0.3016821596585038
264,-0.6330330171001224
265,-0.5205311219472455
266,0.6376586907104264
267,0.9817431156539588
268,0.8692587582026364
269,-0.5069870374433221
270,-0.5205125042522349
271,-0.5199901548548601
272,0.6326911465328857
273,-0.9954722571080852
274,0.7409971097663264
275,-0.8651724379080089
276,-0.9999997576509223
277,0.3874301152478105
278,0.9996352265378591
279,-0.6505571336890544
280,0.6376632160435604
281,-0.5024641837301269
282,-0.5373573293355544
283,-0.2748775801808937
284,0.40072595441902564
285,0.40072577627828965
286,-0.7765170983535458
287,0.999653377720858
288,-0.38285964736544764
289,-0.520531005181555
290,-0.6372866441333528
291,-0.5205143123339363
292,0.9820854959072839
293,-0.7722600924713731
294,0.40070793720941256
295,0.38768860855173404
296,-0.274877742079252
297,0.6421863659361068
298,0.891675807073667
299,0.8692589149788436
300,0.5338624153594241
301,0.9996351869981631
302,-0.7642156078440981
303,0.8695868950707699
304,0.50283618772391
305,-0.6372866441332807
306,-0.8602775614674669
307,-0.9954765899538256
308,-0.5201931119099585
309,-0.7406552166427903
310,0.30168213675187366
311,0.5028361877047438
312,0.3143958932028512
313,0.8744933376171272
314,0.9996577124459364
315,-0.847966360181087
316,-0.8602774014434188
317,0.8874945965794975
318,0.6326731553327377
319,0.29240198431229225
320,0.9817433156581702
321,0.5024686921604136
322,0.38765608430756127
323,0.2748775899672639
324,-0.7641553122485497
325,0.641826656625241
326,0.642186206917284
327,-0.427203087363845
328,0.4004684971474431
329,0.6330152005869077
330,0.9996400294011973
331,-0.2752196214740106
332,-0.7639616159771877
333,-0.4007257866333198
334,-0.6246621165038102
335,0.5341863133964216
336,-0.9996579001483846
337,-0.4007257905265413
338,0.5341864884203648
339,0.27487757626902587
340,-0.40070810356958836
341,0.40072579052654095
342,0.8602821174479269
343,-0.860282118434294
344,0.9951001997837305
345,-0.7406553726852929
346,0.9817569262613102
347,0.6246441292531811
348,-0.6326911279192732
349,0.6421818395972974
350,-0.5024640058361869
351,-0.99510456611742
352,-0.6330150484559871
353,0.6326731328078995
354,-0.7762800356500392
355,-0.5202042459692312
356,0.642168526885879
357,0.31470021612565513
358,0.995104602532145
359,0.999635344010223
360,0.6330330396377734
361,-0.7639616135593156
362,-0.537684210392967
363,0.9996232479437963
364,0.3149585199446599
365,-0.7765170750849454
366,0.8651724687105096
367,-0.5069871784118338
368,0.6418143430666726
369,0.6505394235519592
370,0.9996275796937135
371,0.4007259283906979
372,-0.8648049403718502
373,0.8602774320715715
374,0.31496256276691537
375,0.999999793234432
376,-0.6246442813465168
377,0.3828419467777374
378,-0.9954722570889217
379,-0.9954722216666381
380,0.3832015443822046
381,-0.9954722570888489
382,-0.9996230889443632
383,0.8744933064825655
384,0.387676316246949
385,-0.9999997971649093
386,-0.6421816796115778
387,-0.42689284086625306
388,0.9954766254145925
389,0.3146991756818197
390,0.8871132936340953
391,0.6326911279195594
392,-0.8648049721666567
393,0.9824755471275851
394,0.637658848742585
395,0.2748775899483306
396,0.6376633523786754
397,-0.4272026749551807
398,-0.8741336054237935
399,0.8692407534033358
400,-0.8602773076933938
401,-0.7639616407620711
402,-0.9954767844138825
403,0.999627737706701
404,-0.4272053247183882
405,-0.9824753949963769
406,-0.5028361877239104
407,0.740655342385773
408,0.8871304624768266
409,0.8692698809202488
410,0.4004796949796821
411,0.5073637446966693
412,0.8606539516565863
413,-0.6246442813651644
414,0.507359218358002
415,-0.6372913295095423
416,0.5028407140432506
417,0.887148657049555
418,0.4004673326036535
419,-0.6376631943274301
420,0.6421683937062745
421,0.6505392985127652
422,0.38285963373463056
423,0.7410150745843754
424,0.8874765966291113
425,-0.38285978974012047
426,-0.6421862069173573
427,0.40041443328289283
428,0.6246621165038105
429,-0.7762901147353565
430,-0.8919998928926443
431,-0.6421863878321367
432,0.31471264033208735
433,0.999623088944435
434,-0.8651725969266003
435,-0.847960964014726
436,-0.6505392753704919
437,-0.7765170681648852
438,-0.7654062669213662
439,0.27487758605539436
440,0.8602774014625111
441,0.5166799253208245
442,-0.6372868041574039
443,0.40046693062604494
444,0.5163203452589848
445,-0.7406553424044195
446,0.5073637276194707
447,-0.2923839827208628
448,0.8874944151708329
449,-0.6372913304767435
450,-0.5166622422941027
451,0.9996277387121607
452,-0.5373788131685463
453,-0.4096734580287416
454,0.5338445762905464
455,0.6421683937062748
456,-0.537383942079986
457,0.8648005740573946
458,-0.6330328649878516
459,0.29240197781359
460,0.3876975765447281
461,0.8919997129157533
462,-0.5028362056261371
463,0.8871305898766693
464,0.8919997129344021
465,-0.42685898978372494
466,-0.42687561909042787
467,0.8874768793893235
468,0.8695868736000182
469,-0.7765170566928982
470,0.40072578663332103
471,-0.5166620901631823
472,0.8602820878059753
473,0.4003840313486806
474,0.9817390781523
475,0.8696048756237855
476,-0.4268756154692741
477,0.9824575209487788
478,-0.8606495843175095
479,0.9996232113873609
480,0.869254887710622
481,-0.9824575559268659
482,0.8692407664597432
483,-0.8602820877867372
484,0.5338624343660529
485,-0.5028407150487811
486,-0.8602820868004429
487,-0.4007257866336069
488,0.2748597508977523
489,-0.7641997652781273
490,0.3146997585009456
491,-0.8477402091862173
492,0.4007132657109023
493,0.874475650659605
494,-0.9824755121488559
495,0.9996351200065269
496,0.5028362056070447
497,-0.5376788892670545
498,-0.8477402071872083
499,-0.4268589747115719
