,0
0,0.6858681751378481
1,-0.9966234406735368
2,0.9868169873174938
3,-0.6763072266998863
4,-0.6887845184290603
5,0.6858681754193086
6,-0.6763096496238421
7,-0.6887816954480978
8,0.6858707455299227
9,-0.6763072198483471
10,-0.6763096255154376
11,-0.6885375289990936
12,-0.9966259371977207
13,0.6729533886193589
14,0.6726958054500888
15,-0.6887841723329113
16,-0.6760401883467656
17,-0.6887841996307918
18,0.6726957546638808
19,0.9997394090693644
20,-0.6760642763774944
21,-0.9841551837850329
22,0.9997419968829863
23,0.6856143843458091
24,0.685611902881595
25,-0.9839112702749673
26,0.9999971720864865
27,0.9870760681974214
28,-0.9839112909706212
29,0.9999997429548348
30,-0.6885350941126351
31,0.9997393905322974
32,0.9870734361669664
33,-0.9963785990557682
34,0.6856119210359665
35,0.6856145159354403
36,-0.9839207924535542
37,0.6856119277891012
38,-0.9963807919466413
39,-0.6760642935614296
40,-0.983911286315498
41,0.6858716452958556
42,-0.6760618533243826
43,-0.9967643138895091
44,0.9870760683306847
45,-0.6760642980746365
46,-0.6887841914869538
47,-0.9839113051015901
48,-0.6887816707951776
49,-0.996623502227034
50,0.6856119448973377
51,-0.676307133156066
52,-0.9966258132533558
53,0.9868169684955883
54,-0.6887816953706234
55,-0.6887816883700192
56,0.9999971906683928
57,-0.9841563635671283
58,-0.9841576594032713
59,0.9999997971840758
60,-0.9839112701669418
61,0.9870760681739851
62,-0.9841572198371346
63,-0.9839112876601076
64,-0.9963878883005216
65,0.6856144913736961
66,-0.9963820981693339
67,-0.9839088124008998
68,-0.676052296673407
69,-0.6885351605175256
70,0.6729507901181462
71,-0.9966258846775782
72,0.9999971906713034
73,-0.9856868919369637
74,0.9997393549384056
75,-0.9966234576470511
76,-0.9966229894312679
77,-0.6763052219878748
78,-0.676309666723029
79,0.6858682618088396
80,0.6856119454567288
81,-0.6885356307721676
82,-0.6885376170989996
83,-0.9966234407510657
84,0.9999997971840745
85,-0.6763071783374918
86,-0.984157607973589
87,0.6856119029380829
88,-0.996623457929563
89,-0.9839112701986994
90,-0.9963783649813139
91,0.9997394090729274
92,-0.9963807562225465
93,0.9999997786400702
94,-0.6885351211176798
95,-0.6760642936089175
96,-0.6888936552830052
97,0.6856068523095356
98,-0.9966259017513969
99,-0.6763072195290237
100,-0.6760642794423457
101,-0.6760641429791617
102,0.685614473224478
103,-0.6763072531408069
104,0.6856125479506416
105,0.6726932076160467
106,0.6726957859648133
107,-0.6763098099477945
108,0.6726932496694666
109,-0.9839112701231592
110,0.9868195598931981
111,-0.9963807565292425
112,-0.6887841671828858
113,0.6729533661984225
114,0.9868195929902561
115,0.6856119273528162
116,0.685611902650492
117,-0.9839086347544918
118,0.999997154869802
119,0.9997419612038314
120,0.999739380895267
121,0.6856144668202735
122,0.9870733772735303
123,0.9868170217109161
124,0.9997393904782894
125,0.9870760682776336
126,-0.6763071962909432
127,0.9868174225316038
128,-0.6887841047447386
129,-0.6887841738739565
130,0.9999997615811375
131,0.6858674589740891
132,0.6726932077802732
133,0.6856144913708493
134,-0.9841561571416401
135,0.6729533647298017
136,-0.9963783647327881
137,0.6729533698004294
138,-0.9963808087896213
139,0.6858707634149092
140,0.9999971905886499
141,0.6729532941481426
142,0.9997393737473419
143,0.6726957870687372
144,0.6856119272177826
145,-0.984154821068511
146,0.6856145253749731
147,-0.9839113052818477
148,-0.6885351231163048
149,0.9997393572652573
150,0.9999997971008703
151,-0.6763071783308074
152,0.6726932688400752
153,0.9868169870954756
154,0.6726958108967617
155,-0.9826577465180831
156,0.6729533701971683
157,-0.9841551764370926
158,-0.9839087772695364
159,0.6729533462228513
160,0.9999971549864689
161,-0.6887891792937773
162,0.6726957889285544
163,-0.9963783484371834
164,0.6856172681294042
165,0.6858681934282865
166,0.9997419613068499
167,0.6856144906895989
168,0.9870734606840109
169,-0.9963783472103958
170,0.6856118197651708
171,-0.6884819811554708
172,-0.9839112528698232
173,-0.996625921321061
174,-0.6885376168928415
175,-0.996623440744266
176,-0.9839112525281408
177,0.6858672023516482
178,0.9870760492359881
179,0.6729599606098573
180,-0.6760618294639724
181,-0.6887841669845564
182,-0.996380773730889
183,-0.9966258850244786
184,-0.9966234932435027
185,0.9868195417375097
186,0.6726958293497631
187,0.999999778640094
188,0.6729507603427358
189,0.999997136565944
190,0.9997393548577215
191,-0.9839087947896792
192,-0.984155166513804
193,-0.6760618492536048
194,0.9997393734598202
195,0.685868193417242
196,0.6726932076295141
197,0.9999997615814349
198,-0.6887816874088039
199,0.9997419796278904
200,-0.676307202322903
201,-0.6885376589716568
202,-0.6885375949525638
203,-0.6763068061777421
204,0.9999997615811359
205,0.9870735181652882
206,0.9870734933729743
207,0.9868195950858885
208,0.672695562917033
209,0.9999971720864786
210,-0.9963783479032522
211,0.9868169866528208
212,0.9870758124554045
213,-0.6760618533224613
214,0.6856119457833777
215,-0.6885375912743125
216,0.672953346207711
217,-0.9841564896923297
218,-0.676061853402435
219,-0.6763096515816092
220,0.6858707446682514
221,0.9868170185189954
222,0.9870760868837691
223,-0.676061846424563
224,0.672962538051002
225,0.9870734777388099
226,0.9870760512555261
227,-0.6885351388066693
228,0.6856144888046676
229,-0.6760643006058134
230,0.6856119028321331
231,0.9870760320013191
232,0.672950778528094
233,-0.9966234634918565
234,-0.6760643009942737
235,0.6729507497289249
236,0.9997393549342017
237,-0.6760618548469108
238,-0.983911345166814
239,-0.6885375924642541
240,0.9870734777009657
241,-0.6760642763388356
242,-0.9839114043603158
243,0.68561190286489
244,0.999997172216649
245,0.6856144912958374
246,-0.6885375496612827
247,-0.9839087764241587
248,0.9868195767878382
249,0.6858707631687851
250,0.9868195598458038
251,-0.9839087770100525
252,0.6726931837681113
253,-0.996625047278878
254,-0.6763106127300748
255,-0.6760618533711615
256,0.9868169865878128
257,0.987075755667855
258,0.6726958108244102
259,0.9870734599361929
260,0.9870760512548055
261,-0.6760618532197535
262,0.9870760511036226
263,-0.9841551313686248
264,0.9870734595767967
265,-0.6885376169800199
266,-0.6885350969611872
267,-0.676309639955357
268,0.9997384767087958
269,-0.9839087945053012
270,-0.6885376178172793
271,0.6729533590551265
272,-0.6887816708493154
273,-0.9963783477129002
274,0.6856119454116455
275,0.6858681751579663
276,-0.6760642769466171
277,0.6729507615978162
278,-0.9841576584223627
279,-0.688784166724997
280,-0.9839112527109839
281,0.6729533462059547
282,0.9868195417164158
283,-0.6763072195613739
284,-0.6760643005088643
285,0.6729533461473263
286,-0.6763096427794251
287,-0.9839112531279324
288,-0.9839112877166563
289,-0.9966234753951622
290,-0.9839111168819186
291,0.9868195346916546
292,-0.9963405298435292
293,-0.6887841492440504
294,-0.6885376152681222
295,0.9999997785574912
296,0.987073512886165
297,0.685868175359586
298,-0.9839087770432364
299,0.6726932080342223
300,-0.9841576064997954
301,0.9868204890409303
302,0.6729509735684385
303,-0.9839112991490379
304,0.6856119272609253
305,-0.9839093407109344
306,0.6858681508361087
307,0.6726932076321708
308,0.9870734947209665
309,-0.688778567581545
310,-0.9966234406765366
311,0.9997420153821707
312,0.9870760682610081
313,-0.6760618313569045
314,0.9870735129850575
315,0.6858707828660291
316,-0.6763072199772758
317,0.9870735129539125
318,0.6726932076920333
319,0.6858707629164771
320,0.6856119292072055
321,0.9999997785603432
322,0.6729507670148621
323,0.9997394090558132
324,-0.688781293674682
325,0.6856097125547653
326,0.6856145389871316
327,0.9999971365567678
328,0.9870734980969018
329,-0.6760618450719281
330,-0.9966234579031245
331,-0.9841551313351391
332,-0.9839112716994266
333,-0.9963807918595603
334,-0.9966259017785164
335,-0.6763072036067286
336,-0.6760640560296431
337,0.6726932087530876
338,-0.9963783121313097
339,0.9997419612080873
340,-0.6887841494402402
341,-0.9839113051471359
342,0.9870760680309505
343,-0.6885351142080649
344,-0.6760634414683973
345,0.6856144912118252
346,-0.9966259371126529
347,-0.6887803003416609
348,0.9997419612057438
349,-0.9963783123788943
350,-0.9839088152247226
351,-0.9839112879530109
352,0.987073453624448
353,0.6858682822871321
354,0.6729507864969366
355,0.9870760511841157
356,0.685870776723509
357,0.685614497457117
358,0.6858707880604933
359,0.9868195950778452
360,-0.9966238607082759
361,0.9997419797209729
362,-0.9839088298449795
363,-0.6763096427326492
364,0.9997420150548688
365,0.6726958113296555
366,0.6858681996951023
367,-0.676309659299918
368,-0.983908794680361
369,0.9997419612866831
370,0.6726958110037543
371,-0.9839088300470843
372,0.9870760681925002
373,-0.6887816909431388
374,0.6729508389225503
375,0.6858708133992112
376,0.986819576910526
377,-0.9839112901472419
378,-0.9966234907629754
379,-0.6760618327921577
380,0.6858681815269773
381,-0.9841576221801317
382,-0.6760642972474141
383,0.6856239996969952
384,-0.9839113093339176
385,0.9870734947943614
386,-0.9841556637288436
387,0.6856144916265438
388,-0.6887841960307592
389,0.6729533625522284
390,0.6856119453431204
391,0.9870734946884983
392,0.6726955700330238
393,0.9868195768309779
394,-0.6917097767620045
395,0.9997393905327717
396,0.672953364416802
397,0.6858681058753585
398,0.6856119215407727
399,-0.6763072196282376
400,0.9999997971011709
401,0.6856145141212231
402,-0.6887817130354927
403,-0.9839113043270604
404,0.6858678655178256
405,0.9997419969057915
406,-0.9963783722386511
407,0.6858707879348417
408,0.9870734595792506
409,0.9870760863994213
410,-0.6760645850653698
411,0.6726932021549239
412,0.6858681998152466
413,0.9999997786400446
414,0.9868195598679466
415,0.6729523415366322
416,0.6726932077093968
417,0.6858681752771555
418,0.6858707950104505
419,0.6726958294102551
420,-0.9841576181328074
421,-0.9966259200872054
422,-0.6760616838273175
423,-0.6885351386360854
424,0.6729507430105578
425,0.6858707698951848
426,-0.984155150035197
427,-0.676064328895629
428,-0.6760642706674677
429,-0.6760618292286447
430,0.6729533461421295
431,-0.6760618533910857
432,0.6856119050026138
433,0.9870760651830998
434,0.6858681996588112
435,0.9997393548563818
436,0.6726931836850127
437,-0.9839111816056396
438,0.9870735128947582
439,0.9870734595527819
440,0.9870735292905356
441,-0.6760617831799186
442,0.6729507275999185
443,0.9870735127042293
444,-0.9966234912814149
445,0.6726957869096878
446,-0.9841576240611624
447,0.9999997615814361
448,0.6726958630783699
449,-0.9966234533030494
450,0.6858707698749285
451,-0.9841551357526034
452,0.6726932175600155
453,-0.996621956951155
454,0.9997419611440103
455,0.6726931837027122
456,-0.6763096494899512
457,-0.6887817043181861
458,-0.6885356810744079
459,-0.9963784055782653
460,-0.6887816953478542
461,-0.9841576593291163
462,-0.9841551312613875
463,0.672695829398182
464,-0.9839151103304057
465,-0.6885351217507651
466,0.685870788448227
467,-0.984157626123309
468,0.987076086317664
469,0.6729533646349427
470,-0.9963783295727423
471,0.9999971721690106
472,-0.6887841737058935
473,0.6729533646939192
474,-0.9839088298376268
475,-0.9839088703534185
476,-0.9966233515569201
477,-0.9841551487442038
478,0.685894251887768
479,-0.9841579502182125
480,0.9999997785569865
481,0.6856119454597387
482,0.6858707701359225
483,-0.9839113052332971
484,0.9999997971840757
485,-0.98415764028844
486,0.672950785482601
487,0.9999997971011715
488,0.9868170035741495
489,-0.6763072130659028
490,0.987076051261678
491,0.672695800266239
492,0.9868169684858341
493,-0.9966234867125127
494,0.6856119210400292
495,0.6729533646522177
496,0.6856119210435366
497,0.6856145157036134
498,-0.6885350965814899
499,0.9997419612027711
