,0
0,0.6432045528425048
1,-0.3696974647714178
2,-0.4516125950397556
3,-0.02919726679691665
4,0.38226198715226734
5,-0.15706721846261798
6,-0.26391295978522417
7,-0.8270857723522707
8,-0.25081528931938535
9,-0.5066070968047776
10,0.5970803608885175
11,0.18517679996990097
12,0.6778483868974976
13,0.9688653175476667
14,-0.4499669905621989
15,0.20949341002525493
16,0.5443832510525523
17,-0.04223021721039444
18,0.24614245795632148
19,0.3384256029592023
20,0.5847362636714662
21,0.5842067318120521
22,-0.20028808729146524
23,-0.16573856359620331
24,-0.7647602821991405
25,0.6963761877721495
26,-0.1905715113091259
27,-0.9004438949046114
28,0.7946873324227488
29,0.1942737126310802
30,0.013029201191864043
31,0.5850622768600213
32,-0.48192040504090666
33,0.07146329196551261
34,0.031823533278856696
35,-0.08668035862272389
36,0.8052884469474764
37,0.44613436345981244
38,0.0424760479726067
39,0.7034441300720156
40,0.508381191059556
41,-0.5085837765082334
42,0.15168388955219858
43,0.8242797994500374
44,-0.7002993182050251
45,0.570611400512555
46,-0.3436454304704847
47,0.2598732243159656
48,-0.7423835604701071
49,-0.032742723544968017
