,0
0,0.146289297052466
1,-0.04789701306341917
2,-0.018219924736881915
3,0.05027011696035063
4,0.05907421459152947
5,0.09085475835795714
6,0.024552133220299793
7,0.009817220847411037
8,-0.14010640511974254
9,0.06168820575609356
10,0.06638241976523396
11,-0.022165573899581507
12,-0.028029395513846415
13,0.9999947844763464
14,0.0422462962516639
15,-0.016292520190168202
16,-0.02783003125315212
17,-0.01317547779595349
18,-0.06483362000200554
19,0.015610786548651535
20,0.032895275690282416
21,-0.030680696478243268
22,-0.12268448254650839
23,0.06294960786330056
24,-0.11172332223443915
25,-0.0621051462060522
26,0.11116440082710602
27,-0.023324092113983386
28,-0.0794473334566945
29,0.012434390795189819
30,-0.03543999832875599
31,0.18665662792952448
32,-0.041380834113780136
33,0.0034028887822830467
34,-0.011630686229290036
35,-0.07303064184781012
36,-0.01737322244383562
37,-0.08710427543915134
38,-0.03512515109653268
39,0.016424169739127196
40,-0.02582507929107213
41,0.07090690985826237
42,-0.07569876835330906
43,-0.11795767654808463
44,-0.07284199790076569
45,0.04678473154246695
46,0.010471223769217814
47,0.04722937862695322
48,-0.05581728365183824
49,-0.00452289494128957
50,0.018767972092672818
51,0.18905334449867056
52,0.01213540411198841
53,0.018889465419851932
54,-0.02437338263029973
55,-0.13306846300149333
56,0.017655083370810523
57,-0.20107713350121859
58,-0.014234834406269044
59,-0.04795560158725141
60,0.014208222352311454
61,-0.09861505179400552
62,-0.045401997121503605
63,-0.1764629096209111
64,0.060528811646900216
65,-0.04251241833380264
66,-0.007725905742732365
67,-0.0458832048755322
68,-0.05062838397177845
69,-0.031072038425181123
70,0.004989563786513782
71,-0.01157964299411983
72,0.015125227458993288
73,-0.014511465430936244
74,-0.012656033874675949
75,-0.1531118048993168
76,-0.03178905035926829
77,0.08854176899935771
78,0.04981461349906636
79,0.06392776698159335
80,-0.09484462139847366
81,0.008230933433478433
82,-0.0286529686497241
83,-0.004769337811826933
84,0.0758844012290694
85,-0.0014885472039403037
86,0.0061453888053635795
87,0.02487449735655433
88,0.04700952926964146
89,0.004648956449455321
90,0.08274767491801627
91,0.023631549199652192
92,-0.034007647967689486
93,-0.05827605147680793
94,0.0037927426397643092
95,0.034984055707556035
96,-0.016927481813541603
97,-0.039950384863672944
98,-0.07744136935954973
99,0.03179013891902215
100,0.014397290624565826
101,-0.024993286961094298
102,-0.018570183587346526
103,0.04257726901648556
104,0.013320756594892586
105,0.1020256906833613
106,-0.06804029660590599
107,-0.06746228429317802
108,-0.012870133209152623
109,-0.03847067049958817
110,0.0338142298284687
111,0.02148457870623165
112,-0.07967848584001709
113,-0.0803091168666027
114,-0.07407778587758437
115,-0.08364348361202872
116,-0.004989243283879404
117,-0.07967425959552446
118,-0.05223598681788623
119,0.024794977266108513
120,0.07441860379243707
121,-0.012884663164717414
122,-0.02109552933266011
123,-0.11139658324960178
124,-0.0183167633521656
125,0.015361913928225033
126,0.0069338960367953135
127,-0.0030155261868007456
128,-0.019944299124342015
129,-0.014353123376858866
130,-0.0761192382406103
131,-0.049686242076322565
132,0.03376190844580167
133,0.025212570541096838
134,-0.06614193097511786
135,-0.03765675738051721
136,-0.04148049379612083
137,0.04036157320649159
138,0.016096553572044623
139,-0.008224500547019013
140,0.025158726291946928
141,0.008342738140194523
142,-0.233039613366448
143,0.00020609419195798356
144,-0.09383115965668472
145,-0.021869778268317822
146,0.08403704641027494
147,0.020829072306352402
148,-0.05672031589374323
149,0.035504064503307335
150,0.00438276917679216
151,-0.021098224941674855
152,-0.008869064038147974
153,-0.009969691782553698
154,0.06407828738322065
155,0.008731325185110415
156,-0.0654220635404581
157,-0.000902720876637224
158,-0.07554151766637959
159,-0.03355859523354686
160,0.09195444410745172
161,-0.01862153711788947
162,0.009975503051847396
163,0.07941330028342365
164,-0.037738668172282386
165,0.01905822322545874
166,0.030890538205953305
167,-0.027108536967609387
168,-0.11490448533637329
169,-0.2888493791498765
170,0.016937280964309537
171,0.0320481661944685
172,-0.0661943959436361
173,0.035069960460551615
174,0.0008403084946151995
175,0.05596140935370893
176,0.022070465447641602
177,0.05315289765225509
178,0.13611870555024355
179,0.06419895330734435
180,0.023436364443350264
181,-0.018352500959507936
182,-0.030017621318078173
183,0.03008296576963181
184,0.01958686077194332
185,-0.04199268787332216
186,0.042419195699300555
187,0.043142657263272724
188,0.02349342180028231
189,0.05562632017487466
190,-0.11236791279783905
191,-0.09348663409489748
192,0.009983787405062304
193,-0.030732601832227927
194,-0.05903020379204936
195,0.015517196679231189
196,-0.02923725037563901
197,-0.02382221122458656
198,-0.026310575064813792
199,-0.2593334665473145
200,0.06748706419591871
201,-0.019281953785518696
202,-0.059383599712188956
203,-0.02030198225406898
204,0.03862140517083203
205,0.06826416539548798
206,-0.031412842414159044
207,-0.07367731930420406
208,-0.058097023585433984
209,0.16525539239378167
210,-0.02534283939417986
211,-0.0007948602854109675
212,0.05969316204182476
213,-0.004747397170348727
214,-0.06751446604209776
215,-0.025960391733928473
216,-0.020326909305659502
217,-0.038186779656907935
218,-0.0799711170783431
219,0.1679172296393428
220,-0.050878775617846664
221,0.026015598731698023
222,-0.08328011522784041
223,-0.01983328511417336
224,0.06587072754882828
225,0.021012318907391605
226,-0.07245690447534288
227,-0.04906364500080365
228,-0.27810449776066254
229,-0.01703129252290069
230,-0.021845289545213822
231,0.11312346758483496
232,-0.10712189256280623
233,-0.027123662599120493
234,0.07308544653992533
235,0.2814857354044996
236,0.10787266497995661
237,-0.049583126123143625
238,-0.016778407345665873
239,0.015963524410812037
240,0.346059700385246
241,0.5882263119721186
242,0.027809437925078097
243,0.03438075273145277
244,0.0011256595636885275
245,0.012069048370791098
246,-0.0007187385151991618
247,-0.019782721974295404
248,-0.022288930991111164
249,0.04546270872866285
250,0.012546850008372327
251,-0.07242506384124153
252,0.3902202754553434
253,-0.005667614797268434
254,-0.044681510992143646
255,0.03379347684628971
256,-0.24709768564886575
257,0.06739515495975569
258,-0.027340987147655933
259,-0.019801522786326044
260,-0.0061580865303245405
261,-0.008847306926973818
262,-0.02793269967041963
263,-0.0330359672867729
264,-0.029129546478378593
265,0.03747849947222804
266,-0.027023746956654552
267,-0.041305665926577396
268,-0.02590365613609166
269,-0.12295992102684306
270,-0.23500375529607342
271,-0.061851063036664836
272,0.057470524522121154
273,0.04077166698240236
274,0.04560244935063652
275,0.025016682598549153
276,-0.0716773174794786
277,0.03701201807794503
278,0.07287079599392382
279,-0.027908162912106352
280,-0.02672483906441498
281,0.08468402368027407
282,-0.010789030987587397
283,0.01639368781832661
284,-0.00045283501403252775
285,-0.035736338492915576
286,-0.03584092983165809
287,0.04429358328253191
288,0.09639410240701726
289,0.3535966746864428
290,0.0024038458090412827
291,-0.015015772207150925
292,0.03931604901070892
293,0.028087117937566568
294,-0.00869956377820004
295,-0.07991111630086942
296,0.04783151987669736
297,-0.0193659003298212
298,-0.017857978193668377
299,-0.000465107304777097
300,0.000830557828069122
301,-0.029707822205109143
302,-0.003837421737452533
303,-0.09655400670853477
304,0.06481190892079469
305,-0.09507543700676369
306,-0.046135662219443464
307,0.025133012146241432
308,0.13019258867354397
309,0.06123447832751004
310,-0.04277887327197664
311,0.01903181928382685
312,0.005478551616347776
313,0.036915146649688105
314,0.03074773078027534
315,0.04504542345531537
316,0.03553177215794012
317,0.18582709033748718
318,0.08083968112621999
319,0.051408227448221794
320,-0.10358666851800569
321,0.2379747129921924
322,0.042454530627522476
323,0.10702724321375745
324,0.07649083652569615
325,-0.012867527665076227
326,0.006463425891599335
327,0.08780296601008332
328,-0.01778275436727135
329,-0.05081856394719581
330,-0.09718955973420419
331,-0.0005720986233061689
332,-0.020987051290890874
333,-0.004609359836768623
334,-0.006350691380437956
335,0.07829516592495953
336,0.10979908325577156
337,-0.004317108146919621
338,0.11913937213243606
339,-0.04840619883248141
340,-0.011621160596832804
341,-0.006130821919377653
342,-0.014620369706797493
343,0.07566293416447768
344,0.025190257901946147
345,-0.03749644840478869
346,-0.019007727975904273
347,0.11488744809858023
348,0.885262631922042
349,-0.013579476487983144
350,0.029953433553652056
351,0.1280127687802447
352,-0.24760086300308992
353,-0.036194308458307574
354,-0.02367530876353031
355,0.03776573196143064
356,-0.11687924544745773
357,0.3076373798447571
358,0.004708626059964442
359,-0.07529235508946948
360,0.02288510913169425
361,0.03362934489228991
362,0.07945468060755605
363,0.044922001051124226
364,0.08579749702154067
365,-0.03742199357728229
366,0.04975369271350646
367,-0.03407546299828142
368,0.019412239667038415
369,-0.007588195476139856
370,0.09139494326696813
371,0.04705672942790157
372,-0.04863990137389157
373,-0.01030857057872549
374,-0.05238475589177219
375,-0.027779704311217575
376,-0.0029141814316404942
377,-0.20869599430005756
378,0.12124763578114799
379,0.01983046198342017
380,-0.003872292466417762
381,0.0547632886748996
382,0.04281453603075578
383,0.3071062209022835
384,0.10082186148239679
385,-0.026300397075680288
386,-0.10614892585213641
387,0.036269413302400695
388,-0.0031790157282898307
389,-0.02604896882317834
390,-0.009444357264241912
391,-0.03909963575845332
392,0.030889770928941435
393,-0.04122704133470955
394,-0.01398810819909084
395,-0.02370166151257193
396,0.021950670164632997
397,-0.005389665535807937
398,-0.007326583787279615
399,-0.025787169028645727
400,-0.0620565087960653
401,-0.01890009434042485
402,-0.022040672028813116
403,0.1399902369445183
404,-0.292184926828034
405,0.0144694981967352
406,-0.0224196066363812
407,-0.0010935251594927622
408,-0.00399776272647438
409,-0.010950564110409924
410,0.10976624478696673
411,0.07770667896461705
412,0.04469141557443225
413,-0.021810889219611485
414,0.01315427222075722
415,-0.019376023560593016
416,-0.006419088729830445
417,-0.013804440478983118
418,0.020110999910304656
419,0.0190499166532518
420,-0.026121512847475895
421,-0.014402166616206746
422,-0.05204760931107338
423,0.024371153042019138
424,0.00398567961137182
425,0.04598924205398489
426,-0.03347637615312888
427,-0.059727670278236215
428,-0.028544869742215935
429,0.08387405571249086
430,0.023137100974939113
431,0.005947561119575433
432,-0.20645497297454343
433,0.02770400343596469
434,0.01924917406903698
435,0.013142484549095338
436,0.07926850853580464
437,-0.003439932224725905
438,-0.04326174576104207
439,0.1590239406481349
440,0.032518101839451564
441,0.024202316177431283
442,0.0506144164212849
443,0.037100303968691385
444,-0.024180831605999313
445,-0.16398130028954425
446,-0.14500988395436665
447,0.001595002495331745
448,0.07271432539621105
449,-0.00902814395747216
450,-0.01712043778701905
451,0.06672739662799812
452,0.04967150820445825
453,-0.19898804124830735
454,-0.22133513907725588
455,-0.00864619076590025
456,-0.041230427071778875
457,0.01271316256887491
458,0.03619197798465052
459,0.05526711963571676
460,0.04509285123738882
461,0.15300809797800738
462,-0.04277034669605943
463,0.006722038809146301
464,-0.14336573153798118
465,0.08251260454206663
466,0.007550677053980201
467,-0.0498874127373353
468,-0.08037232258356082
469,-0.018836355940714495
470,0.08754867347811036
471,0.050727661251066175
472,0.06807794803289387
473,-0.2324591131931567
474,0.08245813422112026
475,-0.04948185335662081
476,-0.06237039416800117
477,0.11544033611690367
478,-0.026540940949921578
479,0.022144148424867113
480,-0.043985073446237664
481,-0.044779924273639
482,-0.050676987051905695
483,0.0013301496440568407
484,0.05333507498995764
485,-0.04320914975907634
486,0.0790326457284714
487,0.05560824089607515
488,0.0010306885746953758
489,0.014851461797512193
490,-0.0460758605864581
491,0.029868604573475666
492,0.04015023589152887
493,-0.09240167348529285
494,0.01482911034842007
495,-0.09876909454992315
496,0.07342222585898926
497,-0.006267852729232021
498,-0.0014000932717115355
499,-0.061770679217147455
