,0
0,-0.8274117226194159
1,0.5682900757179582
2,0.35238361489772785
3,0.9994075004309955
4,-0.1717576733184267
5,0.7130378859872352
6,0.8274230067616126
7,-0.9999878762800777
8,0.9640547492968674
9,0.5682783718086513
10,0.2968748395628971
11,0.6324168305461992
12,0.3857541186158835
13,0.9699784356222394
14,0.5381101553130627
15,-0.4869678513823397
16,-0.147383845140648
17,-0.18458684399254105
18,-0.5382806477200062
19,-0.24125417441142935
20,0.24125417644159736
21,-0.8503934316055168
22,-0.33589447647195303
23,-0.637776697408054
24,0.4117421378397893
25,-0.17175766670451784
26,0.8829098739913739
27,-0.5440544158877463
28,-0.7057728389440096
29,0.5675223534564551
30,0.5439045362587699
31,-0.23646353307771928
32,-0.5682900757179585
33,0.3886800760849219
34,0.4350899308809449
35,0.5524457421632769
36,0.17160776771110106
37,-0.8629549724074048
38,0.5466636287708376
39,-0.35520381966719455
40,-0.2915155635867512
41,-0.7441142890535499
42,0.5524776369882217
43,-0.3559961897505248
44,0.5811194151651911
45,-0.5976698289753986
46,-0.9638829235688038
47,0.5975202246282814
48,-0.17979558249482575
49,0.5675106227558151
50,0.3523723858776082
51,-0.9699162955800653
52,0.485104066445214
53,-0.1417363539183484
54,-0.9940526558595985
55,-0.24125474612560294
56,0.8773655320336915
57,-0.6895738140158763
58,0.7183986752266439
59,0.48638736831142665
60,-0.9700925401267805
61,0.1775314606503821
62,-0.538280480459401
63,-0.9777396930366
64,0.7189080853174019
65,-0.5381190245793144
66,-0.5382806350601206
67,-0.2920948353102989
68,-0.9707774352069634
69,-0.6934080177686743
70,-0.9998498981305329
71,0.5473812206578582
72,0.18458623038765484
73,0.5976698290301884
74,-0.3713427140208837
75,-0.14159833870844765
76,0.9699783155005253
77,0.6034554953651582
78,0.14159817906645242
79,-0.17753145414605254
80,0.1851767540554373
81,-0.5473897970998103
82,-0.5675222189514492
83,-0.4308797944970615
84,0.5474585820616851
85,-0.8721119685907059
86,0.6232896962271431
87,0.5422300386973969
88,-0.24067429183516942
89,0.5739141121528868
90,-0.3481616204111243
91,-0.528118830888902
92,0.7447048392347948
93,-0.9724509049558442
94,-0.46076189244326393
95,-0.999850052786048
96,-0.5453638577866279
97,0.5439164021956888
98,0.5975319634296125
99,0.9999991835918294
100,0.8776676139166523
101,0.17754303645739564
102,0.5992790295590578
103,0.5739259908951271
104,-0.5681404997037454
105,0.4708373389349993
106,0.6033057510219194
107,0.8877105744292265
108,0.14738385038790328
109,-0.9698402607155543
110,0.37711312216436726
111,-0.1773815617117548
112,-0.9722584416934097
113,-0.9998382931020093
114,0.5381191858487383
115,-0.4356804700601048
116,0.18517736112222788
117,-0.5439046974734044
118,0.9994081905000222
119,-0.5382804804594009
120,-0.1417363590193277
121,0.9698286912843319
122,-0.24066365074364718
123,-0.9692959639771221
124,0.8769690805446487
125,-0.88349979062605
126,-0.14159833214932802
127,-0.5769192702507544
128,0.9641929307078827
129,0.5425879140296318
130,0.5763281600686744
131,-0.597520218069162
132,-0.9708292701651126
133,0.9999996359694421
134,-0.693418051827448
135,-0.5681286007342004
136,-0.5676719431388535
137,0.9950490016086017
138,0.6033173204535532
139,-0.5100681143568184
140,0.9641929584765845
141,0.943331203965438
142,-0.6886279078214145
143,0.2571123422676307
144,-0.5733078649299315
145,0.876962471407227
146,0.4776692933938446
147,-0.31505486916069025
148,0.6032721786782378
149,0.8322029775453521
150,0.6928387762636702
151,-0.4100068787741771
152,-0.5379325755544999
153,0.5975202458467938
154,-0.44832646787977676
155,0.598665315068058
156,0.7489055640833855
157,0.1717457651227048
158,0.8776275307864467
159,-0.7319790187346615
160,0.6028873368554016
161,-0.5676719567355685
162,-0.1715962048937878
163,0.8316224813768666
164,-0.14159817901166283
165,-0.6329860786103232
166,-0.5596258846103899
167,-0.9942142434940524
168,-0.35053326923098277
169,0.632986072051204
170,0.9698286978434516
171,0.6033057361017578
172,-0.47725881095008943
173,-0.7237560760959151
174,0.9944512393548505
175,0.5734459055425101
176,-0.9998498625880204
177,0.5740640177602127
178,0.5434649749134101
179,0.5811193879166826
180,0.5975202458467934
181,0.9698404565138589
182,-0.5675222189514492
183,0.8769753840493738
184,0.9999880730969279
185,0.42245961923536907
186,0.9640430317692553
187,-0.22732953202800035
188,0.9942023713109313
189,0.705990757925752
190,-0.8629043478014403
191,-0.994214278945501
192,0.6231808316244413
193,-0.25897530789533335
194,0.6371968148317941
195,0.5733078583160225
196,0.5367927851692956
197,0.5440661400292668
198,0.882363187482484
199,0.5976817143319711
200,0.7191529384218871
201,-0.4917477822253867
202,0.5739258427987373
203,0.43087977915660053
204,0.8882804229673581
205,0.36450417306270394
206,0.5468093074697777
207,0.45825358319596476
208,-0.17160793503542607
209,0.6034670498160978
210,-0.5740755806323155
211,0.7144929897010448
212,-0.9994086664621423
213,0.9940528170194436
214,0.6886274103231784
215,0.7118836676483115
216,0.5307058363128573
217,0.5734459055972995
218,-0.9433312441096459
219,0.3852084569244276
220,-0.1851773545294237
221,0.538268775481673
222,0.5676602327032094
223,0.9999997549675286
224,0.2406642597859182
225,-0.9391316998917353
226,0.7494954741799448
227,0.5381308841630935
228,-0.3481622340033713
229,-0.8568426118306459
230,-0.5060234173183547
231,-0.6084217741470359
232,0.40579336563266083
233,0.5740757557264405
234,0.9942023713109309
235,0.8829205465172034
236,-0.3820551180295399
237,0.5811300355673241
238,-0.8274117291785357
239,0.4337368068416938
240,0.6026263016934142
241,-0.6050557669621247
242,-0.5439044445633162
243,-0.8274123296525224
244,-0.5439164022504785
245,-0.33887488329374116
246,0.7194864914452133
247,0.14737197170002936
248,0.35237237333221844
249,-0.7128108712586627
250,0.54391624754018
251,0.14174807800507958
252,0.597520084686949
253,0.9439111201474314
254,0.3645376090187806
255,0.5484179129029503
256,-0.4869566098164311
257,-0.7181129465388578
258,-0.40225190968692665
259,-0.8834998220809819
260,-0.5381190311932235
261,-0.9998381740433844
262,-0.8647408233100726
263,-0.9647417506518379
264,0.3933534720522742
265,0.5475842256806811
266,-0.6034670498160976
267,0.6371968309585677
268,0.5439045168943294
269,-0.5425985551215331
270,0.2915149527340388
271,-0.5425879074705122
272,0.28984435149828075
273,0.48638736831142654
274,-0.6242739007457513
275,-0.24067490743693898
276,-0.6880368866343719
277,-0.9642046891776421
278,0.999987876225288
279,-0.17738156141309877
280,-0.34817224910717154
281,-0.7048594207536205
282,-0.5440661465335965
283,-0.8696284204817388
284,-0.7092390263566097
285,-0.6329966971658662
286,0.9698404565138594
287,0.35887235393539535
288,0.5465973228137269
289,0.5681405062628654
290,-0.9642044936347752
291,0.9946185900208259
292,-0.4917578749047191
293,-0.5811294219750989
294,0.43508994637129833
295,-0.9699784356770298
296,0.5968839125996848
297,-0.6034670433117679
298,-0.3990457896462051
299,-0.544054261232237
300,-0.5976699902448224
301,-0.5682902505513148
302,-0.6053333448924054
303,0.5682783653043216
304,-0.48696723357100924
305,-0.8316225109848284
306,0.8825055560993629
307,-0.45153889627426375
308,0.5681287619488284
309,0.8778997490007618
310,-0.5732960065985456
311,0.22565397759091035
312,-0.7167435424078089
313,0.8818680902500289
314,-0.34817287509527245
315,-0.9439117271805586
316,0.9942025614174723
317,-0.5382689236328578
318,0.4740966315515104
319,0.35238361489772735
320,-0.9942142789455014
321,-0.4168023988794082
322,-0.9769503787997382
323,0.9994192719720716
324,0.2196937444082563
325,-0.544054441871433
326,0.34758234484734646
327,0.14753358947855588
328,-0.5382804804046112
329,-0.23645288542707762
330,0.6239111340328674
331,-0.744705446267922
332,-0.57345745455754
333,-0.5112169195142275
334,-0.8894573310365844
335,-0.3594753378686732
336,0.2963062011008546
337,-0.6371962239254403
338,-0.17175751210379828
339,-0.3481622340033712
340,-0.34816161457476846
341,-0.6057085521309282
342,0.8825055275193899
343,0.3826189815838995
344,0.5382806477200066
345,0.5425985485624136
346,-0.5382806477200065
347,0.48637733425265284
348,0.6033172989738601
349,-0.5734576296844482
350,0.14159818410772243
351,-0.9951984725970858
352,0.5676719365797342
353,-0.18458623040029404
354,-0.5732959796285718
355,-0.702361024394278
356,-0.17979619608705114
357,-0.2968860876879257
358,0.1773815679722182
359,0.24125417441142918
360,-0.6377867249073511
361,0.994214243494052
362,0.49175847537870565
363,0.969840421984972
364,-0.18459687147917733
365,-0.6324162300721916
366,-0.14737197164523985
367,-0.5682902505513147
368,-0.29363869977940765
369,-0.9391310928586291
370,-0.39452574779670513
371,-0.5739258428535268
372,-0.9652713846147993
373,-0.4356810705341125
374,0.14158644836581233
375,0.06602270446123806
376,0.5398814882494926
377,-0.5196831087074112
378,0.14738383858152893
379,0.9641927695480437
380,0.8877105744292262
381,-0.24124413379389364
382,-0.7183223940374125
383,-0.6377872536835785
384,0.637787361206494
385,-0.18458623038765498
386,0.5681287755618074
387,0.4207046804626144
388,-0.7494954540550416
389,0.6886279993984453
390,-0.9752756306561795
391,-0.9952091202477271
392,0.7153264817795956
393,-0.9652908194586746
394,-0.7489155981421592
395,0.5664794633637644
396,0.994629237671467
397,0.5980860329657849
398,0.6034671325874933
399,0.35296349747398764
400,0.5675104948643002
401,0.8824993618739795
402,-0.7494853306509928
403,0.5732959999846365
404,0.6018272479927687
405,-0.8836777162590784
406,-0.6034554804396651
407,0.8268425171315796
408,0.43089036888197735
409,-0.5381307552255826
410,0.14158645340666473
411,0.24125417441142938
412,-0.2412541830007165
413,-0.4911779857693399
414,0.4356704360013313
415,-0.6033174535745796
416,-0.5739141326405381
417,-0.969741122042495
418,0.34758168400441525
419,-0.6141453956419148
420,-0.6047956242789485
421,0.7188266358384843
422,0.36191212699107306
423,0.5986759496004612
424,-0.14159833214932777
425,-0.49194303732140393
426,-0.6886273102745498
427,-0.8791970688806535
428,0.9994074908367723
429,0.17174578801706725
430,0.3087768861091705
431,0.9641929584765845
432,-0.9940528170194434
433,-0.4090979602067541
434,0.14159832716284235
435,0.9698284142703135
436,-0.6034672194523071
437,-0.7083391658677328
438,0.5976698289753987
439,0.3613377427348304
440,-0.42362171019215344
441,-0.9728683593603714
442,-0.9439223748315799
443,0.42888000758675415
444,-0.7441255636710168
445,0.6033057510219194
446,-0.5381190054208531
447,0.32687670759617127
448,-0.5739142734223053
449,-0.9940526204686938
450,0.9999997550223182
451,-0.3843627110111851
452,-0.9700600130093946
453,0.9944853793383299
454,0.5497190000494232
455,-0.9994192719720713
456,0.9698404219849722
457,0.573307864929931
458,-0.18517736112222807
459,-0.43030994595892996
460,-0.568140255826044
461,0.29688608768792574
462,-0.35296290956641435
463,-0.5440659918780876
464,0.9640430252101364
465,-0.9391210922354092
466,-0.1415983337219616
467,0.56829008939147
468,-0.4303099306387572
469,-0.39019674928441456
470,-0.605676272319206
471,0.8767698419711091
472,0.8817560234075756
473,0.5734574546123299
474,-0.18517736112222788
475,-0.1773934467696713
476,-0.568128620906293
477,-0.5682902506061044
478,-0.5260313323073682
479,-0.6056562681470988
480,-0.9697444709922207
481,-0.4912403832836503
482,0.9944455700696863
483,0.712584543430266
484,-0.8732825158822347
485,-0.6880368866343719
486,0.5466450328371556
487,0.1417480714459603
488,0.41019405170931905
489,0.9999996424737722
490,-0.8829092918330554
491,0.9999997549675282
492,-0.2358736248407684
493,0.8834897880222079
494,0.9999997550223176
495,-0.661285946949912
496,0.715585672044787
497,0.9942025548035627
498,-0.4917578683455994
499,0.603467197967277
