,0
0,0.2885768534526554
1,-0.26191896151521166
2,-0.5309956203062617
3,0.175289463715922
4,-0.31639749970527115
5,0.30190832356532765
6,0.11294616595635013
7,-0.21811252436016026
8,0.39689102278778554
9,0.1679737572862188
10,0.11524624614410182
11,0.0790038303163165
12,-0.29856487945329435
13,-0.2543647110102173
14,-0.6746693734126599
15,-0.2920070586278787
16,0.5140344371622166
17,-0.3255478746084623
18,-0.6810602304684308
19,0.2287517406627657
20,0.39485456715862083
21,-0.006868639553639547
22,0.3691867156681042
23,0.01596125065680854
24,-0.09631330100973123
25,0.12054856953418319
26,0.7841524310679314
27,0.08722213101841524
28,0.11440727820767056
29,0.9610882994742355
30,0.0826064028598706
31,0.19564147601804346
32,-0.02682534363276501
33,-0.1870984664720495
34,-0.06543858360809732
35,0.026655855801923336
36,0.24810169080568267
37,-0.09796752169084337
38,-0.16960122322573534
39,0.3795725956663163
40,0.13115360315603547
41,0.41384777875580003
42,0.46233104931832397
43,-0.13496426173022785
44,0.09152350496507856
45,0.40967112386259946
46,-0.32028854940867457
47,0.10629918035918196
48,-0.2240671980566053
49,-0.2670809790277432
50,-0.07740451767001555
51,0.18420644406504857
52,-0.29790729715229997
53,-0.5508485414253259
54,-0.2152894964198695
55,-0.2354433375882404
56,0.8197708989789131
57,0.03905312972790601
58,0.0030663373891630192
59,0.9999985969059674
60,0.11161719085158711
61,0.08419286850584623
62,-0.06849047000285832
63,0.1311000420108832
64,-0.1301861133679067
65,0.014649310207939893
66,-0.1687005643632145
67,0.16402624555090334
68,0.3764459785679009
69,0.05322761233897861
70,-0.3863016664193339
71,-0.2891300387908945
72,0.8203583857552342
73,-0.04463619990853381
74,0.1963152678439008
75,-0.27219130924200596
76,-0.23808721186755163
77,0.20962826468216486
78,0.10136570451323808
79,0.31456696188008787
80,-0.07729366150920942
81,0.05963180737418266
82,-0.025718430459729668
83,-0.27049992076027296
84,0.999977104302952
85,0.1858452027041601
86,-0.05370524208800847
87,-0.09249513793126578
88,-0.26858706750854344
89,0.11196248333091738
90,-0.1324816590051041
91,0.22983851096700805
92,-0.08869574347832256
93,0.9646523105728609
94,0.08597928864149441
95,0.37940353854062886
96,-0.26301019217606664
97,-0.04576497537852066
98,-0.2984605163429132
99,0.16478333946096266
100,0.4005407170552877
101,0.38180687769035204
102,0.0065338058385136085
103,0.12248654339786896
104,-0.0605172362962097
105,-0.8083015249174718
106,-0.6967328928279087
107,0.13218582738530776
108,-0.7847895156066713
109,0.10696765470547005
110,-0.39885722670524804
111,-0.15830830287674946
112,-0.3081867613175569
113,-0.2696934129190835
114,-0.4226144778261435
115,-0.10380925952882711
116,-0.08187995847412914
117,0.16359758050783582
118,0.8174470867933945
119,0.36750429753749175
120,0.2229672890628048
121,0.002918680901887045
122,-0.02120650560759269
123,-0.5303684877644739
124,0.19547958496967033
125,0.08200465843132332
126,0.16803996918635963
127,-0.5486024127429248
128,-0.2566721152644477
129,-0.3104052291301638
130,0.9996298482327604
131,0.3230862213379023
132,-0.8058528010528067
133,0.028122993363974
134,-0.017783016060834916
135,-0.24953793153039094
136,-0.13196595884744208
137,-0.2602921371321643
138,-0.14893710974633137
139,0.4158130810919221
140,0.816826742579743
141,-0.3605268830052495
142,0.22434056844886646
143,-0.6948268953084364
144,-0.08876197160486837
145,0.015309294061324927
146,0.02641725739614762
147,0.09394635725822918
148,0.05803124685487274
149,0.19226344859229494
150,0.9955992482706769
151,0.18452873880390447
152,-0.8079261584913064
153,-0.5334500149000061
154,-0.7008132912041624
155,0.0038226657883447352
156,-0.2698630362265386
157,-0.032683287641654894
158,0.16668445078305943
159,-0.26986199854846454
160,0.8170321426463294
161,-0.3528556192735181
162,-0.6927654498570848
163,-0.10046563515246232
164,-0.07820154069842629
165,0.32083375676510634
166,0.36920687616656506
167,0.016510298249024485
168,-0.06922066077387161
169,-0.1237199040664861
170,-0.08071441805311877
171,-0.009853384921473163
172,0.12258359202974937
173,-0.2957685778749043
174,-0.03010639354685706
175,-0.2517667356226376
176,0.12062040919575302
177,0.3414507224517085
178,0.07806244717205986
179,-0.2615227079861391
180,0.46698422556940156
181,-0.32189148245475413
182,-0.17201782205246763
183,-0.30051514285699565
184,-0.27594768087514243
185,-0.4328123069946837
186,-0.6831042636853031
187,0.9647067019812492
188,-0.36470546295438244
189,0.7875984670095239
190,0.18601458379913346
191,0.16098075709412035
192,0.022030530451771668
193,0.46060453837738896
194,0.22887425668416822
195,0.3123346793439151
196,-0.8079022816540389
197,0.9999759416362087
198,-0.23310131789532879
199,0.39440719290919674
200,0.1804508552900495
201,0.009324022902508711
202,0.0007460836827486732
203,0.18954818481650887
204,0.9996297546661213
205,-0.0392728883614005
206,-0.045321120888211094
207,-0.40714257594065145
208,-0.6880193134485795
209,0.7839780816690252
210,-0.1292064476083562
211,-0.5334129173197623
212,0.06468839157645725
213,0.46173745469941657
214,-0.06391616853079801
215,-0.046559232604400806
216,-0.27340747638765744
217,-0.09573278668522907
218,0.4614057111186383
219,0.06023271918567286
220,0.3897512128096661
221,-0.5213646584647053
222,0.10675666978368126
223,0.45088350050641635
224,-0.3726809250737465
225,-0.025664759704235426
226,0.10563036293120462
227,0.06961114626698568
228,0.02684672881710446
229,0.391282417592269
230,-0.09097178019263104
231,0.08200496048253973
232,-0.3643346824017482
233,-0.2793792643642007
234,0.3805817602118623
235,-0.4008924150725651
236,0.19473846836753086
237,0.433461590435064
238,0.12604924377992416
239,-0.023655647869106098
240,-0.022796806459982326
241,0.39371557207506913
242,0.12349489014967598
243,-0.09126682370999938
244,0.7875765297315955
245,0.017957511307856514
246,-0.016974458897019495
247,0.17292216820459352
248,-0.41960683283442307
249,0.4093375291324061
250,-0.4068123734908223
251,0.1433362404904472
252,-0.8069124340174293
253,-0.2952420359260786
254,0.05255777676366077
255,0.4627266454388417
256,-0.5327558868641777
257,0.09102301232532484
258,-0.6952158418337632
259,-0.034094359474371554
260,0.10588342047854207
261,0.46493201011362073
262,0.1079268952227974
263,-0.00652962778711889
264,-0.04638143373494579
265,-0.023320503088602576
266,0.077086955798099
267,0.11459403325336347
268,0.22343595986464337
269,0.14420194108183654
270,-0.01794311151346074
271,-0.17573852504449727
272,-0.21728272771681206
273,-0.13569330566422724
274,-0.060637280011311315
275,0.30031027610278677
276,0.3969278765961734
277,-0.34596905902856584
278,-0.05712737888918327
279,-0.32540519956104885
280,0.11304790073792727
281,-0.2697434123624151
282,-0.42541567258647384
283,0.1775411974844025
284,0.39815868591810855
285,-0.27273433266615726
286,0.09249711156116058
287,0.10654976495062198
288,0.12686425806763277
289,-0.2758747004934657
290,0.1378874120321279
291,-0.40954849416586214
292,-0.19745280564875153
293,-0.29676924986871095
294,-0.08613341509437113
295,0.9609878296590095
296,-0.028426100063084752
297,0.3052548567623138
298,0.18183201385621073
299,-0.8039775974924236
300,-0.0517192308782106
301,-0.41588580006814646
302,-0.3682526613453054
303,0.11869554357500263
304,-0.08935604941333072
305,0.1445095903000526
306,0.2862624936161644
307,-0.8083856912967418
308,-0.04902405965882177
309,-0.2207622459189723
310,-0.24643528797131423
311,0.40076230700202736
312,0.08777214379830017
313,0.4510314258045442
314,-0.02667389608875902
315,0.4118985640583821
316,0.16617585233158796
317,-0.025038529326970777
318,-0.8054961267821765
319,0.4089083546200116
320,-0.05139723965863478
321,0.9616632266452351
322,-0.39031029234049014
323,0.22516189320430569
324,-0.18939530672709518
325,-0.12269090129790317
326,0.007354103630537079
327,0.7875835103307784
328,-0.045711745940808145
329,0.4627502150124343
330,-0.2821808789176707
331,-0.006448388591434342
332,0.1105183160831658
333,-0.1628485153061481
334,-0.29142665099464415
335,0.14798320279045213
336,0.38984342883238005
337,-0.8077742974957899
338,-0.13963551512563754
339,0.3674402801950527
340,-0.30285254849265325
341,0.10919870649735955
342,0.08231704757629506
343,0.06690170435467492
344,0.43062390902153036
345,0.009838680249420797
346,-0.30011440111878274
347,-0.1516207384936633
348,0.365723734147776
349,-0.14007804422822212
350,0.09626958102202499
351,0.10889954247093284
352,-0.04223646313966795
353,0.3160443742453002
354,-0.359191678735297
355,0.1032418397807185
356,0.3958520266462723
357,0.012024610744608871
358,0.4108668745435755
359,-0.40544597800192944
360,-0.26297178072667693
361,0.39780367987209386
362,0.15500803791591442
363,0.10636585199452007
364,0.3984706657233582
365,-0.6902872842207107
366,0.3042494919367414
367,0.0749882488325076
368,0.15719031413324344
369,0.36974531470985067
370,-0.6972334620066032
371,0.15612652990034465
372,0.08228951985845756
373,-0.24557682260533675
374,-0.4053633095333786
375,0.38307008346756183
376,-0.42818954383545454
377,0.12589481158406768
378,-0.27297081905829484
379,0.4823601800474544
380,0.3093847554759377
381,-0.034487515024279956
382,0.3943950773772574
383,0.03380850748038539
384,0.1310236975177382
385,-0.04001002501948592
386,-0.005070729376890293
387,0.007928608136738164
388,-0.3458682973873299
389,-0.2598127289293172
390,-0.07679894572535476
391,-0.04303402879544204
392,-0.6783545956138411
393,-0.42892140988986216
394,-0.174184393222209
395,0.19805763190822662
396,-0.25204622540025934
397,0.32954563061460235
398,-0.0765674095151257
399,0.18290381242396794
400,0.9959487699037214
401,0.03746307514008818
402,-0.24865201475317428
403,0.10746553871863168
404,0.33974483258688126
405,0.36957514180048606
406,-0.17099096669374006
407,0.4063979693603268
408,-0.04120845990340138
409,0.1072268233151878
410,0.4431412947874598
411,-0.7841355958502392
412,0.29865285062264146
413,0.9647392556093584
414,-0.404892244468889
415,-0.24739702334568234
416,-0.8057013502483198
417,0.29593954152377155
418,0.40072430124498076
419,-0.6648174784008095
420,-0.072148125899801
421,-0.30425580622430104
422,0.4630958561771598
423,0.08053859171119608
424,-0.3717397286166467
425,0.3900416456036624
426,-0.0016868056687818884
427,0.36308426574674235
428,0.3661367616743467
429,0.4635050733118311
430,-0.27060879874874505
431,0.45476284984237625
432,-0.13327186243516811
433,0.09753568632110957
434,0.3125433210454197
435,0.19243188040135495
436,-0.8080822427601018
437,0.12793455055478728
438,-0.025985946601446614
439,-0.04478698237945912
440,-0.05515840602225669
441,0.48263802966098607
442,-0.3513551042881247
443,-0.024382936170030043
444,-0.2712401325540666
445,-0.6991748256612464
446,-0.04962491307192474
447,0.9999997599943822
448,-0.6927355807702961
449,-0.24568195383894068
450,0.3897232168489321
451,-0.01440123132597389
452,-0.7831081901390546
453,-0.2771623641771147
454,0.36674221540727525
455,-0.8049767281735585
456,0.11846759808453201
457,-0.2266445480004483
458,0.0708323641912932
459,-0.10356205309837571
460,-0.20877592577150522
461,0.018109551385266938
462,-0.0012166447309036716
463,-0.6725069392265743
464,0.12394547706587516
465,0.06801093396405984
466,0.4072027035662848
467,-0.07138314602859694
468,0.09795497860108729
469,-0.25225646707960614
470,-0.13804729966663828
471,0.7870278121478866
472,-0.3134867883628516
473,-0.26044092966271826
474,0.15417435636007046
475,0.16414701737972764
476,-0.2633482655789734
477,0.038874752896199266
478,0.3925745210301451
479,-0.057230392963415484
480,0.9605787167730764
481,-0.0639616914953889
482,0.38699677773232166
483,0.11281256809210356
484,0.9999758889284515
485,-0.08726806736519617
486,-0.36724759162659193
487,0.9959362897235918
488,-0.5527404289010558
489,0.17918586038426876
490,0.10466457065430765
491,-0.6893203397478123
492,-0.5483815179622832
493,-0.252898466519836
494,-0.07454269849732952
495,-0.25187096808064824
496,-0.07710089720214193
497,0.028263805746056154
498,0.08549225214178392
499,0.3663726717285025
