{
    "User": {
        "title": "User",
        "required": [
            "id",
            "name",
            "email"
        ],
        "properties": {
            "id": {
                "type": "integer",
                "format": "int64",
                "example": 1
            },
            "name": {
                "type": "string",
                "example": "John Doe"
            },
            "email": {
                "type": "string",
                "format": "email",
                "example": "john@example.com"
            },
            "created_at": {
                "type": "string",
                "format": "date-time"
            },
            "updated_at": {
                "type": "string",
                "format": "date-time"
            }
        },
        "type": "object"
    }
}
