\relax 
\providecommand\hyper@newdestlabel[2]{}
\catcode `:\active 
\catcode `;\active 
\catcode `!\active 
\catcode `?\active 
\providecommand\HyperFirstAtBeginDocument{\AtBeginDocument}
\HyperFirstAtBeginDocument{\ifx\hyper@anchor\@undefined
\global\let\oldcontentsline\contentsline
\gdef\contentsline#1#2#3#4{\oldcontentsline{#1}{#2}{#3}}
\global\let\oldnewlabel\newlabel
\gdef\newlabel#1#2{\newlabelxx{#1}#2}
\gdef\newlabelxx#1#2#3#4#5#6{\oldnewlabel{#1}{{#2}{#3}}}
\AtEndDocument{\ifx\hyper@anchor\@undefined
\let\contentsline\oldcontentsline
\let\newlabel\oldnewlabel
\fi}
\fi}
\global\let\hyper@last\relax 
\gdef\HyperFirstAtBeginDocument#1{#1}
\providecommand\HyField@AuxAddToFields[1]{}
\providecommand\HyField@AuxAddToCoFields[2]{}
\babel@aux{french}{}
\@writefile{toc}{\contentsline {section}{\numberline {1}Remerciements}{2}{section.1}}
\@writefile{toc}{\contentsline {section}{\numberline {2}Abstract}{2}{section.2}}
\@writefile{toc}{\contentsline {section}{\numberline {3}Objectif du projet}{3}{section.3}}
\@writefile{toc}{\contentsline {section}{\numberline {4}Introduction}{3}{section.4}}
\@writefile{toc}{\contentsline {section}{\numberline {5}Outils mis en place}{4}{section.5}}
\@writefile{toc}{\contentsline {subsection}{\numberline {5.1}R\IeC {\'e}seaux de neurones}{4}{subsection.5.1}}
\@writefile{toc}{\contentsline {subsubsection}{\numberline {5.1.1}Perceptron Multi Couches}{4}{subsubsection.5.1.1}}
\@writefile{toc}{\contentsline {subsubsection}{\numberline {5.1.2}R\IeC {\'e}seaux convolutifs}{4}{subsubsection.5.1.2}}
\@writefile{toc}{\contentsline {subsubsection}{\numberline {5.1.3}R\IeC {\'e}seaux r\IeC {\'e}currents}{4}{subsubsection.5.1.3}}
\@writefile{toc}{\contentsline {subsection}{\numberline {5.2}Traitement des Images}{4}{subsection.5.2}}
\@writefile{toc}{\contentsline {subsubsection}{\numberline {5.2.1}Isolation des l\IeC {\`e}vres}{4}{subsubsection.5.2.1}}
\@writefile{toc}{\contentsline {subsubsection}{\numberline {5.2.2}Auto-Encodeur}{4}{subsubsection.5.2.2}}
\@writefile{toc}{\contentsline {subsection}{\numberline {5.3}Traitement du Langage}{4}{subsection.5.3}}
\@writefile{toc}{\contentsline {subsubsection}{\numberline {5.3.1}Word Embedding}{4}{subsubsection.5.3.1}}
\@writefile{toc}{\contentsline {subsubsection}{\numberline {5.3.2}Seq-2-Seq}{4}{subsubsection.5.3.2}}
\@writefile{toc}{\contentsline {section}{\numberline {6}D\IeC {\'e}veloppement du projet}{4}{section.6}}
\@writefile{toc}{\contentsline {subsection}{\numberline {6.1}Pr\IeC {\'e}-traitement des Donn\IeC {\'e}es}{4}{subsection.6.1}}
\@writefile{toc}{\contentsline {subsubsection}{\numberline {6.1.1}Choix des ensembles de Donn\IeC {\'e}es}{4}{subsubsection.6.1.1}}
\@writefile{toc}{\contentsline {subsubsection}{\numberline {6.1.2}\IeC {\'E}tude}{4}{subsubsection.6.1.2}}
\@writefile{toc}{\contentsline {paragraph}{Etape 1 :}{4}{section*.2}}
\@writefile{lof}{\contentsline {figure}{\numberline {1}{\ignorespaces Exemple de ficher de sous-titre}}{5}{figure.1}}
\@writefile{toc}{\contentsline {paragraph}{Etape 2 :}{5}{section*.3}}
\@writefile{toc}{\contentsline {paragraph}{Etape 3 :}{5}{section*.4}}
\@writefile{toc}{\contentsline {paragraph}{Etape 4 :}{5}{section*.5}}
\@writefile{toc}{\contentsline {subsubsection}{\numberline {6.1.3}Solutions choisies}{5}{subsubsection.6.1.3}}
\@writefile{toc}{\contentsline {subsection}{\numberline {6.2}Choix de la structure}{5}{subsection.6.2}}
\@writefile{toc}{\contentsline {subsubsection}{\numberline {6.2.1}Premi\IeC {\`e}re solution envisag\IeC {\'e}e}{5}{subsubsection.6.2.1}}
\@writefile{toc}{\contentsline {subsubsection}{\numberline {6.2.2}Deuxi\IeC {\`e}me solution envisag\IeC {\'e}e}{5}{subsubsection.6.2.2}}
\@writefile{toc}{\contentsline {subsubsection}{\numberline {6.2.3}Troisi\IeC {\`e}me solution envisag\IeC {\'e}e}{5}{subsubsection.6.2.3}}
\@writefile{toc}{\contentsline {subsection}{\numberline {6.3}Mise en place de la structure}{6}{subsection.6.3}}
\@writefile{toc}{\contentsline {subsubsection}{\numberline {6.3.1}Groupe A}{6}{subsubsection.6.3.1}}
\@writefile{toc}{\contentsline {subsubsection}{\numberline {6.3.2}Groupe B}{6}{subsubsection.6.3.2}}
\@writefile{toc}{\contentsline {subsection}{\numberline {6.4}Analyse des r\IeC {\'e}sultats}{6}{subsection.6.4}}
\@writefile{toc}{\contentsline {section}{\numberline {7}Voies d'am\IeC {\'e}liorations}{6}{section.7}}
\@writefile{toc}{\contentsline {subsection}{\numberline {7.1}Capsule Network}{6}{subsection.7.1}}
\@writefile{toc}{\contentsline {paragraph}{Les Capsule Networks dans le projet}{6}{section*.6}}
\newlabel{fig:caps_total}{{7.1}{6}{Les Capsule Networks dans le projet}{section*.6}{}}
\@writefile{lof}{\contentsline {figure}{\numberline {2}{\ignorespaces Les capsules dans le fonctionnement du projet}}{6}{figure.2}}
\@writefile{toc}{\contentsline {paragraph}{La th\IeC {\'e}orie des Capsule Networks}{7}{section*.7}}
\newlabel{fig:caps_mnist}{{7.1}{7}{La théorie des Capsule Networks}{section*.7}{}}
\@writefile{lof}{\contentsline {figure}{\numberline {3}{\ignorespaces Fonctionnement des capsules sur la base de donn\IeC {\'e}es MNIST}}{7}{figure.3}}
\newlabel{fig:caps_squash}{{7.1}{8}{La théorie des Capsule Networks}{figure.3}{}}
\bibstyle{plain}
\bibdata{biblio}
\citation{*}
\@writefile{toc}{\contentsline {subsection}{\numberline {7.2}Transformers/Attention}{9}{subsection.7.2}}
\@writefile{toc}{\contentsline {section}{\numberline {8}Conclusion}{9}{section.8}}
\@writefile{toc}{\contentsline {paragraph}{Sur le projet}{9}{section*.8}}
\@writefile{toc}{\contentsline {paragraph}{Personnelles}{9}{section*.9}}
\@writefile{toc}{\contentsline {section}{\numberline {9}Bibliographie}{9}{section.9}}
