<?xml version="1.0" encoding="utf-8" standalone="no"?>
<!DOCTYPE svg PUBLIC "-//W3C//DTD SVG 1.1//EN"
  "http://www.w3.org/Graphics/SVG/1.1/DTD/svg11.dtd">
<svg height="1056.808625pt" version="1.1" viewBox="0 0 1107.26 1056.808625" width="1107.26pt" xmlns="http://www.w3.org/2000/svg" xmlns:xlink="http://www.w3.org/1999/xlink">
 <metadata>
  <rdf:RDF xmlns:cc="http://creativecommons.org/ns#" xmlns:dc="http://purl.org/dc/elements/1.1/" xmlns:rdf="http://www.w3.org/1999/02/22-rdf-syntax-ns#">
   <cc:Work>
    <dc:type rdf:resource="http://purl.org/dc/dcmitype/StillImage"/>
    <dc:date>2021-04-26T16:21:08.856088</dc:date>
    <dc:format>image/svg+xml</dc:format>
    <dc:creator>
     <cc:Agent>
      <dc:title>Matplotlib v3.4.1, https://matplotlib.org/</dc:title>
     </cc:Agent>
    </dc:creator>
   </cc:Work>
  </rdf:RDF>
 </metadata>
 <defs>
  <style type="text/css">*{stroke-linecap:butt;stroke-linejoin:round;}</style>
 </defs>
 <g id="figure_1">
  <g id="patch_1">
   <path d="M 0 1056.808625 
L 1107.26 1056.808625 
L 1107.26 0 
L 0 0 
z
" style="fill:#ffffff;"/>
  </g>
  <g id="axes_1">
   <g id="patch_2">
    <path d="M 14.3 870.4305 
L 1096.46 870.4305 
L 1096.46 10.8 
L 14.3 10.8 
z
" style="fill:#ffffff;"/>
   </g>
   <g id="table_1">
    <g id="patch_3">
     <path d="M 14.3 905.546125 
L 375.02 905.546125 
L 375.02 870.4305 
L 14.3 870.4305 
z
" style="fill:#ffffff;stroke:#000000;stroke-linejoin:miter;"/>
    </g>
    <g id="text_1">
     <!-- Name -->
     <g transform="translate(176.958125 891.299562)scale(0.12 -0.12)">
      <defs>
       <path d="M 628 4666 
L 1478 4666 
L 3547 763 
L 3547 4666 
L 4159 4666 
L 4159 0 
L 3309 0 
L 1241 3903 
L 1241 0 
L 628 0 
L 628 4666 
z
" id="DejaVuSans-4e" transform="scale(0.015625)"/>
       <path d="M 2194 1759 
Q 1497 1759 1228 1600 
Q 959 1441 959 1056 
Q 959 750 1161 570 
Q 1363 391 1709 391 
Q 2188 391 2477 730 
Q 2766 1069 2766 1631 
L 2766 1759 
L 2194 1759 
z
M 3341 1997 
L 3341 0 
L 2766 0 
L 2766 531 
Q 2569 213 2275 61 
Q 1981 -91 1556 -91 
Q 1019 -91 701 211 
Q 384 513 384 1019 
Q 384 1609 779 1909 
Q 1175 2209 1959 2209 
L 2766 2209 
L 2766 2266 
Q 2766 2663 2505 2880 
Q 2244 3097 1772 3097 
Q 1472 3097 1187 3025 
Q 903 2953 641 2809 
L 641 3341 
Q 956 3463 1253 3523 
Q 1550 3584 1831 3584 
Q 2591 3584 2966 3190 
Q 3341 2797 3341 1997 
z
" id="DejaVuSans-61" transform="scale(0.015625)"/>
       <path d="M 3328 2828 
Q 3544 3216 3844 3400 
Q 4144 3584 4550 3584 
Q 5097 3584 5394 3201 
Q 5691 2819 5691 2113 
L 5691 0 
L 5113 0 
L 5113 2094 
Q 5113 2597 4934 2840 
Q 4756 3084 4391 3084 
Q 3944 3084 3684 2787 
Q 3425 2491 3425 1978 
L 3425 0 
L 2847 0 
L 2847 2094 
Q 2847 2600 2669 2842 
Q 2491 3084 2119 3084 
Q 1678 3084 1418 2786 
Q 1159 2488 1159 1978 
L 1159 0 
L 581 0 
L 581 3500 
L 1159 3500 
L 1159 2956 
Q 1356 3278 1631 3431 
Q 1906 3584 2284 3584 
Q 2666 3584 2933 3390 
Q 3200 3197 3328 2828 
z
" id="DejaVuSans-6d" transform="scale(0.015625)"/>
       <path d="M 3597 1894 
L 3597 1613 
L 953 1613 
Q 991 1019 1311 708 
Q 1631 397 2203 397 
Q 2534 397 2845 478 
Q 3156 559 3463 722 
L 3463 178 
Q 3153 47 2828 -22 
Q 2503 -91 2169 -91 
Q 1331 -91 842 396 
Q 353 884 353 1716 
Q 353 2575 817 3079 
Q 1281 3584 2069 3584 
Q 2775 3584 3186 3129 
Q 3597 2675 3597 1894 
z
M 3022 2063 
Q 3016 2534 2758 2815 
Q 2500 3097 2075 3097 
Q 1594 3097 1305 2825 
Q 1016 2553 972 2059 
L 3022 2063 
z
" id="DejaVuSans-65" transform="scale(0.015625)"/>
      </defs>
      <use xlink:href="#DejaVuSans-4e"/>
      <use x="74.804688" xlink:href="#DejaVuSans-61"/>
      <use x="136.083984" xlink:href="#DejaVuSans-6d"/>
      <use x="233.496094" xlink:href="#DejaVuSans-65"/>
     </g>
    </g>
    <g id="patch_4">
     <path d="M 375.02 905.546125 
L 735.74 905.546125 
L 735.74 870.4305 
L 375.02 870.4305 
z
" style="fill:#ffffff;stroke:#000000;stroke-linejoin:miter;"/>
    </g>
    <g id="text_2">
     <!-- Age -->
     <g transform="translate(543.774688 891.299562)scale(0.12 -0.12)">
      <defs>
       <path d="M 2188 4044 
L 1331 1722 
L 3047 1722 
L 2188 4044 
z
M 1831 4666 
L 2547 4666 
L 4325 0 
L 3669 0 
L 3244 1197 
L 1141 1197 
L 716 0 
L 50 0 
L 1831 4666 
z
" id="DejaVuSans-41" transform="scale(0.015625)"/>
       <path d="M 2906 1791 
Q 2906 2416 2648 2759 
Q 2391 3103 1925 3103 
Q 1463 3103 1205 2759 
Q 947 2416 947 1791 
Q 947 1169 1205 825 
Q 1463 481 1925 481 
Q 2391 481 2648 825 
Q 2906 1169 2906 1791 
z
M 3481 434 
Q 3481 -459 3084 -895 
Q 2688 -1331 1869 -1331 
Q 1566 -1331 1297 -1286 
Q 1028 -1241 775 -1147 
L 775 -588 
Q 1028 -725 1275 -790 
Q 1522 -856 1778 -856 
Q 2344 -856 2625 -561 
Q 2906 -266 2906 331 
L 2906 616 
Q 2728 306 2450 153 
Q 2172 0 1784 0 
Q 1141 0 747 490 
Q 353 981 353 1791 
Q 353 2603 747 3093 
Q 1141 3584 1784 3584 
Q 2172 3584 2450 3431 
Q 2728 3278 2906 2969 
L 2906 3500 
L 3481 3500 
L 3481 434 
z
" id="DejaVuSans-67" transform="scale(0.015625)"/>
      </defs>
      <use xlink:href="#DejaVuSans-41"/>
      <use x="68.408203" xlink:href="#DejaVuSans-67"/>
      <use x="131.884766" xlink:href="#DejaVuSans-65"/>
     </g>
    </g>
    <g id="patch_5">
     <path d="M 735.74 905.546125 
L 1096.46 905.546125 
L 1096.46 870.4305 
L 735.74 870.4305 
z
" style="fill:#ffffff;stroke:#000000;stroke-linejoin:miter;"/>
    </g>
    <g id="text_3">
     <!-- gender -->
     <g transform="translate(894.829063 891.299562)scale(0.12 -0.12)">
      <defs>
       <path d="M 3513 2113 
L 3513 0 
L 2938 0 
L 2938 2094 
Q 2938 2591 2744 2837 
Q 2550 3084 2163 3084 
Q 1697 3084 1428 2787 
Q 1159 2491 1159 1978 
L 1159 0 
L 581 0 
L 581 3500 
L 1159 3500 
L 1159 2956 
Q 1366 3272 1645 3428 
Q 1925 3584 2291 3584 
Q 2894 3584 3203 3211 
Q 3513 2838 3513 2113 
z
" id="DejaVuSans-6e" transform="scale(0.015625)"/>
       <path d="M 2906 2969 
L 2906 4863 
L 3481 4863 
L 3481 0 
L 2906 0 
L 2906 525 
Q 2725 213 2448 61 
Q 2172 -91 1784 -91 
Q 1150 -91 751 415 
Q 353 922 353 1747 
Q 353 2572 751 3078 
Q 1150 3584 1784 3584 
Q 2172 3584 2448 3432 
Q 2725 3281 2906 2969 
z
M 947 1747 
Q 947 1113 1208 752 
Q 1469 391 1925 391 
Q 2381 391 2643 752 
Q 2906 1113 2906 1747 
Q 2906 2381 2643 2742 
Q 2381 3103 1925 3103 
Q 1469 3103 1208 2742 
Q 947 2381 947 1747 
z
" id="DejaVuSans-64" transform="scale(0.015625)"/>
       <path d="M 2631 2963 
Q 2534 3019 2420 3045 
Q 2306 3072 2169 3072 
Q 1681 3072 1420 2755 
Q 1159 2438 1159 1844 
L 1159 0 
L 581 0 
L 581 3500 
L 1159 3500 
L 1159 2956 
Q 1341 3275 1631 3429 
Q 1922 3584 2338 3584 
Q 2397 3584 2469 3576 
Q 2541 3569 2628 3553 
L 2631 2963 
z
" id="DejaVuSans-72" transform="scale(0.015625)"/>
      </defs>
      <use xlink:href="#DejaVuSans-67"/>
      <use x="63.476562" xlink:href="#DejaVuSans-65"/>
      <use x="125" xlink:href="#DejaVuSans-6e"/>
      <use x="188.378906" xlink:href="#DejaVuSans-64"/>
      <use x="251.855469" xlink:href="#DejaVuSans-65"/>
      <use x="313.378906" xlink:href="#DejaVuSans-72"/>
     </g>
    </g>
    <g id="patch_6">
     <path d="M 14.3 940.66175 
L 375.02 940.66175 
L 375.02 905.546125 
L 14.3 905.546125 
z
" style="fill:#ffffff;stroke:#000000;stroke-linejoin:miter;"/>
    </g>
    <g id="text_4">
     <!-- Tom -->
     <g transform="translate(314.627375 926.415187)scale(0.12 -0.12)">
      <defs>
       <path d="M -19 4666 
L 3928 4666 
L 3928 4134 
L 2272 4134 
L 2272 0 
L 1638 0 
L 1638 4134 
L -19 4134 
L -19 4666 
z
" id="DejaVuSans-54" transform="scale(0.015625)"/>
       <path d="M 1959 3097 
Q 1497 3097 1228 2736 
Q 959 2375 959 1747 
Q 959 1119 1226 758 
Q 1494 397 1959 397 
Q 2419 397 2687 759 
Q 2956 1122 2956 1747 
Q 2956 2369 2687 2733 
Q 2419 3097 1959 3097 
z
M 1959 3584 
Q 2709 3584 3137 3096 
Q 3566 2609 3566 1747 
Q 3566 888 3137 398 
Q 2709 -91 1959 -91 
Q 1206 -91 779 398 
Q 353 888 353 1747 
Q 353 2609 779 3096 
Q 1206 3584 1959 3584 
z
" id="DejaVuSans-6f" transform="scale(0.015625)"/>
      </defs>
      <use xlink:href="#DejaVuSans-54"/>
      <use x="44.083984" xlink:href="#DejaVuSans-6f"/>
      <use x="105.265625" xlink:href="#DejaVuSans-6d"/>
     </g>
    </g>
    <g id="patch_7">
     <path d="M 375.02 940.66175 
L 735.74 940.66175 
L 735.74 905.546125 
L 375.02 905.546125 
z
" style="fill:#ffffff;stroke:#000000;stroke-linejoin:miter;"/>
    </g>
    <g id="text_5">
     <!-- 20 -->
     <g transform="translate(684.398 926.415187)scale(0.12 -0.12)">
      <defs>
       <path d="M 1228 531 
L 3431 531 
L 3431 0 
L 469 0 
L 469 531 
Q 828 903 1448 1529 
Q 2069 2156 2228 2338 
Q 2531 2678 2651 2914 
Q 2772 3150 2772 3378 
Q 2772 3750 2511 3984 
Q 2250 4219 1831 4219 
Q 1534 4219 1204 4116 
Q 875 4013 500 3803 
L 500 4441 
Q 881 4594 1212 4672 
Q 1544 4750 1819 4750 
Q 2544 4750 2975 4387 
Q 3406 4025 3406 3419 
Q 3406 3131 3298 2873 
Q 3191 2616 2906 2266 
Q 2828 2175 2409 1742 
Q 1991 1309 1228 531 
z
" id="DejaVuSans-32" transform="scale(0.015625)"/>
       <path d="M 2034 4250 
Q 1547 4250 1301 3770 
Q 1056 3291 1056 2328 
Q 1056 1369 1301 889 
Q 1547 409 2034 409 
Q 2525 409 2770 889 
Q 3016 1369 3016 2328 
Q 3016 3291 2770 3770 
Q 2525 4250 2034 4250 
z
M 2034 4750 
Q 2819 4750 3233 4129 
Q 3647 3509 3647 2328 
Q 3647 1150 3233 529 
Q 2819 -91 2034 -91 
Q 1250 -91 836 529 
Q 422 1150 422 2328 
Q 422 3509 836 4129 
Q 1250 4750 2034 4750 
z
" id="DejaVuSans-30" transform="scale(0.015625)"/>
      </defs>
      <use xlink:href="#DejaVuSans-32"/>
      <use x="63.623047" xlink:href="#DejaVuSans-30"/>
     </g>
    </g>
    <g id="patch_8">
     <path d="M 735.74 940.66175 
L 1096.46 940.66175 
L 1096.46 905.546125 
L 735.74 905.546125 
z
" style="fill:#ffffff;stroke:#000000;stroke-linejoin:miter;"/>
    </g>
    <g id="text_6">
     <!-- M -->
     <g transform="translate(1050.03425 926.415187)scale(0.12 -0.12)">
      <defs>
       <path d="M 628 4666 
L 1569 4666 
L 2759 1491 
L 3956 4666 
L 4897 4666 
L 4897 0 
L 4281 0 
L 4281 4097 
L 3078 897 
L 2444 897 
L 1241 4097 
L 1241 0 
L 628 0 
L 628 4666 
z
" id="DejaVuSans-4d" transform="scale(0.015625)"/>
      </defs>
      <use xlink:href="#DejaVuSans-4d"/>
     </g>
    </g>
    <g id="patch_9">
     <path d="M 14.3 975.777375 
L 375.02 975.777375 
L 375.02 940.66175 
L 14.3 940.66175 
z
" style="fill:#ffffff;stroke:#000000;stroke-linejoin:miter;"/>
    </g>
    <g id="text_7">
     <!-- nick -->
     <g transform="translate(314.462375 961.530812)scale(0.12 -0.12)">
      <defs>
       <path d="M 603 3500 
L 1178 3500 
L 1178 0 
L 603 0 
L 603 3500 
z
M 603 4863 
L 1178 4863 
L 1178 4134 
L 603 4134 
L 603 4863 
z
" id="DejaVuSans-69" transform="scale(0.015625)"/>
       <path d="M 3122 3366 
L 3122 2828 
Q 2878 2963 2633 3030 
Q 2388 3097 2138 3097 
Q 1578 3097 1268 2742 
Q 959 2388 959 1747 
Q 959 1106 1268 751 
Q 1578 397 2138 397 
Q 2388 397 2633 464 
Q 2878 531 3122 666 
L 3122 134 
Q 2881 22 2623 -34 
Q 2366 -91 2075 -91 
Q 1284 -91 818 406 
Q 353 903 353 1747 
Q 353 2603 823 3093 
Q 1294 3584 2113 3584 
Q 2378 3584 2631 3529 
Q 2884 3475 3122 3366 
z
" id="DejaVuSans-63" transform="scale(0.015625)"/>
       <path d="M 581 4863 
L 1159 4863 
L 1159 1991 
L 2875 3500 
L 3609 3500 
L 1753 1863 
L 3688 0 
L 2938 0 
L 1159 1709 
L 1159 0 
L 581 0 
L 581 4863 
z
" id="DejaVuSans-6b" transform="scale(0.015625)"/>
      </defs>
      <use xlink:href="#DejaVuSans-6e"/>
      <use x="63.378906" xlink:href="#DejaVuSans-69"/>
      <use x="91.162109" xlink:href="#DejaVuSans-63"/>
      <use x="146.142578" xlink:href="#DejaVuSans-6b"/>
     </g>
    </g>
    <g id="patch_10">
     <path d="M 375.02 975.777375 
L 735.74 975.777375 
L 735.74 940.66175 
L 375.02 940.66175 
z
" style="fill:#ffffff;stroke:#000000;stroke-linejoin:miter;"/>
    </g>
    <g id="text_8">
     <!-- 21 -->
     <g transform="translate(684.398 961.530812)scale(0.12 -0.12)">
      <defs>
       <path d="M 794 531 
L 1825 531 
L 1825 4091 
L 703 3866 
L 703 4441 
L 1819 4666 
L 2450 4666 
L 2450 531 
L 3481 531 
L 3481 0 
L 794 0 
L 794 531 
z
" id="DejaVuSans-31" transform="scale(0.015625)"/>
      </defs>
      <use xlink:href="#DejaVuSans-32"/>
      <use x="63.623047" xlink:href="#DejaVuSans-31"/>
     </g>
    </g>
    <g id="patch_11">
     <path d="M 735.74 975.777375 
L 1096.46 975.777375 
L 1096.46 940.66175 
L 735.74 940.66175 
z
" style="fill:#ffffff;stroke:#000000;stroke-linejoin:miter;"/>
    </g>
    <g id="text_9">
     <!-- M -->
     <g transform="translate(1050.03425 961.530812)scale(0.12 -0.12)">
      <use xlink:href="#DejaVuSans-4d"/>
     </g>
    </g>
    <g id="patch_12">
     <path d="M 14.3 1010.893 
L 375.02 1010.893 
L 375.02 975.777375 
L 14.3 975.777375 
z
" style="fill:#ffffff;stroke:#000000;stroke-linejoin:miter;"/>
    </g>
    <g id="text_10">
     <!-- krish -->
     <g transform="translate(309.876125 996.646437)scale(0.12 -0.12)">
      <defs>
       <path d="M 2834 3397 
L 2834 2853 
Q 2591 2978 2328 3040 
Q 2066 3103 1784 3103 
Q 1356 3103 1142 2972 
Q 928 2841 928 2578 
Q 928 2378 1081 2264 
Q 1234 2150 1697 2047 
L 1894 2003 
Q 2506 1872 2764 1633 
Q 3022 1394 3022 966 
Q 3022 478 2636 193 
Q 2250 -91 1575 -91 
Q 1294 -91 989 -36 
Q 684 19 347 128 
L 347 722 
Q 666 556 975 473 
Q 1284 391 1588 391 
Q 1994 391 2212 530 
Q 2431 669 2431 922 
Q 2431 1156 2273 1281 
Q 2116 1406 1581 1522 
L 1381 1569 
Q 847 1681 609 1914 
Q 372 2147 372 2553 
Q 372 3047 722 3315 
Q 1072 3584 1716 3584 
Q 2034 3584 2315 3537 
Q 2597 3491 2834 3397 
z
" id="DejaVuSans-73" transform="scale(0.015625)"/>
       <path d="M 3513 2113 
L 3513 0 
L 2938 0 
L 2938 2094 
Q 2938 2591 2744 2837 
Q 2550 3084 2163 3084 
Q 1697 3084 1428 2787 
Q 1159 2491 1159 1978 
L 1159 0 
L 581 0 
L 581 4863 
L 1159 4863 
L 1159 2956 
Q 1366 3272 1645 3428 
Q 1925 3584 2291 3584 
Q 2894 3584 3203 3211 
Q 3513 2838 3513 2113 
z
" id="DejaVuSans-68" transform="scale(0.015625)"/>
      </defs>
      <use xlink:href="#DejaVuSans-6b"/>
      <use x="57.910156" xlink:href="#DejaVuSans-72"/>
      <use x="99.023438" xlink:href="#DejaVuSans-69"/>
      <use x="126.806641" xlink:href="#DejaVuSans-73"/>
      <use x="178.90625" xlink:href="#DejaVuSans-68"/>
     </g>
    </g>
    <g id="patch_13">
     <path d="M 375.02 1010.893 
L 735.74 1010.893 
L 735.74 975.777375 
L 375.02 975.777375 
z
" style="fill:#ffffff;stroke:#000000;stroke-linejoin:miter;"/>
    </g>
    <g id="text_11">
     <!-- 19 -->
     <g transform="translate(684.398 996.646437)scale(0.12 -0.12)">
      <defs>
       <path d="M 703 97 
L 703 672 
Q 941 559 1184 500 
Q 1428 441 1663 441 
Q 2288 441 2617 861 
Q 2947 1281 2994 2138 
Q 2813 1869 2534 1725 
Q 2256 1581 1919 1581 
Q 1219 1581 811 2004 
Q 403 2428 403 3163 
Q 403 3881 828 4315 
Q 1253 4750 1959 4750 
Q 2769 4750 3195 4129 
Q 3622 3509 3622 2328 
Q 3622 1225 3098 567 
Q 2575 -91 1691 -91 
Q 1453 -91 1209 -44 
Q 966 3 703 97 
z
M 1959 2075 
Q 2384 2075 2632 2365 
Q 2881 2656 2881 3163 
Q 2881 3666 2632 3958 
Q 2384 4250 1959 4250 
Q 1534 4250 1286 3958 
Q 1038 3666 1038 3163 
Q 1038 2656 1286 2365 
Q 1534 2075 1959 2075 
z
" id="DejaVuSans-39" transform="scale(0.015625)"/>
      </defs>
      <use xlink:href="#DejaVuSans-31"/>
      <use x="63.623047" xlink:href="#DejaVuSans-39"/>
     </g>
    </g>
    <g id="patch_14">
     <path d="M 735.74 1010.893 
L 1096.46 1010.893 
L 1096.46 975.777375 
L 735.74 975.777375 
z
" style="fill:#ffffff;stroke:#000000;stroke-linejoin:miter;"/>
    </g>
    <g id="text_12">
     <!-- M -->
     <g transform="translate(1050.03425 996.646437)scale(0.12 -0.12)">
      <use xlink:href="#DejaVuSans-4d"/>
     </g>
    </g>
    <g id="patch_15">
     <path d="M 14.3 1046.008625 
L 375.02 1046.008625 
L 375.02 1010.893 
L 14.3 1010.893 
z
" style="fill:#ffffff;stroke:#000000;stroke-linejoin:miter;"/>
    </g>
    <g id="text_13">
     <!-- jack -->
     <g transform="translate(314.713625 1031.762062)scale(0.12 -0.12)">
      <defs>
       <path d="M 603 3500 
L 1178 3500 
L 1178 -63 
Q 1178 -731 923 -1031 
Q 669 -1331 103 -1331 
L -116 -1331 
L -116 -844 
L 38 -844 
Q 366 -844 484 -692 
Q 603 -541 603 -63 
L 603 3500 
z
M 603 4863 
L 1178 4863 
L 1178 4134 
L 603 4134 
L 603 4863 
z
" id="DejaVuSans-6a" transform="scale(0.015625)"/>
      </defs>
      <use xlink:href="#DejaVuSans-6a"/>
      <use x="27.783203" xlink:href="#DejaVuSans-61"/>
      <use x="89.0625" xlink:href="#DejaVuSans-63"/>
      <use x="144.042969" xlink:href="#DejaVuSans-6b"/>
     </g>
    </g>
    <g id="patch_16">
     <path d="M 375.02 1046.008625 
L 735.74 1046.008625 
L 735.74 1010.893 
L 375.02 1010.893 
z
" style="fill:#ffffff;stroke:#000000;stroke-linejoin:miter;"/>
    </g>
    <g id="text_14">
     <!-- 18 -->
     <g transform="translate(684.398 1031.762062)scale(0.12 -0.12)">
      <defs>
       <path d="M 2034 2216 
Q 1584 2216 1326 1975 
Q 1069 1734 1069 1313 
Q 1069 891 1326 650 
Q 1584 409 2034 409 
Q 2484 409 2743 651 
Q 3003 894 3003 1313 
Q 3003 1734 2745 1975 
Q 2488 2216 2034 2216 
z
M 1403 2484 
Q 997 2584 770 2862 
Q 544 3141 544 3541 
Q 544 4100 942 4425 
Q 1341 4750 2034 4750 
Q 2731 4750 3128 4425 
Q 3525 4100 3525 3541 
Q 3525 3141 3298 2862 
Q 3072 2584 2669 2484 
Q 3125 2378 3379 2068 
Q 3634 1759 3634 1313 
Q 3634 634 3220 271 
Q 2806 -91 2034 -91 
Q 1263 -91 848 271 
Q 434 634 434 1313 
Q 434 1759 690 2068 
Q 947 2378 1403 2484 
z
M 1172 3481 
Q 1172 3119 1398 2916 
Q 1625 2713 2034 2713 
Q 2441 2713 2670 2916 
Q 2900 3119 2900 3481 
Q 2900 3844 2670 4047 
Q 2441 4250 2034 4250 
Q 1625 4250 1398 4047 
Q 1172 3844 1172 3481 
z
" id="DejaVuSans-38" transform="scale(0.015625)"/>
      </defs>
      <use xlink:href="#DejaVuSans-31"/>
      <use x="63.623047" xlink:href="#DejaVuSans-38"/>
     </g>
    </g>
    <g id="patch_17">
     <path d="M 735.74 1046.008625 
L 1096.46 1046.008625 
L 1096.46 1010.893 
L 735.74 1010.893 
z
" style="fill:#ffffff;stroke:#000000;stroke-linejoin:miter;"/>
    </g>
    <g id="text_15">
     <!-- M -->
     <g transform="translate(1050.03425 1031.762062)scale(0.12 -0.12)">
      <use xlink:href="#DejaVuSans-4d"/>
     </g>
    </g>
   </g>
   <g id="line2d_1">
    <path clip-path="url(#p476d7c026f)" d="M 838.88 157.18275 
L 838.88 177.07275 
L 838.88 177.07275 
M 838.88 207.67275 
L 838.88 207.67275 
L 838.88 227.56275 
" style="fill:none;stroke:#000000;stroke-linecap:round;stroke-width:1.5;"/>
   </g>
   <g id="line2d_2">
    <path clip-path="url(#p476d7c026f)" d="M 838.88 233.68275 
L 838.88 253.57275 
L 863.18 253.57275 
L 863.18 284.17275 
L 814.58 284.17275 
L 814.58 253.57275 
L 838.88 253.57275 
M 838.88 284.17275 
L 838.88 304.06275 
" style="fill:none;stroke:#000000;stroke-linecap:round;stroke-width:1.5;"/>
   </g>
   <g id="line2d_3">
    <path clip-path="url(#p476d7c026f)" d="M 838.88 310.18275 
L 838.88 330.07275 
L 863.18 330.07275 
L 863.18 360.67275 
L 814.58 360.67275 
L 814.58 330.07275 
L 838.88 330.07275 
M 863.18 330.07275 
L 814.58 360.67275 
M 834.83 335.17275 
L 818.63 335.17275 
M 834.83 340.27275 
L 818.63 340.27275 
M 838.88 360.67275 
L 838.88 380.56275 
" style="fill:none;stroke:#000000;stroke-linecap:round;stroke-width:1.5;"/>
   </g>
   <g id="line2d_4">
    <path clip-path="url(#p476d7c026f)" d="M 838.88 353.02275 
L 839.555 351.438777 
L 840.23 349.96275 
L 840.905 348.695256 
L 841.58 347.722675 
L 842.255 347.111284 
L 842.93 346.90275 
L 843.605 347.111284 
L 844.28 347.722675 
L 844.955 348.695256 
L 845.63 349.96275 
L 846.305 351.438777 
L 846.98 353.02275 
L 847.655 354.606723 
L 848.33 356.08275 
L 849.005 357.350244 
L 849.68 358.322825 
L 850.355 358.934216 
L 851.03 359.14275 
L 851.705 358.934216 
L 852.38 358.322825 
L 853.055 357.350244 
L 853.73 356.08275 
L 854.405 354.606723 
L 855.08 353.02275 
" style="fill:none;stroke:#000000;stroke-linecap:round;stroke-width:1.5;"/>
   </g>
   <g id="line2d_5">
    <path clip-path="url(#p476d7c026f)" d="M 838.88 386.68275 
L 838.88 406.57275 
L 863.18 406.57275 
L 863.18 437.17275 
L 814.58 437.17275 
L 814.58 406.57275 
L 838.88 406.57275 
M 863.18 406.57275 
L 814.58 437.17275 
M 842.93 426.97275 
L 859.13 426.97275 
M 842.93 432.07275 
L 859.13 432.07275 
M 838.88 437.17275 
L 838.88 457.06275 
" style="fill:none;stroke:#000000;stroke-linecap:round;stroke-width:1.5;"/>
   </g>
   <g id="line2d_6">
    <path clip-path="url(#p476d7c026f)" d="M 822.68 414.22275 
L 823.355 412.638777 
L 824.03 411.16275 
L 824.705 409.895256 
L 825.38 408.922675 
L 826.055 408.311284 
L 826.73 408.10275 
L 827.405 408.311284 
L 828.08 408.922675 
L 828.755 409.895256 
L 829.43 411.16275 
L 830.105 412.638777 
L 830.78 414.22275 
L 831.455 415.806723 
L 832.13 417.28275 
L 832.805 418.550244 
L 833.48 419.522825 
L 834.155 420.134216 
L 834.83 420.34275 
L 835.505 420.134216 
L 836.18 419.522825 
L 836.855 418.550244 
L 837.53 417.28275 
L 838.205 415.806723 
L 838.88 414.22275 
" style="fill:none;stroke:#000000;stroke-linecap:round;stroke-width:1.5;"/>
   </g>
   <g id="line2d_7">
    <path clip-path="url(#p476d7c026f)" d="M 838.88 463.18275 
L 838.88 483.07275 
L 863.18 483.07275 
L 863.18 513.67275 
L 814.58 513.67275 
L 814.58 483.07275 
L 838.88 483.07275 
M 863.18 483.07275 
L 814.58 513.67275 
M 834.83 488.17275 
L 818.63 488.17275 
M 834.83 493.27275 
L 818.63 493.27275 
M 842.93 503.47275 
L 859.13 503.47275 
M 842.93 508.57275 
L 859.13 508.57275 
M 838.88 513.67275 
L 838.88 533.56275 
" style="fill:none;stroke:#000000;stroke-linecap:round;stroke-width:1.5;"/>
   </g>
   <g id="line2d_8">
    <path clip-path="url(#p476d7c026f)" d="M 838.88 539.68275 
L 838.88 566.2665 
M 838.88 583.479 
L 838.88 610.06275 
" style="fill:none;stroke:#000000;stroke-linecap:round;stroke-width:1.5;"/>
   </g>
   <g id="line2d_9">
    <path clip-path="url(#p476d7c026f)" d="M 851.03 566.2665 
L 826.73 566.2665 
" style="fill:none;stroke:#000000;stroke-linecap:round;stroke-width:1.5;"/>
   </g>
   <g id="line2d_10">
    <path clip-path="url(#p476d7c026f)" d="M 844.955 572.004 
L 832.805 572.004 
" style="fill:none;stroke:#000000;stroke-linecap:round;stroke-width:1.5;"/>
   </g>
   <g id="line2d_11">
    <path clip-path="url(#p476d7c026f)" d="M 851.03 577.7415 
L 826.73 577.7415 
" style="fill:none;stroke:#000000;stroke-linecap:round;stroke-width:1.5;"/>
   </g>
   <g id="line2d_12">
    <path clip-path="url(#p476d7c026f)" d="M 844.955 583.479 
L 832.805 583.479 
" style="fill:none;stroke:#000000;stroke-linecap:round;stroke-width:1.5;"/>
   </g>
   <g id="line2d_13">
    <path clip-path="url(#p476d7c026f)" d="M 790.28 662.08275 
L 822.68 662.08275 
L 855.08 662.08275 
" style="fill:none;stroke:#000000;stroke-linecap:round;stroke-width:1.5;"/>
   </g>
   <g id="line2d_14">
    <path clip-path="url(#p476d7c026f)" d="M 158.48 157.18275 
L 158.48 169.42275 
L 150.38 169.42275 
L 166.58 169.42275 
M 152.81 173.09475 
L 164.15 173.09475 
M 156.86 176.76675 
L 160.1 176.76675 
" style="fill:none;stroke:#000000;stroke-linecap:round;stroke-width:1.5;"/>
   </g>
   <g id="line2d_15">
    <path clip-path="url(#p476d7c026f)" d="M 158.48 157.18275 
" style="fill:none;stroke:#000000;stroke-linecap:round;stroke-width:1.5;"/>
   </g>
   <g id="line2d_16">
    <path clip-path="url(#p476d7c026f)" d="M 158.48 157.18275 
L 190.88 157.18275 
L 223.28 157.18275 
" style="fill:none;stroke:#000000;stroke-linecap:round;stroke-width:1.5;"/>
   </g>
   <g id="line2d_17">
    <path clip-path="url(#p476d7c026f)" d="M 223.28 157.18275 
L 223.28 169.42275 
L 231.38 169.42275 
L 231.38 215.32275 
L 215.18 215.32275 
L 215.18 169.42275 
M 223.28 215.32275 
L 223.28 227.56275 
" style="fill:none;stroke:#000000;stroke-linecap:round;stroke-width:1.5;"/>
   </g>
   <g id="line2d_18">
    <path clip-path="url(#p476d7c026f)" d="M 223.28 227.56275 
L 223.28 232.15275 
L 223.28 293.35275 
L 223.28 297.94275 
" style="fill:none;stroke:#000000;stroke-dasharray:5.55,2.4;stroke-dashoffset:0;stroke-width:1.5;"/>
   </g>
   <g id="line2d_19">
    <path clip-path="url(#p476d7c026f)" d="M 223.28 297.94275 
L 223.28 310.18275 
L 231.38 310.18275 
L 231.38 356.08275 
L 215.18 356.08275 
L 215.18 310.18275 
M 223.28 356.08275 
L 223.28 368.32275 
" style="fill:none;stroke:#000000;stroke-linecap:round;stroke-width:1.5;"/>
   </g>
   <g id="line2d_20">
    <path clip-path="url(#p476d7c026f)" d="M 223.28 368.32275 
L 260.54 368.32275 
L 297.8 368.32275 
" style="fill:none;stroke:#000000;stroke-linecap:round;stroke-width:1.5;"/>
   </g>
   <g id="line2d_21">
    <path clip-path="url(#p476d7c026f)" d="M 297.8 368.32275 
L 310.76 368.32275 
L 326.15 368.32275 
M 335.06 353.02275 
L 318.86 383.62275 
M 343.16 353.02275 
L 326.96 383.62275 
M 335.87 368.32275 
L 359.36 368.32275 
L 372.32 368.32275 
" style="fill:none;stroke:#000000;stroke-linecap:round;stroke-width:1.5;"/>
   </g>
   <g id="line2d_22">
    <path clip-path="url(#p476d7c026f)" d="M 223.28 157.18275 
L 260.54 157.18275 
L 297.8 157.18275 
" style="fill:none;stroke:#000000;stroke-linecap:round;stroke-width:1.5;"/>
   </g>
   <g id="line2d_23">
    <path clip-path="url(#p476d7c026f)" d="M 297.8 157.18275 
L 310.76 157.18275 
L 326.15 157.18275 
M 335.06 141.88275 
L 318.86 172.48275 
M 343.16 141.88275 
L 326.96 172.48275 
M 335.87 157.18275 
L 359.36 157.18275 
L 372.32 157.18275 
" style="fill:none;stroke:#000000;stroke-linecap:round;stroke-width:1.5;"/>
   </g>
   <g id="line2d_24">
    <path clip-path="url(#p476d7c026f)" d="M 372.32 157.18275 
L 372.32 169.42275 
L 380.42 169.42275 
L 380.42 215.32275 
L 364.22 215.32275 
L 364.22 169.42275 
M 372.32 215.32275 
L 372.32 227.56275 
" style="fill:none;stroke:#000000;stroke-linecap:round;stroke-width:1.5;"/>
   </g>
   <g id="line2d_25">
    <path clip-path="url(#p476d7c026f)" d="M 372.32 227.56275 
L 372.32 232.15275 
L 372.32 293.35275 
L 372.32 297.94275 
" style="fill:none;stroke:#000000;stroke-dasharray:5.55,2.4;stroke-dashoffset:0;stroke-width:1.5;"/>
   </g>
   <g id="line2d_26">
    <path clip-path="url(#p476d7c026f)" d="M 372.32 297.94275 
L 372.32 310.18275 
L 380.42 310.18275 
L 380.42 356.08275 
L 364.22 356.08275 
L 364.22 310.18275 
M 372.32 356.08275 
L 372.32 368.32275 
" style="fill:none;stroke:#000000;stroke-linecap:round;stroke-width:1.5;"/>
   </g>
   <g id="line2d_27">
    <path clip-path="url(#p476d7c026f)" d="M 223.28 368.32275 
L 223.28 388.21275 
L 247.58 388.21275 
L 247.58 418.81275 
L 198.98 418.81275 
L 198.98 388.21275 
L 223.28 388.21275 
M 223.28 418.81275 
L 223.28 438.70275 
" style="fill:none;stroke:#000000;stroke-linecap:round;stroke-width:1.5;"/>
   </g>
   <g id="line2d_28">
    <path clip-path="url(#p476d7c026f)" d="M 223.28 438.70275 
L 223.28 458.59275 
L 247.58 458.59275 
L 247.58 489.19275 
L 198.98 489.19275 
L 198.98 458.59275 
L 223.28 458.59275 
M 247.58 458.59275 
L 198.98 489.19275 
M 219.23 463.69275 
L 203.03 463.69275 
M 219.23 468.79275 
L 203.03 468.79275 
M 223.28 489.19275 
L 223.28 509.08275 
" style="fill:none;stroke:#000000;stroke-linecap:round;stroke-width:1.5;"/>
   </g>
   <g id="line2d_29">
    <path clip-path="url(#p476d7c026f)" d="M 223.28 481.54275 
L 223.955 479.958777 
L 224.63 478.48275 
L 225.305 477.215256 
L 225.98 476.242675 
L 226.655 475.631284 
L 227.33 475.42275 
L 228.005 475.631284 
L 228.68 476.242675 
L 229.355 477.215256 
L 230.03 478.48275 
L 230.705 479.958777 
L 231.38 481.54275 
L 232.055 483.126723 
L 232.73 484.60275 
L 233.405 485.870244 
L 234.08 486.842825 
L 234.755 487.454216 
L 235.43 487.66275 
L 236.105 487.454216 
L 236.78 486.842825 
L 237.455 485.870244 
L 238.13 484.60275 
L 238.805 483.126723 
L 239.48 481.54275 
" style="fill:none;stroke:#000000;stroke-linecap:round;stroke-width:1.5;"/>
   </g>
   <g id="line2d_30">
    <path clip-path="url(#p476d7c026f)" d="M 223.28 509.08275 
" style="fill:none;stroke:#000000;stroke-linecap:round;stroke-width:1.5;"/>
   </g>
   <g id="line2d_31">
    <path clip-path="url(#p476d7c026f)" d="M 482.48 157.18275 
L 482.48 169.42275 
L 474.38 169.42275 
L 490.58 169.42275 
M 476.81 173.09475 
L 488.15 173.09475 
M 480.86 176.76675 
L 484.1 176.76675 
" style="fill:none;stroke:#000000;stroke-linecap:round;stroke-width:1.5;"/>
   </g>
   <g id="line2d_32">
    <path clip-path="url(#p476d7c026f)" d="M 482.48 157.18275 
" style="fill:none;stroke:#000000;stroke-linecap:round;stroke-width:1.5;"/>
   </g>
   <g id="line2d_33">
    <path clip-path="url(#p476d7c026f)" d="M 482.48 157.18275 
L 514.88 157.18275 
L 547.28 157.18275 
" style="fill:none;stroke:#000000;stroke-linecap:round;stroke-width:1.5;"/>
   </g>
   <g id="line2d_34">
    <path clip-path="url(#p476d7c026f)" d="M 547.28 157.18275 
L 547.28 169.42275 
L 555.38 169.42275 
L 555.38 215.32275 
L 539.18 215.32275 
L 539.18 169.42275 
M 547.28 215.32275 
L 547.28 227.56275 
" style="fill:none;stroke:#000000;stroke-linecap:round;stroke-width:1.5;"/>
   </g>
   <g id="line2d_35">
    <path clip-path="url(#p476d7c026f)" d="M 547.28 227.56275 
L 547.28 232.15275 
L 547.28 293.35275 
L 547.28 297.94275 
" style="fill:none;stroke:#000000;stroke-dasharray:5.55,2.4;stroke-dashoffset:0;stroke-width:1.5;"/>
   </g>
   <g id="line2d_36">
    <path clip-path="url(#p476d7c026f)" d="M 547.28 297.94275 
L 547.28 310.18275 
L 555.38 310.18275 
L 555.38 356.08275 
L 539.18 356.08275 
L 539.18 310.18275 
M 547.28 356.08275 
L 547.28 368.32275 
" style="fill:none;stroke:#000000;stroke-linecap:round;stroke-width:1.5;"/>
   </g>
   <g id="line2d_37">
    <path clip-path="url(#p476d7c026f)" d="M 547.28 368.32275 
L 584.54 368.32275 
L 621.8 368.32275 
" style="fill:none;stroke:#000000;stroke-linecap:round;stroke-width:1.5;"/>
   </g>
   <g id="line2d_38">
    <path clip-path="url(#p476d7c026f)" d="M 621.8 368.32275 
L 634.76 368.32275 
L 650.15 368.32275 
M 659.06 353.02275 
L 642.86 383.62275 
M 667.16 353.02275 
L 650.96 383.62275 
M 659.87 368.32275 
L 683.36 368.32275 
L 696.32 368.32275 
" style="fill:none;stroke:#000000;stroke-linecap:round;stroke-width:1.5;"/>
   </g>
   <g id="line2d_39">
    <path clip-path="url(#p476d7c026f)" d="M 547.28 157.18275 
L 584.54 157.18275 
L 621.8 157.18275 
" style="fill:none;stroke:#000000;stroke-linecap:round;stroke-width:1.5;"/>
   </g>
   <g id="line2d_40">
    <path clip-path="url(#p476d7c026f)" d="M 621.8 157.18275 
L 634.76 157.18275 
L 650.15 157.18275 
M 659.06 141.88275 
L 642.86 172.48275 
M 667.16 141.88275 
L 650.96 172.48275 
M 659.87 157.18275 
L 683.36 157.18275 
L 696.32 157.18275 
" style="fill:none;stroke:#000000;stroke-linecap:round;stroke-width:1.5;"/>
   </g>
   <g id="line2d_41">
    <path clip-path="url(#p476d7c026f)" d="M 696.32 157.18275 
L 696.32 169.42275 
L 704.42 169.42275 
L 704.42 215.32275 
L 688.22 215.32275 
L 688.22 169.42275 
M 696.32 215.32275 
L 696.32 227.56275 
" style="fill:none;stroke:#000000;stroke-linecap:round;stroke-width:1.5;"/>
   </g>
   <g id="line2d_42">
    <path clip-path="url(#p476d7c026f)" d="M 696.32 227.56275 
L 696.32 232.15275 
L 696.32 293.35275 
L 696.32 297.94275 
" style="fill:none;stroke:#000000;stroke-dasharray:5.55,2.4;stroke-dashoffset:0;stroke-width:1.5;"/>
   </g>
   <g id="line2d_43">
    <path clip-path="url(#p476d7c026f)" d="M 696.32 297.94275 
L 696.32 310.18275 
L 704.42 310.18275 
L 704.42 356.08275 
L 688.22 356.08275 
L 688.22 310.18275 
M 696.32 356.08275 
L 696.32 368.32275 
" style="fill:none;stroke:#000000;stroke-linecap:round;stroke-width:1.5;"/>
   </g>
   <g id="line2d_44">
    <path clip-path="url(#p476d7c026f)" d="M 547.28 368.32275 
L 547.28 388.21275 
L 571.58 388.21275 
L 571.58 418.81275 
L 522.98 418.81275 
L 522.98 388.21275 
L 547.28 388.21275 
M 547.28 418.81275 
L 547.28 438.70275 
" style="fill:none;stroke:#000000;stroke-linecap:round;stroke-width:1.5;"/>
   </g>
   <g id="line2d_45">
    <path clip-path="url(#p476d7c026f)" d="M 547.28 438.70275 
L 547.28 458.59275 
L 571.58 458.59275 
L 571.58 489.19275 
L 522.98 489.19275 
L 522.98 458.59275 
L 547.28 458.59275 
M 571.58 458.59275 
L 522.98 489.19275 
M 543.23 463.69275 
L 527.03 463.69275 
M 543.23 468.79275 
L 527.03 468.79275 
M 547.28 489.19275 
L 547.28 509.08275 
" style="fill:none;stroke:#000000;stroke-linecap:round;stroke-width:1.5;"/>
   </g>
   <g id="line2d_46">
    <path clip-path="url(#p476d7c026f)" d="M 547.28 481.54275 
L 547.955 479.958777 
L 548.63 478.48275 
L 549.305 477.215256 
L 549.98 476.242675 
L 550.655 475.631284 
L 551.33 475.42275 
L 552.005 475.631284 
L 552.68 476.242675 
L 553.355 477.215256 
L 554.03 478.48275 
L 554.705 479.958777 
L 555.38 481.54275 
L 556.055 483.126723 
L 556.73 484.60275 
L 557.405 485.870244 
L 558.08 486.842825 
L 558.755 487.454216 
L 559.43 487.66275 
L 560.105 487.454216 
L 560.78 486.842825 
L 561.455 485.870244 
L 562.13 484.60275 
L 562.805 483.126723 
L 563.48 481.54275 
" style="fill:none;stroke:#000000;stroke-linecap:round;stroke-width:1.5;"/>
   </g>
   <g id="line2d_47">
    <path clip-path="url(#p476d7c026f)" d="M 547.28 509.08275 
L 409.58 509.08275 
L 394.19 509.08275 
M 385.28 524.38275 
L 401.48 493.78275 
M 377.18 524.38275 
L 393.38 493.78275 
M 384.47 509.08275 
L 360.98 509.08275 
L 223.28 509.08275 
" style="fill:none;stroke:#000000;stroke-linecap:round;stroke-width:1.5;"/>
   </g>
   <g id="line2d_48">
    <path clip-path="url(#p476d7c026f)" d="M 223.28 509.08275 
L 223.28 528.97275 
L 247.58 528.97275 
L 247.58 559.57275 
L 198.98 559.57275 
L 198.98 528.97275 
L 223.28 528.97275 
M 223.28 559.57275 
L 223.28 579.46275 
" style="fill:none;stroke:#000000;stroke-linecap:round;stroke-width:1.5;"/>
   </g>
   <g id="line2d_49">
    <path clip-path="url(#p476d7c026f)" d="M 223.28 579.46275 
L 271.88 579.46275 
L 320.48 579.46275 
" style="fill:none;stroke:#000000;stroke-linecap:round;stroke-width:1.5;"/>
   </g>
   <g id="line2d_50">
    <path clip-path="url(#p476d7c026f)" d="M 320.48 579.46275 
L 341.54 579.46275 
L 341.54 556.51275 
L 373.94 556.51275 
L 373.94 602.41275 
L 341.54 602.41275 
L 341.54 579.46275 
M 341.54 556.51275 
L 373.94 602.41275 
M 363.14 575.63775 
L 363.14 560.33775 
M 368.54 575.63775 
L 368.54 560.33775 
M 373.94 579.46275 
L 395 579.46275 
" style="fill:none;stroke:#000000;stroke-linecap:round;stroke-width:1.5;"/>
   </g>
   <g id="line2d_51">
    <path clip-path="url(#p476d7c026f)" d="M 349.64 594.76275 
L 347.962853 594.12525 
L 346.4 593.48775 
L 345.057948 592.85025 
L 344.028155 592.21275 
L 343.380801 591.57525 
L 343.16 590.93775 
L 343.380801 590.30025 
L 344.028155 589.66275 
L 345.057948 589.02525 
L 346.4 588.38775 
L 347.962853 587.75025 
L 349.64 587.11275 
L 351.317147 586.47525 
L 352.88 585.83775 
L 354.222052 585.20025 
L 355.251845 584.56275 
L 355.899199 583.92525 
L 356.12 583.28775 
L 355.899199 582.65025 
L 355.251845 582.01275 
L 354.222052 581.37525 
L 352.88 580.73775 
L 351.317147 580.10025 
L 349.64 579.46275 
" style="fill:none;stroke:#000000;stroke-linecap:round;stroke-width:1.5;"/>
   </g>
   <g id="line2d_52">
    <path clip-path="url(#p476d7c026f)" d="M 395 579.46275 
L 423.1475 579.46275 
M 441.3725 579.46275 
L 469.52 579.46275 
" style="fill:none;stroke:#000000;stroke-linecap:round;stroke-width:1.5;"/>
   </g>
   <g id="line2d_53">
    <path clip-path="url(#p476d7c026f)" d="M 423.1475 567.98775 
L 423.1475 590.93775 
" style="fill:none;stroke:#000000;stroke-linecap:round;stroke-width:1.5;"/>
   </g>
   <g id="line2d_54">
    <path clip-path="url(#p476d7c026f)" d="M 429.2225 573.72525 
L 429.2225 585.20025 
" style="fill:none;stroke:#000000;stroke-linecap:round;stroke-width:1.5;"/>
   </g>
   <g id="line2d_55">
    <path clip-path="url(#p476d7c026f)" d="M 435.2975 567.98775 
L 435.2975 590.93775 
" style="fill:none;stroke:#000000;stroke-linecap:round;stroke-width:1.5;"/>
   </g>
   <g id="line2d_56">
    <path clip-path="url(#p476d7c026f)" d="M 441.3725 573.72525 
L 441.3725 585.20025 
" style="fill:none;stroke:#000000;stroke-linecap:round;stroke-width:1.5;"/>
   </g>
   <g id="line2d_57">
    <path clip-path="url(#p476d7c026f)" d="M 223.28 579.46275 
L 223.28 640.66275 
L 223.28 701.86275 
" style="fill:none;stroke:#000000;stroke-linecap:round;stroke-width:1.5;"/>
   </g>
   <g id="line2d_58">
    <path clip-path="url(#p476d7c026f)" d="M 223.28 701.86275 
L 223.28 725.57775 
L 247.58 725.57775 
L 247.58 771.47775 
L 198.98 771.47775 
L 198.98 725.57775 
L 223.28 725.57775 
L 223.28 748.52775 
L 223.28 772.24275 
" style="fill:none;stroke:#000000;stroke-linecap:round;stroke-width:1.5;"/>
   </g>
   <g id="patch_18">
    <path d="M 14.3 870.4305 
L 14.3 10.8 
" style="fill:none;stroke:#000000;stroke-linecap:square;stroke-linejoin:miter;stroke-width:0.8;"/>
   </g>
   <g id="patch_19">
    <path d="M 1096.46 870.4305 
L 1096.46 10.8 
" style="fill:none;stroke:#000000;stroke-linecap:square;stroke-linejoin:miter;stroke-width:0.8;"/>
   </g>
   <g id="patch_20">
    <path d="M 14.3 870.4305 
L 1096.46 870.4305 
" style="fill:none;stroke:#000000;stroke-linecap:square;stroke-linejoin:miter;stroke-width:0.8;"/>
   </g>
   <g id="patch_21">
    <path d="M 14.3 10.8 
L 1096.46 10.8 
" style="fill:none;stroke:#000000;stroke-linecap:square;stroke-linejoin:miter;stroke-width:0.8;"/>
   </g>
   <g id="patch_22">
    <path clip-path="url(#p476d7c026f)" d="M 838.88 207.67275 
C 843.17629 207.67275 847.297194 206.060645 850.33513 203.191484 
C 853.373066 200.322322 855.08 196.430357 855.08 192.37275 
C 855.08 188.315143 853.373066 184.423178 850.33513 181.554016 
C 847.297194 178.684855 843.17629 177.07275 838.88 177.07275 
C 834.58371 177.07275 830.462806 178.684855 827.42487 181.554016 
C 824.386934 184.423178 822.68 188.315143 822.68 192.37275 
C 822.68 196.430357 824.386934 200.322322 827.42487 203.191484 
C 830.462806 206.060645 834.58371 207.67275 838.88 207.67275 
z
" style="fill:none;stroke:#000000;stroke-linejoin:miter;stroke-width:1.5;"/>
   </g>
   <g id="patch_23">
    <path clip-path="url(#p476d7c026f)" d="M 838.88 276.52275 
C 841.028145 276.52275 843.088597 275.716698 844.607565 274.282117 
C 846.126533 272.847536 846.98 270.901554 846.98 268.87275 
C 846.98 266.843946 846.126533 264.897964 844.607565 263.463383 
C 843.088597 262.028802 841.028145 261.22275 838.88 261.22275 
C 836.731855 261.22275 834.671403 262.028802 833.152435 263.463383 
C 831.633467 264.897964 830.78 266.843946 830.78 268.87275 
C 830.78 270.901554 831.633467 272.847536 833.152435 274.282117 
C 834.671403 275.716698 836.731855 276.52275 838.88 276.52275 
z
" style="fill:none;stroke:#000000;stroke-linejoin:miter;stroke-width:1.5;"/>
   </g>
   <g id="patch_24">
    <path clip-path="url(#p476d7c026f)" d="M 158.48 159.47775 
C 159.124444 159.47775 159.742579 159.235934 160.198269 158.80556 
C 160.65396 158.375186 160.91 157.791391 160.91 157.18275 
C 160.91 156.574109 160.65396 155.990314 160.198269 155.55994 
C 159.742579 155.129566 159.124444 154.88775 158.48 154.88775 
C 157.835556 154.88775 157.217421 155.129566 156.761731 155.55994 
C 156.30604 155.990314 156.05 156.574109 156.05 157.18275 
C 156.05 157.791391 156.30604 158.375186 156.761731 158.80556 
C 157.217421 159.235934 157.835556 159.47775 158.48 159.47775 
z
" style="stroke:#000000;stroke-linejoin:miter;stroke-width:1.5;"/>
   </g>
   <g id="patch_25">
    <path clip-path="url(#p476d7c026f)" d="M 231.38 169.42275 
L 223.28 180.13275 
L 215.18 169.42275 
z
" style="fill:none;stroke:#000000;stroke-linejoin:miter;stroke-width:1.5;"/>
   </g>
   <g id="patch_26">
    <path clip-path="url(#p476d7c026f)" d="M 231.38 310.18275 
L 223.28 320.89275 
L 215.18 310.18275 
z
" style="fill:none;stroke:#000000;stroke-linejoin:miter;stroke-width:1.5;"/>
   </g>
   <g id="patch_27">
    <path clip-path="url(#p476d7c026f)" d="M 380.42 169.42275 
L 372.32 180.13275 
L 364.22 169.42275 
z
" style="fill:none;stroke:#000000;stroke-linejoin:miter;stroke-width:1.5;"/>
   </g>
   <g id="patch_28">
    <path clip-path="url(#p476d7c026f)" d="M 380.42 310.18275 
L 372.32 320.89275 
L 364.22 310.18275 
z
" style="fill:none;stroke:#000000;stroke-linejoin:miter;stroke-width:1.5;"/>
   </g>
   <g id="patch_29">
    <path clip-path="url(#p476d7c026f)" d="M 223.28 411.16275 
C 225.428145 411.16275 227.488597 410.356698 229.007565 408.922117 
C 230.526533 407.487536 231.38 405.541554 231.38 403.51275 
C 231.38 401.483946 230.526533 399.537964 229.007565 398.103383 
C 227.488597 396.668802 225.428145 395.86275 223.28 395.86275 
C 221.131855 395.86275 219.071403 396.668802 217.552435 398.103383 
C 216.033467 399.537964 215.18 401.483946 215.18 403.51275 
C 215.18 405.541554 216.033467 407.487536 217.552435 408.922117 
C 219.071403 410.356698 221.131855 411.16275 223.28 411.16275 
z
" style="fill:none;stroke:#000000;stroke-linejoin:miter;stroke-width:1.5;"/>
   </g>
   <g id="patch_30">
    <path clip-path="url(#p476d7c026f)" d="M 223.28 511.37775 
C 223.924444 511.37775 224.542579 511.135934 224.998269 510.70556 
C 225.45396 510.275186 225.71 509.691391 225.71 509.08275 
C 225.71 508.474109 225.45396 507.890314 224.998269 507.45994 
C 224.542579 507.029566 223.924444 506.78775 223.28 506.78775 
C 222.635556 506.78775 222.017421 507.029566 221.561731 507.45994 
C 221.10604 507.890314 220.85 508.474109 220.85 509.08275 
C 220.85 509.691391 221.10604 510.275186 221.561731 510.70556 
C 222.017421 511.135934 222.635556 511.37775 223.28 511.37775 
z
" style="stroke:#000000;stroke-linejoin:miter;stroke-width:1.5;"/>
   </g>
   <g id="patch_31">
    <path clip-path="url(#p476d7c026f)" d="M 482.48 159.47775 
C 483.124444 159.47775 483.742579 159.235934 484.198269 158.80556 
C 484.65396 158.375186 484.91 157.791391 484.91 157.18275 
C 484.91 156.574109 484.65396 155.990314 484.198269 155.55994 
C 483.742579 155.129566 483.124444 154.88775 482.48 154.88775 
C 481.835556 154.88775 481.217421 155.129566 480.761731 155.55994 
C 480.30604 155.990314 480.05 156.574109 480.05 157.18275 
C 480.05 157.791391 480.30604 158.375186 480.761731 158.80556 
C 481.217421 159.235934 481.835556 159.47775 482.48 159.47775 
z
" style="stroke:#000000;stroke-linejoin:miter;stroke-width:1.5;"/>
   </g>
   <g id="patch_32">
    <path clip-path="url(#p476d7c026f)" d="M 555.38 169.42275 
L 547.28 180.13275 
L 539.18 169.42275 
z
" style="fill:none;stroke:#000000;stroke-linejoin:miter;stroke-width:1.5;"/>
   </g>
   <g id="patch_33">
    <path clip-path="url(#p476d7c026f)" d="M 555.38 310.18275 
L 547.28 320.89275 
L 539.18 310.18275 
z
" style="fill:none;stroke:#000000;stroke-linejoin:miter;stroke-width:1.5;"/>
   </g>
   <g id="patch_34">
    <path clip-path="url(#p476d7c026f)" d="M 704.42 169.42275 
L 696.32 180.13275 
L 688.22 169.42275 
z
" style="fill:none;stroke:#000000;stroke-linejoin:miter;stroke-width:1.5;"/>
   </g>
   <g id="patch_35">
    <path clip-path="url(#p476d7c026f)" d="M 704.42 310.18275 
L 696.32 320.89275 
L 688.22 310.18275 
z
" style="fill:none;stroke:#000000;stroke-linejoin:miter;stroke-width:1.5;"/>
   </g>
   <g id="patch_36">
    <path clip-path="url(#p476d7c026f)" d="M 547.28 411.16275 
C 549.428145 411.16275 551.488597 410.356698 553.007565 408.922117 
C 554.526533 407.487536 555.38 405.541554 555.38 403.51275 
C 555.38 401.483946 554.526533 399.537964 553.007565 398.103383 
C 551.488597 396.668802 549.428145 395.86275 547.28 395.86275 
C 545.131855 395.86275 543.071403 396.668802 541.552435 398.103383 
C 540.033467 399.537964 539.18 401.483946 539.18 403.51275 
C 539.18 405.541554 540.033467 407.487536 541.552435 408.922117 
C 543.071403 410.356698 545.131855 411.16275 547.28 411.16275 
z
" style="fill:none;stroke:#000000;stroke-linejoin:miter;stroke-width:1.5;"/>
   </g>
   <g id="patch_37">
    <path clip-path="url(#p476d7c026f)" d="M 223.28 551.92275 
C 225.428145 551.92275 227.488597 551.116698 229.007565 549.682117 
C 230.526533 548.247536 231.38 546.301554 231.38 544.27275 
C 231.38 542.243946 230.526533 540.297964 229.007565 538.863383 
C 227.488597 537.428802 225.428145 536.62275 223.28 536.62275 
C 221.131855 536.62275 219.071403 537.428802 217.552435 538.863383 
C 216.033467 540.297964 215.18 542.243946 215.18 544.27275 
C 215.18 546.301554 216.033467 548.247536 217.552435 549.682117 
C 219.071403 551.116698 221.131855 551.92275 223.28 551.92275 
z
" style="fill:none;stroke:#000000;stroke-linejoin:miter;stroke-width:1.5;"/>
   </g>
   <g id="text_16">
    <!-- PV module -->
    <g transform="translate(858.32 185.622)scale(0.08 -0.08)">
     <defs>
      <path d="M 1259 4147 
L 1259 2394 
L 2053 2394 
Q 2494 2394 2734 2622 
Q 2975 2850 2975 3272 
Q 2975 3691 2734 3919 
Q 2494 4147 2053 4147 
L 1259 4147 
z
M 628 4666 
L 2053 4666 
Q 2838 4666 3239 4311 
Q 3641 3956 3641 3272 
Q 3641 2581 3239 2228 
Q 2838 1875 2053 1875 
L 1259 1875 
L 1259 0 
L 628 0 
L 628 4666 
z
" id="DejaVuSans-50" transform="scale(0.015625)"/>
      <path d="M 1831 0 
L 50 4666 
L 709 4666 
L 2188 738 
L 3669 4666 
L 4325 4666 
L 2547 0 
L 1831 0 
z
" id="DejaVuSans-56" transform="scale(0.015625)"/>
      <path id="DejaVuSans-20" transform="scale(0.015625)"/>
      <path d="M 544 1381 
L 544 3500 
L 1119 3500 
L 1119 1403 
Q 1119 906 1312 657 
Q 1506 409 1894 409 
Q 2359 409 2629 706 
Q 2900 1003 2900 1516 
L 2900 3500 
L 3475 3500 
L 3475 0 
L 2900 0 
L 2900 538 
Q 2691 219 2414 64 
Q 2138 -91 1772 -91 
Q 1169 -91 856 284 
Q 544 659 544 1381 
z
M 1991 3584 
L 1991 3584 
z
" id="DejaVuSans-75" transform="scale(0.015625)"/>
      <path d="M 603 4863 
L 1178 4863 
L 1178 0 
L 603 0 
L 603 4863 
z
" id="DejaVuSans-6c" transform="scale(0.015625)"/>
     </defs>
     <use xlink:href="#DejaVuSans-50"/>
     <use x="60.302734" xlink:href="#DejaVuSans-56"/>
     <use x="128.710938" xlink:href="#DejaVuSans-20"/>
     <use x="160.498047" xlink:href="#DejaVuSans-6d"/>
     <use x="257.910156" xlink:href="#DejaVuSans-6f"/>
     <use x="319.091797" xlink:href="#DejaVuSans-64"/>
     <use x="382.568359" xlink:href="#DejaVuSans-75"/>
     <use x="445.947266" xlink:href="#DejaVuSans-6c"/>
     <use x="473.730469" xlink:href="#DejaVuSans-65"/>
    </g>
    <!-- PVName -->
    <g transform="translate(858.32 194.58025)scale(0.08 -0.08)">
     <use xlink:href="#DejaVuSans-50"/>
     <use x="60.302734" xlink:href="#DejaVuSans-56"/>
     <use x="128.710938" xlink:href="#DejaVuSans-4e"/>
     <use x="203.515625" xlink:href="#DejaVuSans-61"/>
     <use x="264.794922" xlink:href="#DejaVuSans-6d"/>
     <use x="362.207031" xlink:href="#DejaVuSans-65"/>
    </g>
    <!-- 39.0V -->
    <g transform="translate(858.32 203.5385)scale(0.08 -0.08)">
     <defs>
      <path d="M 2597 2516 
Q 3050 2419 3304 2112 
Q 3559 1806 3559 1356 
Q 3559 666 3084 287 
Q 2609 -91 1734 -91 
Q 1441 -91 1130 -33 
Q 819 25 488 141 
L 488 750 
Q 750 597 1062 519 
Q 1375 441 1716 441 
Q 2309 441 2620 675 
Q 2931 909 2931 1356 
Q 2931 1769 2642 2001 
Q 2353 2234 1838 2234 
L 1294 2234 
L 1294 2753 
L 1863 2753 
Q 2328 2753 2575 2939 
Q 2822 3125 2822 3475 
Q 2822 3834 2567 4026 
Q 2313 4219 1838 4219 
Q 1578 4219 1281 4162 
Q 984 4106 628 3988 
L 628 4550 
Q 988 4650 1302 4700 
Q 1616 4750 1894 4750 
Q 2613 4750 3031 4423 
Q 3450 4097 3450 3541 
Q 3450 3153 3228 2886 
Q 3006 2619 2597 2516 
z
" id="DejaVuSans-33" transform="scale(0.015625)"/>
      <path d="M 684 794 
L 1344 794 
L 1344 0 
L 684 0 
L 684 794 
z
" id="DejaVuSans-2e" transform="scale(0.015625)"/>
     </defs>
     <use xlink:href="#DejaVuSans-33"/>
     <use x="63.623047" xlink:href="#DejaVuSans-39"/>
     <use x="127.246094" xlink:href="#DejaVuSans-2e"/>
     <use x="159.033203" xlink:href="#DejaVuSans-30"/>
     <use x="222.65625" xlink:href="#DejaVuSans-56"/>
    </g>
   </g>
   <g id="text_17">
    <!-- Combiner Box -->
    <g transform="translate(866.42 271.08025)scale(0.08 -0.08)">
     <defs>
      <path d="M 4122 4306 
L 4122 3641 
Q 3803 3938 3442 4084 
Q 3081 4231 2675 4231 
Q 1875 4231 1450 3742 
Q 1025 3253 1025 2328 
Q 1025 1406 1450 917 
Q 1875 428 2675 428 
Q 3081 428 3442 575 
Q 3803 722 4122 1019 
L 4122 359 
Q 3791 134 3420 21 
Q 3050 -91 2638 -91 
Q 1578 -91 968 557 
Q 359 1206 359 2328 
Q 359 3453 968 4101 
Q 1578 4750 2638 4750 
Q 3056 4750 3426 4639 
Q 3797 4528 4122 4306 
z
" id="DejaVuSans-43" transform="scale(0.015625)"/>
      <path d="M 3116 1747 
Q 3116 2381 2855 2742 
Q 2594 3103 2138 3103 
Q 1681 3103 1420 2742 
Q 1159 2381 1159 1747 
Q 1159 1113 1420 752 
Q 1681 391 2138 391 
Q 2594 391 2855 752 
Q 3116 1113 3116 1747 
z
M 1159 2969 
Q 1341 3281 1617 3432 
Q 1894 3584 2278 3584 
Q 2916 3584 3314 3078 
Q 3713 2572 3713 1747 
Q 3713 922 3314 415 
Q 2916 -91 2278 -91 
Q 1894 -91 1617 61 
Q 1341 213 1159 525 
L 1159 0 
L 581 0 
L 581 4863 
L 1159 4863 
L 1159 2969 
z
" id="DejaVuSans-62" transform="scale(0.015625)"/>
      <path d="M 1259 2228 
L 1259 519 
L 2272 519 
Q 2781 519 3026 730 
Q 3272 941 3272 1375 
Q 3272 1813 3026 2020 
Q 2781 2228 2272 2228 
L 1259 2228 
z
M 1259 4147 
L 1259 2741 
L 2194 2741 
Q 2656 2741 2882 2914 
Q 3109 3088 3109 3444 
Q 3109 3797 2882 3972 
Q 2656 4147 2194 4147 
L 1259 4147 
z
M 628 4666 
L 2241 4666 
Q 2963 4666 3353 4366 
Q 3744 4066 3744 3513 
Q 3744 3084 3544 2831 
Q 3344 2578 2956 2516 
Q 3422 2416 3680 2098 
Q 3938 1781 3938 1306 
Q 3938 681 3513 340 
Q 3088 0 2303 0 
L 628 0 
L 628 4666 
z
" id="DejaVuSans-42" transform="scale(0.015625)"/>
      <path d="M 3513 3500 
L 2247 1797 
L 3578 0 
L 2900 0 
L 1881 1375 
L 863 0 
L 184 0 
L 1544 1831 
L 300 3500 
L 978 3500 
L 1906 2253 
L 2834 3500 
L 3513 3500 
z
" id="DejaVuSans-78" transform="scale(0.015625)"/>
     </defs>
     <use xlink:href="#DejaVuSans-43"/>
     <use x="69.824219" xlink:href="#DejaVuSans-6f"/>
     <use x="131.005859" xlink:href="#DejaVuSans-6d"/>
     <use x="228.417969" xlink:href="#DejaVuSans-62"/>
     <use x="291.894531" xlink:href="#DejaVuSans-69"/>
     <use x="319.677734" xlink:href="#DejaVuSans-6e"/>
     <use x="383.056641" xlink:href="#DejaVuSans-65"/>
     <use x="444.580078" xlink:href="#DejaVuSans-72"/>
     <use x="485.693359" xlink:href="#DejaVuSans-20"/>
     <use x="517.480469" xlink:href="#DejaVuSans-42"/>
     <use x="586.083984" xlink:href="#DejaVuSans-6f"/>
     <use x="644.140625" xlink:href="#DejaVuSans-78"/>
    </g>
   </g>
   <g id="text_18">
    <!-- Inverter DCAC type: -->
    <g transform="translate(866.42 343.101125)scale(0.08 -0.08)">
     <defs>
      <path d="M 628 4666 
L 1259 4666 
L 1259 0 
L 628 0 
L 628 4666 
z
" id="DejaVuSans-49" transform="scale(0.015625)"/>
      <path d="M 191 3500 
L 800 3500 
L 1894 563 
L 2988 3500 
L 3597 3500 
L 2284 0 
L 1503 0 
L 191 3500 
z
" id="DejaVuSans-76" transform="scale(0.015625)"/>
      <path d="M 1172 4494 
L 1172 3500 
L 2356 3500 
L 2356 3053 
L 1172 3053 
L 1172 1153 
Q 1172 725 1289 603 
Q 1406 481 1766 481 
L 2356 481 
L 2356 0 
L 1766 0 
Q 1100 0 847 248 
Q 594 497 594 1153 
L 594 3053 
L 172 3053 
L 172 3500 
L 594 3500 
L 594 4494 
L 1172 4494 
z
" id="DejaVuSans-74" transform="scale(0.015625)"/>
      <path d="M 1259 4147 
L 1259 519 
L 2022 519 
Q 2988 519 3436 956 
Q 3884 1394 3884 2338 
Q 3884 3275 3436 3711 
Q 2988 4147 2022 4147 
L 1259 4147 
z
M 628 4666 
L 1925 4666 
Q 3281 4666 3915 4102 
Q 4550 3538 4550 2338 
Q 4550 1131 3912 565 
Q 3275 0 1925 0 
L 628 0 
L 628 4666 
z
" id="DejaVuSans-44" transform="scale(0.015625)"/>
      <path d="M 2059 -325 
Q 1816 -950 1584 -1140 
Q 1353 -1331 966 -1331 
L 506 -1331 
L 506 -850 
L 844 -850 
Q 1081 -850 1212 -737 
Q 1344 -625 1503 -206 
L 1606 56 
L 191 3500 
L 800 3500 
L 1894 763 
L 2988 3500 
L 3597 3500 
L 2059 -325 
z
" id="DejaVuSans-79" transform="scale(0.015625)"/>
      <path d="M 1159 525 
L 1159 -1331 
L 581 -1331 
L 581 3500 
L 1159 3500 
L 1159 2969 
Q 1341 3281 1617 3432 
Q 1894 3584 2278 3584 
Q 2916 3584 3314 3078 
Q 3713 2572 3713 1747 
Q 3713 922 3314 415 
Q 2916 -91 2278 -91 
Q 1894 -91 1617 61 
Q 1341 213 1159 525 
z
M 3116 1747 
Q 3116 2381 2855 2742 
Q 2594 3103 2138 3103 
Q 1681 3103 1420 2742 
Q 1159 2381 1159 1747 
Q 1159 1113 1420 752 
Q 1681 391 2138 391 
Q 2594 391 2855 752 
Q 3116 1113 3116 1747 
z
" id="DejaVuSans-70" transform="scale(0.015625)"/>
      <path d="M 750 794 
L 1409 794 
L 1409 0 
L 750 0 
L 750 794 
z
M 750 3309 
L 1409 3309 
L 1409 2516 
L 750 2516 
L 750 3309 
z
" id="DejaVuSans-3a" transform="scale(0.015625)"/>
     </defs>
     <use xlink:href="#DejaVuSans-49"/>
     <use x="29.492188" xlink:href="#DejaVuSans-6e"/>
     <use x="92.871094" xlink:href="#DejaVuSans-76"/>
     <use x="152.050781" xlink:href="#DejaVuSans-65"/>
     <use x="213.574219" xlink:href="#DejaVuSans-72"/>
     <use x="254.6875" xlink:href="#DejaVuSans-74"/>
     <use x="293.896484" xlink:href="#DejaVuSans-65"/>
     <use x="355.419922" xlink:href="#DejaVuSans-72"/>
     <use x="396.533203" xlink:href="#DejaVuSans-20"/>
     <use x="428.320312" xlink:href="#DejaVuSans-44"/>
     <use x="505.322266" xlink:href="#DejaVuSans-43"/>
     <use x="575.146484" xlink:href="#DejaVuSans-41"/>
     <use x="641.804688" xlink:href="#DejaVuSans-43"/>
     <use x="711.628906" xlink:href="#DejaVuSans-20"/>
     <use x="743.416016" xlink:href="#DejaVuSans-74"/>
     <use x="782.625" xlink:href="#DejaVuSans-79"/>
     <use x="841.804688" xlink:href="#DejaVuSans-70"/>
     <use x="905.28125" xlink:href="#DejaVuSans-65"/>
     <use x="966.804688" xlink:href="#DejaVuSans-3a"/>
    </g>
    <!-- InvName -->
    <g transform="translate(866.42 352.059375)scale(0.08 -0.08)">
     <use xlink:href="#DejaVuSans-49"/>
     <use x="29.492188" xlink:href="#DejaVuSans-6e"/>
     <use x="92.871094" xlink:href="#DejaVuSans-76"/>
     <use x="152.050781" xlink:href="#DejaVuSans-4e"/>
     <use x="226.855469" xlink:href="#DejaVuSans-61"/>
     <use x="288.134766" xlink:href="#DejaVuSans-6d"/>
     <use x="385.546875" xlink:href="#DejaVuSans-65"/>
    </g>
   </g>
   <g id="text_19">
    <!-- Inverter ACDC type: -->
    <g transform="translate(866.42 419.601125)scale(0.08 -0.08)">
     <use xlink:href="#DejaVuSans-49"/>
     <use x="29.492188" xlink:href="#DejaVuSans-6e"/>
     <use x="92.871094" xlink:href="#DejaVuSans-76"/>
     <use x="152.050781" xlink:href="#DejaVuSans-65"/>
     <use x="213.574219" xlink:href="#DejaVuSans-72"/>
     <use x="254.6875" xlink:href="#DejaVuSans-74"/>
     <use x="293.896484" xlink:href="#DejaVuSans-65"/>
     <use x="355.419922" xlink:href="#DejaVuSans-72"/>
     <use x="396.533203" xlink:href="#DejaVuSans-20"/>
     <use x="428.320312" xlink:href="#DejaVuSans-41"/>
     <use x="494.978516" xlink:href="#DejaVuSans-43"/>
     <use x="564.802734" xlink:href="#DejaVuSans-44"/>
     <use x="641.804688" xlink:href="#DejaVuSans-43"/>
     <use x="711.628906" xlink:href="#DejaVuSans-20"/>
     <use x="743.416016" xlink:href="#DejaVuSans-74"/>
     <use x="782.625" xlink:href="#DejaVuSans-79"/>
     <use x="841.804688" xlink:href="#DejaVuSans-70"/>
     <use x="905.28125" xlink:href="#DejaVuSans-65"/>
     <use x="966.804688" xlink:href="#DejaVuSans-3a"/>
    </g>
    <!-- InvName -->
    <g transform="translate(866.42 428.559375)scale(0.08 -0.08)">
     <use xlink:href="#DejaVuSans-49"/>
     <use x="29.492188" xlink:href="#DejaVuSans-6e"/>
     <use x="92.871094" xlink:href="#DejaVuSans-76"/>
     <use x="152.050781" xlink:href="#DejaVuSans-4e"/>
     <use x="226.855469" xlink:href="#DejaVuSans-61"/>
     <use x="288.134766" xlink:href="#DejaVuSans-6d"/>
     <use x="385.546875" xlink:href="#DejaVuSans-65"/>
    </g>
   </g>
   <g id="text_20">
    <!-- DCDC Converter type: -->
    <g transform="translate(866.42 496.101125)scale(0.08 -0.08)">
     <use xlink:href="#DejaVuSans-44"/>
     <use x="77.001953" xlink:href="#DejaVuSans-43"/>
     <use x="146.826172" xlink:href="#DejaVuSans-44"/>
     <use x="223.828125" xlink:href="#DejaVuSans-43"/>
     <use x="293.652344" xlink:href="#DejaVuSans-20"/>
     <use x="325.439453" xlink:href="#DejaVuSans-43"/>
     <use x="395.263672" xlink:href="#DejaVuSans-6f"/>
     <use x="456.445312" xlink:href="#DejaVuSans-6e"/>
     <use x="519.824219" xlink:href="#DejaVuSans-76"/>
     <use x="579.003906" xlink:href="#DejaVuSans-65"/>
     <use x="640.527344" xlink:href="#DejaVuSans-72"/>
     <use x="681.640625" xlink:href="#DejaVuSans-74"/>
     <use x="720.849609" xlink:href="#DejaVuSans-65"/>
     <use x="782.373047" xlink:href="#DejaVuSans-72"/>
     <use x="823.486328" xlink:href="#DejaVuSans-20"/>
     <use x="855.273438" xlink:href="#DejaVuSans-74"/>
     <use x="894.482422" xlink:href="#DejaVuSans-79"/>
     <use x="953.662109" xlink:href="#DejaVuSans-70"/>
     <use x="1017.138672" xlink:href="#DejaVuSans-65"/>
     <use x="1078.662109" xlink:href="#DejaVuSans-3a"/>
    </g>
    <!-- InvName -->
    <g transform="translate(866.42 505.059375)scale(0.08 -0.08)">
     <use xlink:href="#DejaVuSans-49"/>
     <use x="29.492188" xlink:href="#DejaVuSans-6e"/>
     <use x="92.871094" xlink:href="#DejaVuSans-76"/>
     <use x="152.050781" xlink:href="#DejaVuSans-4e"/>
     <use x="226.855469" xlink:href="#DejaVuSans-61"/>
     <use x="288.134766" xlink:href="#DejaVuSans-6d"/>
     <use x="385.546875" xlink:href="#DejaVuSans-65"/>
    </g>
   </g>
   <g id="text_21">
    <!-- Battery type: -->
    <g transform="translate(854.27 572.601125)scale(0.08 -0.08)">
     <use xlink:href="#DejaVuSans-42"/>
     <use x="68.603516" xlink:href="#DejaVuSans-61"/>
     <use x="129.882812" xlink:href="#DejaVuSans-74"/>
     <use x="169.091797" xlink:href="#DejaVuSans-74"/>
     <use x="208.300781" xlink:href="#DejaVuSans-65"/>
     <use x="269.824219" xlink:href="#DejaVuSans-72"/>
     <use x="310.9375" xlink:href="#DejaVuSans-79"/>
     <use x="370.117188" xlink:href="#DejaVuSans-20"/>
     <use x="401.904297" xlink:href="#DejaVuSans-74"/>
     <use x="441.113281" xlink:href="#DejaVuSans-79"/>
     <use x="500.292969" xlink:href="#DejaVuSans-70"/>
     <use x="563.769531" xlink:href="#DejaVuSans-65"/>
     <use x="625.292969" xlink:href="#DejaVuSans-3a"/>
    </g>
    <!-- battery -->
    <g transform="translate(854.27 581.559375)scale(0.08 -0.08)">
     <use xlink:href="#DejaVuSans-62"/>
     <use x="63.476562" xlink:href="#DejaVuSans-61"/>
     <use x="124.755859" xlink:href="#DejaVuSans-74"/>
     <use x="163.964844" xlink:href="#DejaVuSans-74"/>
     <use x="203.173828" xlink:href="#DejaVuSans-65"/>
     <use x="264.697266" xlink:href="#DejaVuSans-72"/>
     <use x="305.810547" xlink:href="#DejaVuSans-79"/>
    </g>
   </g>
   <g id="text_22">
    <!-- Cable type: -->
    <g transform="translate(858.32 659.811125)scale(0.08 -0.08)">
     <use xlink:href="#DejaVuSans-43"/>
     <use x="69.824219" xlink:href="#DejaVuSans-61"/>
     <use x="131.103516" xlink:href="#DejaVuSans-62"/>
     <use x="194.580078" xlink:href="#DejaVuSans-6c"/>
     <use x="222.363281" xlink:href="#DejaVuSans-65"/>
     <use x="283.886719" xlink:href="#DejaVuSans-20"/>
     <use x="315.673828" xlink:href="#DejaVuSans-74"/>
     <use x="354.882812" xlink:href="#DejaVuSans-79"/>
     <use x="414.0625" xlink:href="#DejaVuSans-70"/>
     <use x="477.539062" xlink:href="#DejaVuSans-65"/>
     <use x="539.0625" xlink:href="#DejaVuSans-3a"/>
    </g>
    <!-- Cable -->
    <g transform="translate(858.32 668.769375)scale(0.08 -0.08)">
     <use xlink:href="#DejaVuSans-43"/>
     <use x="69.824219" xlink:href="#DejaVuSans-61"/>
     <use x="131.103516" xlink:href="#DejaVuSans-62"/>
     <use x="194.580078" xlink:href="#DejaVuSans-6c"/>
     <use x="222.363281" xlink:href="#DejaVuSans-65"/>
    </g>
   </g>
   <g id="text_23">
    <!-- Electrical scheme  ProjName -->
    <g transform="translate(158.48 130.99775)scale(0.16 -0.16)">
     <defs>
      <path d="M 628 4666 
L 3578 4666 
L 3578 4134 
L 1259 4134 
L 1259 2753 
L 3481 2753 
L 3481 2222 
L 1259 2222 
L 1259 531 
L 3634 531 
L 3634 0 
L 628 0 
L 628 4666 
z
" id="DejaVuSans-45" transform="scale(0.015625)"/>
     </defs>
     <use xlink:href="#DejaVuSans-45"/>
     <use x="63.183594" xlink:href="#DejaVuSans-6c"/>
     <use x="90.966797" xlink:href="#DejaVuSans-65"/>
     <use x="152.490234" xlink:href="#DejaVuSans-63"/>
     <use x="207.470703" xlink:href="#DejaVuSans-74"/>
     <use x="246.679688" xlink:href="#DejaVuSans-72"/>
     <use x="287.792969" xlink:href="#DejaVuSans-69"/>
     <use x="315.576172" xlink:href="#DejaVuSans-63"/>
     <use x="370.556641" xlink:href="#DejaVuSans-61"/>
     <use x="431.835938" xlink:href="#DejaVuSans-6c"/>
     <use x="459.619141" xlink:href="#DejaVuSans-20"/>
     <use x="491.40625" xlink:href="#DejaVuSans-73"/>
     <use x="543.505859" xlink:href="#DejaVuSans-63"/>
     <use x="598.486328" xlink:href="#DejaVuSans-68"/>
     <use x="661.865234" xlink:href="#DejaVuSans-65"/>
     <use x="723.388672" xlink:href="#DejaVuSans-6d"/>
     <use x="820.800781" xlink:href="#DejaVuSans-65"/>
     <use x="882.324219" xlink:href="#DejaVuSans-20"/>
     <use x="914.111328" xlink:href="#DejaVuSans-20"/>
     <use x="945.898438" xlink:href="#DejaVuSans-50"/>
     <use x="1004.451172" xlink:href="#DejaVuSans-72"/>
     <use x="1043.314453" xlink:href="#DejaVuSans-6f"/>
     <use x="1104.496094" xlink:href="#DejaVuSans-6a"/>
     <use x="1132.279297" xlink:href="#DejaVuSans-4e"/>
     <use x="1207.083984" xlink:href="#DejaVuSans-61"/>
     <use x="1268.363281" xlink:href="#DejaVuSans-6d"/>
     <use x="1365.775391" xlink:href="#DejaVuSans-65"/>
    </g>
   </g>
   <g id="text_24">
    <!-- GND -->
    <g transform="translate(149.308125 185.9055)scale(0.08 -0.08)">
     <defs>
      <path d="M 3809 666 
L 3809 1919 
L 2778 1919 
L 2778 2438 
L 4434 2438 
L 4434 434 
Q 4069 175 3628 42 
Q 3188 -91 2688 -91 
Q 1594 -91 976 548 
Q 359 1188 359 2328 
Q 359 3472 976 4111 
Q 1594 4750 2688 4750 
Q 3144 4750 3555 4637 
Q 3966 4525 4313 4306 
L 4313 3634 
Q 3963 3931 3569 4081 
Q 3175 4231 2741 4231 
Q 1884 4231 1454 3753 
Q 1025 3275 1025 2328 
Q 1025 1384 1454 906 
Q 1884 428 2741 428 
Q 3075 428 3337 486 
Q 3600 544 3809 666 
z
" id="DejaVuSans-47" transform="scale(0.015625)"/>
     </defs>
     <use xlink:href="#DejaVuSans-47"/>
     <use x="77.490234" xlink:href="#DejaVuSans-4e"/>
     <use x="152.294922" xlink:href="#DejaVuSans-44"/>
    </g>
   </g>
   <g id="text_25">
    <!-- BB  1 -->
    <g transform="translate(142.28 259.51775)scale(0.16 -0.16)">
     <use xlink:href="#DejaVuSans-42"/>
     <use x="68.603516" xlink:href="#DejaVuSans-42"/>
     <use x="137.207031" xlink:href="#DejaVuSans-20"/>
     <use x="168.994141" xlink:href="#DejaVuSans-20"/>
     <use x="200.78125" xlink:href="#DejaVuSans-31"/>
    </g>
   </g>
   <g id="text_26">
    <!-- PV1-1 -->
    <g transform="translate(188.5775 194.58025)scale(0.08 -0.08)">
     <defs>
      <path d="M 313 2009 
L 1997 2009 
L 1997 1497 
L 313 1497 
L 313 2009 
z
" id="DejaVuSans-2d" transform="scale(0.015625)"/>
     </defs>
     <use xlink:href="#DejaVuSans-50"/>
     <use x="60.302734" xlink:href="#DejaVuSans-56"/>
     <use x="128.710938" xlink:href="#DejaVuSans-31"/>
     <use x="192.333984" xlink:href="#DejaVuSans-2d"/>
     <use x="228.417969" xlink:href="#DejaVuSans-31"/>
    </g>
   </g>
   <g id="text_27">
    <!-- PV1-25 -->
    <g transform="translate(183.4875 335.34025)scale(0.08 -0.08)">
     <defs>
      <path d="M 691 4666 
L 3169 4666 
L 3169 4134 
L 1269 4134 
L 1269 2991 
Q 1406 3038 1543 3061 
Q 1681 3084 1819 3084 
Q 2600 3084 3056 2656 
Q 3513 2228 3513 1497 
Q 3513 744 3044 326 
Q 2575 -91 1722 -91 
Q 1428 -91 1123 -41 
Q 819 9 494 109 
L 494 744 
Q 775 591 1075 516 
Q 1375 441 1709 441 
Q 2250 441 2565 725 
Q 2881 1009 2881 1497 
Q 2881 1984 2565 2268 
Q 2250 2553 1709 2553 
Q 1456 2553 1204 2497 
Q 953 2441 691 2322 
L 691 4666 
z
" id="DejaVuSans-35" transform="scale(0.015625)"/>
     </defs>
     <use xlink:href="#DejaVuSans-50"/>
     <use x="60.302734" xlink:href="#DejaVuSans-56"/>
     <use x="128.710938" xlink:href="#DejaVuSans-31"/>
     <use x="192.333984" xlink:href="#DejaVuSans-2d"/>
     <use x="228.417969" xlink:href="#DejaVuSans-32"/>
     <use x="292.041016" xlink:href="#DejaVuSans-35"/>
    </g>
   </g>
   <g id="text_28">
    <!-- PV10-1 -->
    <g transform="translate(332.5275 194.58025)scale(0.08 -0.08)">
     <use xlink:href="#DejaVuSans-50"/>
     <use x="60.302734" xlink:href="#DejaVuSans-56"/>
     <use x="128.710938" xlink:href="#DejaVuSans-31"/>
     <use x="192.333984" xlink:href="#DejaVuSans-30"/>
     <use x="255.957031" xlink:href="#DejaVuSans-2d"/>
     <use x="292.041016" xlink:href="#DejaVuSans-31"/>
    </g>
   </g>
   <g id="text_29">
    <!-- PV10-25 -->
    <g transform="translate(327.4375 335.34025)scale(0.08 -0.08)">
     <use xlink:href="#DejaVuSans-50"/>
     <use x="60.302734" xlink:href="#DejaVuSans-56"/>
     <use x="128.710938" xlink:href="#DejaVuSans-31"/>
     <use x="192.333984" xlink:href="#DejaVuSans-30"/>
     <use x="255.957031" xlink:href="#DejaVuSans-2d"/>
     <use x="292.041016" xlink:href="#DejaVuSans-32"/>
     <use x="355.664062" xlink:href="#DejaVuSans-35"/>
    </g>
   </g>
   <g id="text_30">
    <!-- Combiner Box 1 -->
    <g transform="translate(131.84 396.762)scale(0.08 -0.08)">
     <use xlink:href="#DejaVuSans-43"/>
     <use x="69.824219" xlink:href="#DejaVuSans-6f"/>
     <use x="131.005859" xlink:href="#DejaVuSans-6d"/>
     <use x="228.417969" xlink:href="#DejaVuSans-62"/>
     <use x="291.894531" xlink:href="#DejaVuSans-69"/>
     <use x="319.677734" xlink:href="#DejaVuSans-6e"/>
     <use x="383.056641" xlink:href="#DejaVuSans-65"/>
     <use x="444.580078" xlink:href="#DejaVuSans-72"/>
     <use x="485.693359" xlink:href="#DejaVuSans-20"/>
     <use x="517.480469" xlink:href="#DejaVuSans-42"/>
     <use x="586.083984" xlink:href="#DejaVuSans-6f"/>
     <use x="644.140625" xlink:href="#DejaVuSans-78"/>
     <use x="703.320312" xlink:href="#DejaVuSans-20"/>
     <use x="735.107422" xlink:href="#DejaVuSans-31"/>
    </g>
    <!-- Inputs: 10 -->
    <g transform="translate(155.44 405.72025)scale(0.08 -0.08)">
     <use xlink:href="#DejaVuSans-49"/>
     <use x="29.492188" xlink:href="#DejaVuSans-6e"/>
     <use x="92.871094" xlink:href="#DejaVuSans-70"/>
     <use x="156.347656" xlink:href="#DejaVuSans-75"/>
     <use x="219.726562" xlink:href="#DejaVuSans-74"/>
     <use x="258.935547" xlink:href="#DejaVuSans-73"/>
     <use x="311.035156" xlink:href="#DejaVuSans-3a"/>
     <use x="344.726562" xlink:href="#DejaVuSans-20"/>
     <use x="376.513672" xlink:href="#DejaVuSans-31"/>
     <use x="440.136719" xlink:href="#DejaVuSans-30"/>
    </g>
    <!-- Outputs: 1 -->
    <g transform="translate(153.45625 414.6785)scale(0.08 -0.08)">
     <defs>
      <path d="M 2522 4238 
Q 1834 4238 1429 3725 
Q 1025 3213 1025 2328 
Q 1025 1447 1429 934 
Q 1834 422 2522 422 
Q 3209 422 3611 934 
Q 4013 1447 4013 2328 
Q 4013 3213 3611 3725 
Q 3209 4238 2522 4238 
z
M 2522 4750 
Q 3503 4750 4090 4092 
Q 4678 3434 4678 2328 
Q 4678 1225 4090 567 
Q 3503 -91 2522 -91 
Q 1538 -91 948 565 
Q 359 1222 359 2328 
Q 359 3434 948 4092 
Q 1538 4750 2522 4750 
z
" id="DejaVuSans-4f" transform="scale(0.015625)"/>
     </defs>
     <use xlink:href="#DejaVuSans-4f"/>
     <use x="78.710938" xlink:href="#DejaVuSans-75"/>
     <use x="142.089844" xlink:href="#DejaVuSans-74"/>
     <use x="181.298828" xlink:href="#DejaVuSans-70"/>
     <use x="244.775391" xlink:href="#DejaVuSans-75"/>
     <use x="308.154297" xlink:href="#DejaVuSans-74"/>
     <use x="347.363281" xlink:href="#DejaVuSans-73"/>
     <use x="399.462891" xlink:href="#DejaVuSans-3a"/>
     <use x="433.154297" xlink:href="#DejaVuSans-20"/>
     <use x="464.941406" xlink:href="#DejaVuSans-31"/>
    </g>
   </g>
   <g id="text_31">
    <!-- In 975 V / 9 A -->
    <g transform="translate(228.14 384.040321)scale(0.064 -0.064)">
     <defs>
      <path d="M 525 4666 
L 3525 4666 
L 3525 4397 
L 1831 0 
L 1172 0 
L 2766 4134 
L 525 4134 
L 525 4666 
z
" id="DejaVuSans-37" transform="scale(0.015625)"/>
      <path d="M 1625 4666 
L 2156 4666 
L 531 -594 
L 0 -594 
L 1625 4666 
z
" id="DejaVuSans-2f" transform="scale(0.015625)"/>
     </defs>
     <use xlink:href="#DejaVuSans-49"/>
     <use x="29.492188" xlink:href="#DejaVuSans-6e"/>
     <use x="92.871094" xlink:href="#DejaVuSans-20"/>
     <use x="124.658203" xlink:href="#DejaVuSans-39"/>
     <use x="188.28125" xlink:href="#DejaVuSans-37"/>
     <use x="251.904297" xlink:href="#DejaVuSans-35"/>
     <use x="315.527344" xlink:href="#DejaVuSans-20"/>
     <use x="347.314453" xlink:href="#DejaVuSans-56"/>
     <use x="415.722656" xlink:href="#DejaVuSans-20"/>
     <use x="447.509766" xlink:href="#DejaVuSans-2f"/>
     <use x="481.201172" xlink:href="#DejaVuSans-20"/>
     <use x="512.988281" xlink:href="#DejaVuSans-39"/>
     <use x="576.611328" xlink:href="#DejaVuSans-20"/>
     <use x="608.398438" xlink:href="#DejaVuSans-41"/>
    </g>
   </g>
   <g id="text_32">
    <!-- Out 975 V / 90 A -->
    <g transform="translate(228.14 426.517179)scale(0.064 -0.064)">
     <use xlink:href="#DejaVuSans-4f"/>
     <use x="78.710938" xlink:href="#DejaVuSans-75"/>
     <use x="142.089844" xlink:href="#DejaVuSans-74"/>
     <use x="181.298828" xlink:href="#DejaVuSans-20"/>
     <use x="213.085938" xlink:href="#DejaVuSans-39"/>
     <use x="276.708984" xlink:href="#DejaVuSans-37"/>
     <use x="340.332031" xlink:href="#DejaVuSans-35"/>
     <use x="403.955078" xlink:href="#DejaVuSans-20"/>
     <use x="435.742188" xlink:href="#DejaVuSans-56"/>
     <use x="504.150391" xlink:href="#DejaVuSans-20"/>
     <use x="535.9375" xlink:href="#DejaVuSans-2f"/>
     <use x="569.628906" xlink:href="#DejaVuSans-20"/>
     <use x="601.416016" xlink:href="#DejaVuSans-39"/>
     <use x="665.039062" xlink:href="#DejaVuSans-30"/>
     <use x="728.662109" xlink:href="#DejaVuSans-20"/>
     <use x="760.449219" xlink:href="#DejaVuSans-41"/>
    </g>
   </g>
   <g id="text_33">
    <!-- Inverter Nr 1 -->
    <g transform="translate(144.5675 467.142)scale(0.08 -0.08)">
     <use xlink:href="#DejaVuSans-49"/>
     <use x="29.492188" xlink:href="#DejaVuSans-6e"/>
     <use x="92.871094" xlink:href="#DejaVuSans-76"/>
     <use x="152.050781" xlink:href="#DejaVuSans-65"/>
     <use x="213.574219" xlink:href="#DejaVuSans-72"/>
     <use x="254.6875" xlink:href="#DejaVuSans-74"/>
     <use x="293.896484" xlink:href="#DejaVuSans-65"/>
     <use x="355.419922" xlink:href="#DejaVuSans-72"/>
     <use x="396.533203" xlink:href="#DejaVuSans-20"/>
     <use x="428.320312" xlink:href="#DejaVuSans-4e"/>
     <use x="503.125" xlink:href="#DejaVuSans-72"/>
     <use x="544.238281" xlink:href="#DejaVuSans-20"/>
     <use x="576.025391" xlink:href="#DejaVuSans-31"/>
    </g>
    <!-- Max Inputs: 1 -->
    <g transform="translate(141.4475 476.10025)scale(0.08 -0.08)">
     <use xlink:href="#DejaVuSans-4d"/>
     <use x="86.279297" xlink:href="#DejaVuSans-61"/>
     <use x="147.558594" xlink:href="#DejaVuSans-78"/>
     <use x="206.738281" xlink:href="#DejaVuSans-20"/>
     <use x="238.525391" xlink:href="#DejaVuSans-49"/>
     <use x="268.017578" xlink:href="#DejaVuSans-6e"/>
     <use x="331.396484" xlink:href="#DejaVuSans-70"/>
     <use x="394.873047" xlink:href="#DejaVuSans-75"/>
     <use x="458.251953" xlink:href="#DejaVuSans-74"/>
     <use x="497.460938" xlink:href="#DejaVuSans-73"/>
     <use x="549.560547" xlink:href="#DejaVuSans-3a"/>
     <use x="583.251953" xlink:href="#DejaVuSans-20"/>
     <use x="615.039062" xlink:href="#DejaVuSans-31"/>
    </g>
    <!-- Used Inputs: 1 -->
    <g transform="translate(137.96375 485.0585)scale(0.08 -0.08)">
     <defs>
      <path d="M 556 4666 
L 1191 4666 
L 1191 1831 
Q 1191 1081 1462 751 
Q 1734 422 2344 422 
Q 2950 422 3222 751 
Q 3494 1081 3494 1831 
L 3494 4666 
L 4128 4666 
L 4128 1753 
Q 4128 841 3676 375 
Q 3225 -91 2344 -91 
Q 1459 -91 1007 375 
Q 556 841 556 1753 
L 556 4666 
z
" id="DejaVuSans-55" transform="scale(0.015625)"/>
     </defs>
     <use xlink:href="#DejaVuSans-55"/>
     <use x="73.193359" xlink:href="#DejaVuSans-73"/>
     <use x="125.292969" xlink:href="#DejaVuSans-65"/>
     <use x="186.816406" xlink:href="#DejaVuSans-64"/>
     <use x="250.292969" xlink:href="#DejaVuSans-20"/>
     <use x="282.080078" xlink:href="#DejaVuSans-49"/>
     <use x="311.572266" xlink:href="#DejaVuSans-6e"/>
     <use x="374.951172" xlink:href="#DejaVuSans-70"/>
     <use x="438.427734" xlink:href="#DejaVuSans-75"/>
     <use x="501.806641" xlink:href="#DejaVuSans-74"/>
     <use x="541.015625" xlink:href="#DejaVuSans-73"/>
     <use x="593.115234" xlink:href="#DejaVuSans-3a"/>
     <use x="626.806641" xlink:href="#DejaVuSans-20"/>
     <use x="658.59375" xlink:href="#DejaVuSans-31"/>
    </g>
   </g>
   <g id="text_34">
    <!-- In 975 V / 90 A -->
    <g transform="translate(228.14 454.420321)scale(0.064 -0.064)">
     <use xlink:href="#DejaVuSans-49"/>
     <use x="29.492188" xlink:href="#DejaVuSans-6e"/>
     <use x="92.871094" xlink:href="#DejaVuSans-20"/>
     <use x="124.658203" xlink:href="#DejaVuSans-39"/>
     <use x="188.28125" xlink:href="#DejaVuSans-37"/>
     <use x="251.904297" xlink:href="#DejaVuSans-35"/>
     <use x="315.527344" xlink:href="#DejaVuSans-20"/>
     <use x="347.314453" xlink:href="#DejaVuSans-56"/>
     <use x="415.722656" xlink:href="#DejaVuSans-20"/>
     <use x="447.509766" xlink:href="#DejaVuSans-2f"/>
     <use x="481.201172" xlink:href="#DejaVuSans-20"/>
     <use x="512.988281" xlink:href="#DejaVuSans-39"/>
     <use x="576.611328" xlink:href="#DejaVuSans-30"/>
     <use x="640.234375" xlink:href="#DejaVuSans-20"/>
     <use x="672.021484" xlink:href="#DejaVuSans-41"/>
    </g>
   </g>
   <g id="text_35">
    <!-- Out 230 V / 256 A -->
    <g transform="translate(228.14 496.897179)scale(0.064 -0.064)">
     <defs>
      <path d="M 2113 2584 
Q 1688 2584 1439 2293 
Q 1191 2003 1191 1497 
Q 1191 994 1439 701 
Q 1688 409 2113 409 
Q 2538 409 2786 701 
Q 3034 994 3034 1497 
Q 3034 2003 2786 2293 
Q 2538 2584 2113 2584 
z
M 3366 4563 
L 3366 3988 
Q 3128 4100 2886 4159 
Q 2644 4219 2406 4219 
Q 1781 4219 1451 3797 
Q 1122 3375 1075 2522 
Q 1259 2794 1537 2939 
Q 1816 3084 2150 3084 
Q 2853 3084 3261 2657 
Q 3669 2231 3669 1497 
Q 3669 778 3244 343 
Q 2819 -91 2113 -91 
Q 1303 -91 875 529 
Q 447 1150 447 2328 
Q 447 3434 972 4092 
Q 1497 4750 2381 4750 
Q 2619 4750 2861 4703 
Q 3103 4656 3366 4563 
z
" id="DejaVuSans-36" transform="scale(0.015625)"/>
     </defs>
     <use xlink:href="#DejaVuSans-4f"/>
     <use x="78.710938" xlink:href="#DejaVuSans-75"/>
     <use x="142.089844" xlink:href="#DejaVuSans-74"/>
     <use x="181.298828" xlink:href="#DejaVuSans-20"/>
     <use x="213.085938" xlink:href="#DejaVuSans-32"/>
     <use x="276.708984" xlink:href="#DejaVuSans-33"/>
     <use x="340.332031" xlink:href="#DejaVuSans-30"/>
     <use x="403.955078" xlink:href="#DejaVuSans-20"/>
     <use x="435.742188" xlink:href="#DejaVuSans-56"/>
     <use x="504.150391" xlink:href="#DejaVuSans-20"/>
     <use x="535.9375" xlink:href="#DejaVuSans-2f"/>
     <use x="569.628906" xlink:href="#DejaVuSans-20"/>
     <use x="601.416016" xlink:href="#DejaVuSans-32"/>
     <use x="665.039062" xlink:href="#DejaVuSans-35"/>
     <use x="728.662109" xlink:href="#DejaVuSans-36"/>
     <use x="792.285156" xlink:href="#DejaVuSans-20"/>
     <use x="824.072266" xlink:href="#DejaVuSans-41"/>
    </g>
   </g>
   <g id="text_36">
    <!-- GND -->
    <g transform="translate(473.308125 185.9055)scale(0.08 -0.08)">
     <use xlink:href="#DejaVuSans-47"/>
     <use x="77.490234" xlink:href="#DejaVuSans-4e"/>
     <use x="152.294922" xlink:href="#DejaVuSans-44"/>
    </g>
   </g>
   <g id="text_37">
    <!-- BB  4 -->
    <g transform="translate(466.28 259.51775)scale(0.16 -0.16)">
     <defs>
      <path d="M 2419 4116 
L 825 1625 
L 2419 1625 
L 2419 4116 
z
M 2253 4666 
L 3047 4666 
L 3047 1625 
L 3713 1625 
L 3713 1100 
L 3047 1100 
L 3047 0 
L 2419 0 
L 2419 1100 
L 313 1100 
L 313 1709 
L 2253 4666 
z
" id="DejaVuSans-34" transform="scale(0.015625)"/>
     </defs>
     <use xlink:href="#DejaVuSans-42"/>
     <use x="68.603516" xlink:href="#DejaVuSans-42"/>
     <use x="137.207031" xlink:href="#DejaVuSans-20"/>
     <use x="168.994141" xlink:href="#DejaVuSans-20"/>
     <use x="200.78125" xlink:href="#DejaVuSans-34"/>
    </g>
   </g>
   <g id="text_38">
    <!-- PV1-1 -->
    <g transform="translate(512.5775 194.58025)scale(0.08 -0.08)">
     <use xlink:href="#DejaVuSans-50"/>
     <use x="60.302734" xlink:href="#DejaVuSans-56"/>
     <use x="128.710938" xlink:href="#DejaVuSans-31"/>
     <use x="192.333984" xlink:href="#DejaVuSans-2d"/>
     <use x="228.417969" xlink:href="#DejaVuSans-31"/>
    </g>
   </g>
   <g id="text_39">
    <!-- PV1-25 -->
    <g transform="translate(507.4875 335.34025)scale(0.08 -0.08)">
     <use xlink:href="#DejaVuSans-50"/>
     <use x="60.302734" xlink:href="#DejaVuSans-56"/>
     <use x="128.710938" xlink:href="#DejaVuSans-31"/>
     <use x="192.333984" xlink:href="#DejaVuSans-2d"/>
     <use x="228.417969" xlink:href="#DejaVuSans-32"/>
     <use x="292.041016" xlink:href="#DejaVuSans-35"/>
    </g>
   </g>
   <g id="text_40">
    <!-- PV10-1 -->
    <g transform="translate(656.5275 194.58025)scale(0.08 -0.08)">
     <use xlink:href="#DejaVuSans-50"/>
     <use x="60.302734" xlink:href="#DejaVuSans-56"/>
     <use x="128.710938" xlink:href="#DejaVuSans-31"/>
     <use x="192.333984" xlink:href="#DejaVuSans-30"/>
     <use x="255.957031" xlink:href="#DejaVuSans-2d"/>
     <use x="292.041016" xlink:href="#DejaVuSans-31"/>
    </g>
   </g>
   <g id="text_41">
    <!-- PV10-25 -->
    <g transform="translate(651.4375 335.34025)scale(0.08 -0.08)">
     <use xlink:href="#DejaVuSans-50"/>
     <use x="60.302734" xlink:href="#DejaVuSans-56"/>
     <use x="128.710938" xlink:href="#DejaVuSans-31"/>
     <use x="192.333984" xlink:href="#DejaVuSans-30"/>
     <use x="255.957031" xlink:href="#DejaVuSans-2d"/>
     <use x="292.041016" xlink:href="#DejaVuSans-32"/>
     <use x="355.664062" xlink:href="#DejaVuSans-35"/>
    </g>
   </g>
   <g id="text_42">
    <!-- Combiner Box 2 -->
    <g transform="translate(455.84 396.762)scale(0.08 -0.08)">
     <use xlink:href="#DejaVuSans-43"/>
     <use x="69.824219" xlink:href="#DejaVuSans-6f"/>
     <use x="131.005859" xlink:href="#DejaVuSans-6d"/>
     <use x="228.417969" xlink:href="#DejaVuSans-62"/>
     <use x="291.894531" xlink:href="#DejaVuSans-69"/>
     <use x="319.677734" xlink:href="#DejaVuSans-6e"/>
     <use x="383.056641" xlink:href="#DejaVuSans-65"/>
     <use x="444.580078" xlink:href="#DejaVuSans-72"/>
     <use x="485.693359" xlink:href="#DejaVuSans-20"/>
     <use x="517.480469" xlink:href="#DejaVuSans-42"/>
     <use x="586.083984" xlink:href="#DejaVuSans-6f"/>
     <use x="644.140625" xlink:href="#DejaVuSans-78"/>
     <use x="703.320312" xlink:href="#DejaVuSans-20"/>
     <use x="735.107422" xlink:href="#DejaVuSans-32"/>
    </g>
    <!-- Inputs: 10 -->
    <g transform="translate(479.44 405.72025)scale(0.08 -0.08)">
     <use xlink:href="#DejaVuSans-49"/>
     <use x="29.492188" xlink:href="#DejaVuSans-6e"/>
     <use x="92.871094" xlink:href="#DejaVuSans-70"/>
     <use x="156.347656" xlink:href="#DejaVuSans-75"/>
     <use x="219.726562" xlink:href="#DejaVuSans-74"/>
     <use x="258.935547" xlink:href="#DejaVuSans-73"/>
     <use x="311.035156" xlink:href="#DejaVuSans-3a"/>
     <use x="344.726562" xlink:href="#DejaVuSans-20"/>
     <use x="376.513672" xlink:href="#DejaVuSans-31"/>
     <use x="440.136719" xlink:href="#DejaVuSans-30"/>
    </g>
    <!-- Outputs: 1 -->
    <g transform="translate(477.45625 414.6785)scale(0.08 -0.08)">
     <use xlink:href="#DejaVuSans-4f"/>
     <use x="78.710938" xlink:href="#DejaVuSans-75"/>
     <use x="142.089844" xlink:href="#DejaVuSans-74"/>
     <use x="181.298828" xlink:href="#DejaVuSans-70"/>
     <use x="244.775391" xlink:href="#DejaVuSans-75"/>
     <use x="308.154297" xlink:href="#DejaVuSans-74"/>
     <use x="347.363281" xlink:href="#DejaVuSans-73"/>
     <use x="399.462891" xlink:href="#DejaVuSans-3a"/>
     <use x="433.154297" xlink:href="#DejaVuSans-20"/>
     <use x="464.941406" xlink:href="#DejaVuSans-31"/>
    </g>
   </g>
   <g id="text_43">
    <!-- In 975 V / 9 A -->
    <g transform="translate(552.14 384.040321)scale(0.064 -0.064)">
     <use xlink:href="#DejaVuSans-49"/>
     <use x="29.492188" xlink:href="#DejaVuSans-6e"/>
     <use x="92.871094" xlink:href="#DejaVuSans-20"/>
     <use x="124.658203" xlink:href="#DejaVuSans-39"/>
     <use x="188.28125" xlink:href="#DejaVuSans-37"/>
     <use x="251.904297" xlink:href="#DejaVuSans-35"/>
     <use x="315.527344" xlink:href="#DejaVuSans-20"/>
     <use x="347.314453" xlink:href="#DejaVuSans-56"/>
     <use x="415.722656" xlink:href="#DejaVuSans-20"/>
     <use x="447.509766" xlink:href="#DejaVuSans-2f"/>
     <use x="481.201172" xlink:href="#DejaVuSans-20"/>
     <use x="512.988281" xlink:href="#DejaVuSans-39"/>
     <use x="576.611328" xlink:href="#DejaVuSans-20"/>
     <use x="608.398438" xlink:href="#DejaVuSans-41"/>
    </g>
   </g>
   <g id="text_44">
    <!-- Out 975 V / 90 A -->
    <g transform="translate(552.14 426.517179)scale(0.064 -0.064)">
     <use xlink:href="#DejaVuSans-4f"/>
     <use x="78.710938" xlink:href="#DejaVuSans-75"/>
     <use x="142.089844" xlink:href="#DejaVuSans-74"/>
     <use x="181.298828" xlink:href="#DejaVuSans-20"/>
     <use x="213.085938" xlink:href="#DejaVuSans-39"/>
     <use x="276.708984" xlink:href="#DejaVuSans-37"/>
     <use x="340.332031" xlink:href="#DejaVuSans-35"/>
     <use x="403.955078" xlink:href="#DejaVuSans-20"/>
     <use x="435.742188" xlink:href="#DejaVuSans-56"/>
     <use x="504.150391" xlink:href="#DejaVuSans-20"/>
     <use x="535.9375" xlink:href="#DejaVuSans-2f"/>
     <use x="569.628906" xlink:href="#DejaVuSans-20"/>
     <use x="601.416016" xlink:href="#DejaVuSans-39"/>
     <use x="665.039062" xlink:href="#DejaVuSans-30"/>
     <use x="728.662109" xlink:href="#DejaVuSans-20"/>
     <use x="760.449219" xlink:href="#DejaVuSans-41"/>
    </g>
   </g>
   <g id="text_45">
    <!-- Inverter Nr 2 -->
    <g transform="translate(468.5675 467.142)scale(0.08 -0.08)">
     <use xlink:href="#DejaVuSans-49"/>
     <use x="29.492188" xlink:href="#DejaVuSans-6e"/>
     <use x="92.871094" xlink:href="#DejaVuSans-76"/>
     <use x="152.050781" xlink:href="#DejaVuSans-65"/>
     <use x="213.574219" xlink:href="#DejaVuSans-72"/>
     <use x="254.6875" xlink:href="#DejaVuSans-74"/>
     <use x="293.896484" xlink:href="#DejaVuSans-65"/>
     <use x="355.419922" xlink:href="#DejaVuSans-72"/>
     <use x="396.533203" xlink:href="#DejaVuSans-20"/>
     <use x="428.320312" xlink:href="#DejaVuSans-4e"/>
     <use x="503.125" xlink:href="#DejaVuSans-72"/>
     <use x="544.238281" xlink:href="#DejaVuSans-20"/>
     <use x="576.025391" xlink:href="#DejaVuSans-32"/>
    </g>
    <!-- Max Inputs: 1 -->
    <g transform="translate(465.4475 476.10025)scale(0.08 -0.08)">
     <use xlink:href="#DejaVuSans-4d"/>
     <use x="86.279297" xlink:href="#DejaVuSans-61"/>
     <use x="147.558594" xlink:href="#DejaVuSans-78"/>
     <use x="206.738281" xlink:href="#DejaVuSans-20"/>
     <use x="238.525391" xlink:href="#DejaVuSans-49"/>
     <use x="268.017578" xlink:href="#DejaVuSans-6e"/>
     <use x="331.396484" xlink:href="#DejaVuSans-70"/>
     <use x="394.873047" xlink:href="#DejaVuSans-75"/>
     <use x="458.251953" xlink:href="#DejaVuSans-74"/>
     <use x="497.460938" xlink:href="#DejaVuSans-73"/>
     <use x="549.560547" xlink:href="#DejaVuSans-3a"/>
     <use x="583.251953" xlink:href="#DejaVuSans-20"/>
     <use x="615.039062" xlink:href="#DejaVuSans-31"/>
    </g>
    <!-- Used Inputs: 1 -->
    <g transform="translate(461.96375 485.0585)scale(0.08 -0.08)">
     <use xlink:href="#DejaVuSans-55"/>
     <use x="73.193359" xlink:href="#DejaVuSans-73"/>
     <use x="125.292969" xlink:href="#DejaVuSans-65"/>
     <use x="186.816406" xlink:href="#DejaVuSans-64"/>
     <use x="250.292969" xlink:href="#DejaVuSans-20"/>
     <use x="282.080078" xlink:href="#DejaVuSans-49"/>
     <use x="311.572266" xlink:href="#DejaVuSans-6e"/>
     <use x="374.951172" xlink:href="#DejaVuSans-70"/>
     <use x="438.427734" xlink:href="#DejaVuSans-75"/>
     <use x="501.806641" xlink:href="#DejaVuSans-74"/>
     <use x="541.015625" xlink:href="#DejaVuSans-73"/>
     <use x="593.115234" xlink:href="#DejaVuSans-3a"/>
     <use x="626.806641" xlink:href="#DejaVuSans-20"/>
     <use x="658.59375" xlink:href="#DejaVuSans-31"/>
    </g>
   </g>
   <g id="text_46">
    <!-- In 975 V / 90 A -->
    <g transform="translate(552.14 454.420321)scale(0.064 -0.064)">
     <use xlink:href="#DejaVuSans-49"/>
     <use x="29.492188" xlink:href="#DejaVuSans-6e"/>
     <use x="92.871094" xlink:href="#DejaVuSans-20"/>
     <use x="124.658203" xlink:href="#DejaVuSans-39"/>
     <use x="188.28125" xlink:href="#DejaVuSans-37"/>
     <use x="251.904297" xlink:href="#DejaVuSans-35"/>
     <use x="315.527344" xlink:href="#DejaVuSans-20"/>
     <use x="347.314453" xlink:href="#DejaVuSans-56"/>
     <use x="415.722656" xlink:href="#DejaVuSans-20"/>
     <use x="447.509766" xlink:href="#DejaVuSans-2f"/>
     <use x="481.201172" xlink:href="#DejaVuSans-20"/>
     <use x="512.988281" xlink:href="#DejaVuSans-39"/>
     <use x="576.611328" xlink:href="#DejaVuSans-30"/>
     <use x="640.234375" xlink:href="#DejaVuSans-20"/>
     <use x="672.021484" xlink:href="#DejaVuSans-41"/>
    </g>
   </g>
   <g id="text_47">
    <!-- Out 230 V / 256 A -->
    <g transform="translate(552.14 496.897179)scale(0.064 -0.064)">
     <use xlink:href="#DejaVuSans-4f"/>
     <use x="78.710938" xlink:href="#DejaVuSans-75"/>
     <use x="142.089844" xlink:href="#DejaVuSans-74"/>
     <use x="181.298828" xlink:href="#DejaVuSans-20"/>
     <use x="213.085938" xlink:href="#DejaVuSans-32"/>
     <use x="276.708984" xlink:href="#DejaVuSans-33"/>
     <use x="340.332031" xlink:href="#DejaVuSans-30"/>
     <use x="403.955078" xlink:href="#DejaVuSans-20"/>
     <use x="435.742188" xlink:href="#DejaVuSans-56"/>
     <use x="504.150391" xlink:href="#DejaVuSans-20"/>
     <use x="535.9375" xlink:href="#DejaVuSans-2f"/>
     <use x="569.628906" xlink:href="#DejaVuSans-20"/>
     <use x="601.416016" xlink:href="#DejaVuSans-32"/>
     <use x="665.039062" xlink:href="#DejaVuSans-35"/>
     <use x="728.662109" xlink:href="#DejaVuSans-36"/>
     <use x="792.285156" xlink:href="#DejaVuSans-20"/>
     <use x="824.072266" xlink:href="#DejaVuSans-41"/>
    </g>
   </g>
   <g id="text_48">
    <!-- Combiner Box All BB -->
    <g transform="translate(113.4925 537.522)scale(0.08 -0.08)">
     <use xlink:href="#DejaVuSans-43"/>
     <use x="69.824219" xlink:href="#DejaVuSans-6f"/>
     <use x="131.005859" xlink:href="#DejaVuSans-6d"/>
     <use x="228.417969" xlink:href="#DejaVuSans-62"/>
     <use x="291.894531" xlink:href="#DejaVuSans-69"/>
     <use x="319.677734" xlink:href="#DejaVuSans-6e"/>
     <use x="383.056641" xlink:href="#DejaVuSans-65"/>
     <use x="444.580078" xlink:href="#DejaVuSans-72"/>
     <use x="485.693359" xlink:href="#DejaVuSans-20"/>
     <use x="517.480469" xlink:href="#DejaVuSans-42"/>
     <use x="586.083984" xlink:href="#DejaVuSans-6f"/>
     <use x="644.140625" xlink:href="#DejaVuSans-78"/>
     <use x="703.320312" xlink:href="#DejaVuSans-20"/>
     <use x="735.107422" xlink:href="#DejaVuSans-41"/>
     <use x="803.515625" xlink:href="#DejaVuSans-6c"/>
     <use x="831.298828" xlink:href="#DejaVuSans-6c"/>
     <use x="859.082031" xlink:href="#DejaVuSans-20"/>
     <use x="890.869141" xlink:href="#DejaVuSans-42"/>
     <use x="959.472656" xlink:href="#DejaVuSans-42"/>
    </g>
    <!-- Inputs: 4 -->
    <g transform="translate(160.53 546.48025)scale(0.08 -0.08)">
     <use xlink:href="#DejaVuSans-49"/>
     <use x="29.492188" xlink:href="#DejaVuSans-6e"/>
     <use x="92.871094" xlink:href="#DejaVuSans-70"/>
     <use x="156.347656" xlink:href="#DejaVuSans-75"/>
     <use x="219.726562" xlink:href="#DejaVuSans-74"/>
     <use x="258.935547" xlink:href="#DejaVuSans-73"/>
     <use x="311.035156" xlink:href="#DejaVuSans-3a"/>
     <use x="344.726562" xlink:href="#DejaVuSans-20"/>
     <use x="376.513672" xlink:href="#DejaVuSans-34"/>
    </g>
    <!-- Outputs: 1 -->
    <g transform="translate(153.45625 555.4385)scale(0.08 -0.08)">
     <use xlink:href="#DejaVuSans-4f"/>
     <use x="78.710938" xlink:href="#DejaVuSans-75"/>
     <use x="142.089844" xlink:href="#DejaVuSans-74"/>
     <use x="181.298828" xlink:href="#DejaVuSans-70"/>
     <use x="244.775391" xlink:href="#DejaVuSans-75"/>
     <use x="308.154297" xlink:href="#DejaVuSans-74"/>
     <use x="347.363281" xlink:href="#DejaVuSans-73"/>
     <use x="399.462891" xlink:href="#DejaVuSans-3a"/>
     <use x="433.154297" xlink:href="#DejaVuSans-20"/>
     <use x="464.941406" xlink:href="#DejaVuSans-31"/>
    </g>
   </g>
   <g id="text_49">
    <!-- In 230 V / 256 A -->
    <g transform="translate(228.14 524.800321)scale(0.064 -0.064)">
     <use xlink:href="#DejaVuSans-49"/>
     <use x="29.492188" xlink:href="#DejaVuSans-6e"/>
     <use x="92.871094" xlink:href="#DejaVuSans-20"/>
     <use x="124.658203" xlink:href="#DejaVuSans-32"/>
     <use x="188.28125" xlink:href="#DejaVuSans-33"/>
     <use x="251.904297" xlink:href="#DejaVuSans-30"/>
     <use x="315.527344" xlink:href="#DejaVuSans-20"/>
     <use x="347.314453" xlink:href="#DejaVuSans-56"/>
     <use x="415.722656" xlink:href="#DejaVuSans-20"/>
     <use x="447.509766" xlink:href="#DejaVuSans-2f"/>
     <use x="481.201172" xlink:href="#DejaVuSans-20"/>
     <use x="512.988281" xlink:href="#DejaVuSans-32"/>
     <use x="576.611328" xlink:href="#DejaVuSans-35"/>
     <use x="640.234375" xlink:href="#DejaVuSans-36"/>
     <use x="703.857422" xlink:href="#DejaVuSans-20"/>
     <use x="735.644531" xlink:href="#DejaVuSans-41"/>
    </g>
   </g>
   <g id="text_50">
    <!-- Out 230 V / 1024 A -->
    <g transform="translate(228.14 567.277179)scale(0.064 -0.064)">
     <use xlink:href="#DejaVuSans-4f"/>
     <use x="78.710938" xlink:href="#DejaVuSans-75"/>
     <use x="142.089844" xlink:href="#DejaVuSans-74"/>
     <use x="181.298828" xlink:href="#DejaVuSans-20"/>
     <use x="213.085938" xlink:href="#DejaVuSans-32"/>
     <use x="276.708984" xlink:href="#DejaVuSans-33"/>
     <use x="340.332031" xlink:href="#DejaVuSans-30"/>
     <use x="403.955078" xlink:href="#DejaVuSans-20"/>
     <use x="435.742188" xlink:href="#DejaVuSans-56"/>
     <use x="504.150391" xlink:href="#DejaVuSans-20"/>
     <use x="535.9375" xlink:href="#DejaVuSans-2f"/>
     <use x="569.628906" xlink:href="#DejaVuSans-20"/>
     <use x="601.416016" xlink:href="#DejaVuSans-31"/>
     <use x="665.039062" xlink:href="#DejaVuSans-30"/>
     <use x="728.662109" xlink:href="#DejaVuSans-32"/>
     <use x="792.285156" xlink:href="#DejaVuSans-34"/>
     <use x="855.908203" xlink:href="#DejaVuSans-20"/>
     <use x="887.695312" xlink:href="#DejaVuSans-41"/>
    </g>
   </g>
   <g id="text_51">
    <!-- Inverter transformer -->
    <g transform="translate(316.8925 551.789)scale(0.08 -0.08)">
     <defs>
      <path d="M 2375 4863 
L 2375 4384 
L 1825 4384 
Q 1516 4384 1395 4259 
Q 1275 4134 1275 3809 
L 1275 3500 
L 2222 3500 
L 2222 3053 
L 1275 3053 
L 1275 0 
L 697 0 
L 697 3053 
L 147 3053 
L 147 3500 
L 697 3500 
L 697 3744 
Q 697 4328 969 4595 
Q 1241 4863 1831 4863 
L 2375 4863 
z
" id="DejaVuSans-66" transform="scale(0.015625)"/>
     </defs>
     <use xlink:href="#DejaVuSans-49"/>
     <use x="29.492188" xlink:href="#DejaVuSans-6e"/>
     <use x="92.871094" xlink:href="#DejaVuSans-76"/>
     <use x="152.050781" xlink:href="#DejaVuSans-65"/>
     <use x="213.574219" xlink:href="#DejaVuSans-72"/>
     <use x="254.6875" xlink:href="#DejaVuSans-74"/>
     <use x="293.896484" xlink:href="#DejaVuSans-65"/>
     <use x="355.419922" xlink:href="#DejaVuSans-72"/>
     <use x="396.533203" xlink:href="#DejaVuSans-20"/>
     <use x="428.320312" xlink:href="#DejaVuSans-74"/>
     <use x="467.529297" xlink:href="#DejaVuSans-72"/>
     <use x="508.642578" xlink:href="#DejaVuSans-61"/>
     <use x="569.921875" xlink:href="#DejaVuSans-6e"/>
     <use x="633.300781" xlink:href="#DejaVuSans-73"/>
     <use x="685.400391" xlink:href="#DejaVuSans-66"/>
     <use x="720.605469" xlink:href="#DejaVuSans-6f"/>
     <use x="781.787109" xlink:href="#DejaVuSans-72"/>
     <use x="821.150391" xlink:href="#DejaVuSans-6d"/>
     <use x="918.5625" xlink:href="#DejaVuSans-65"/>
     <use x="980.085938" xlink:href="#DejaVuSans-72"/>
    </g>
   </g>
   <g id="text_52">
    <!-- In 230 V / 256 A -->
    <g transform="translate(287.073429 588.91575)scale(0.064 -0.064)">
     <use xlink:href="#DejaVuSans-49"/>
     <use x="29.492188" xlink:href="#DejaVuSans-6e"/>
     <use x="92.871094" xlink:href="#DejaVuSans-20"/>
     <use x="124.658203" xlink:href="#DejaVuSans-32"/>
     <use x="188.28125" xlink:href="#DejaVuSans-33"/>
     <use x="251.904297" xlink:href="#DejaVuSans-30"/>
     <use x="315.527344" xlink:href="#DejaVuSans-20"/>
     <use x="347.314453" xlink:href="#DejaVuSans-56"/>
     <use x="415.722656" xlink:href="#DejaVuSans-20"/>
     <use x="447.509766" xlink:href="#DejaVuSans-2f"/>
     <use x="481.201172" xlink:href="#DejaVuSans-20"/>
     <use x="512.988281" xlink:href="#DejaVuSans-32"/>
     <use x="576.611328" xlink:href="#DejaVuSans-35"/>
     <use x="640.234375" xlink:href="#DejaVuSans-36"/>
     <use x="703.857422" xlink:href="#DejaVuSans-20"/>
     <use x="735.644531" xlink:href="#DejaVuSans-41"/>
    </g>
   </g>
   <g id="text_53">
    <!-- Out 230 V / 256 A -->
    <g transform="translate(376.948571 588.91575)scale(0.064 -0.064)">
     <use xlink:href="#DejaVuSans-4f"/>
     <use x="78.710938" xlink:href="#DejaVuSans-75"/>
     <use x="142.089844" xlink:href="#DejaVuSans-74"/>
     <use x="181.298828" xlink:href="#DejaVuSans-20"/>
     <use x="213.085938" xlink:href="#DejaVuSans-32"/>
     <use x="276.708984" xlink:href="#DejaVuSans-33"/>
     <use x="340.332031" xlink:href="#DejaVuSans-30"/>
     <use x="403.955078" xlink:href="#DejaVuSans-20"/>
     <use x="435.742188" xlink:href="#DejaVuSans-56"/>
     <use x="504.150391" xlink:href="#DejaVuSans-20"/>
     <use x="535.9375" xlink:href="#DejaVuSans-2f"/>
     <use x="569.628906" xlink:href="#DejaVuSans-20"/>
     <use x="601.416016" xlink:href="#DejaVuSans-32"/>
     <use x="665.039062" xlink:href="#DejaVuSans-35"/>
     <use x="728.662109" xlink:href="#DejaVuSans-36"/>
     <use x="792.285156" xlink:href="#DejaVuSans-20"/>
     <use x="824.072266" xlink:href="#DejaVuSans-41"/>
    </g>
   </g>
   <g id="text_54">
    <!-- Battery All BB -->
    <g transform="translate(404.465 563.264)scale(0.08 -0.08)">
     <use xlink:href="#DejaVuSans-42"/>
     <use x="68.603516" xlink:href="#DejaVuSans-61"/>
     <use x="129.882812" xlink:href="#DejaVuSans-74"/>
     <use x="169.091797" xlink:href="#DejaVuSans-74"/>
     <use x="208.300781" xlink:href="#DejaVuSans-65"/>
     <use x="269.824219" xlink:href="#DejaVuSans-72"/>
     <use x="310.9375" xlink:href="#DejaVuSans-79"/>
     <use x="370.117188" xlink:href="#DejaVuSans-20"/>
     <use x="401.904297" xlink:href="#DejaVuSans-41"/>
     <use x="470.3125" xlink:href="#DejaVuSans-6c"/>
     <use x="498.095703" xlink:href="#DejaVuSans-6c"/>
     <use x="525.878906" xlink:href="#DejaVuSans-20"/>
     <use x="557.666016" xlink:href="#DejaVuSans-42"/>
     <use x="626.269531" xlink:href="#DejaVuSans-42"/>
    </g>
   </g>
   <g id="text_55">
    <!-- Grid connection -->
    <g transform="translate(132.33 739.26025)scale(0.08 -0.08)">
     <use xlink:href="#DejaVuSans-47"/>
     <use x="77.490234" xlink:href="#DejaVuSans-72"/>
     <use x="118.603516" xlink:href="#DejaVuSans-69"/>
     <use x="146.386719" xlink:href="#DejaVuSans-64"/>
     <use x="209.863281" xlink:href="#DejaVuSans-20"/>
     <use x="241.650391" xlink:href="#DejaVuSans-63"/>
     <use x="296.630859" xlink:href="#DejaVuSans-6f"/>
     <use x="357.8125" xlink:href="#DejaVuSans-6e"/>
     <use x="421.191406" xlink:href="#DejaVuSans-6e"/>
     <use x="484.570312" xlink:href="#DejaVuSans-65"/>
     <use x="546.09375" xlink:href="#DejaVuSans-63"/>
     <use x="601.074219" xlink:href="#DejaVuSans-74"/>
     <use x="640.283203" xlink:href="#DejaVuSans-69"/>
     <use x="668.066406" xlink:href="#DejaVuSans-6f"/>
     <use x="729.248047" xlink:href="#DejaVuSans-6e"/>
    </g>
   </g>
  </g>
 </g>
 <defs>
  <clipPath id="p476d7c026f">
   <rect height="859.6305" width="1082.16" x="14.3" y="10.8"/>
  </clipPath>
 </defs>
</svg>
