%!PS-Adobe-3.0 EPSF-3.0
%%Title: sch.eps
%%Creator: Matplotlib v3.4.1, https://matplotlib.org/
%%CreationDate: Mon Apr 26 16:14:39 2021
%%Orientation: portrait
%%BoundingBox: -247 -132 860 925
%%HiResBoundingBox: -247.630000 -132.404312 859.630000 924.404312
%%EndComments
%%BeginProlog
/mpldict 11 dict def
mpldict begin
/d { bind def } bind def
/m { moveto } d
/l { lineto } d
/r { rlineto } d
/c { curveto } d
/cl { closepath } d
/ce { closepath eofill } d
/box {
      m
      1 index 0 r
      0 exch r
      neg 0 r
      cl
    } d
/clipbox {
      box
      clip
      newpath
    } d
/sc { setcachedevice } d
%!PS-Adobe-3.0 Resource-Font
%%Creator: Converted from TrueType to Type 3 by Matplotlib.
10 dict begin
/FontName /DejaVuSans def
/PaintType 0 def
/FontMatrix [0.00048828125 0 0 0.00048828125 0 0] def
/FontBBox [-2090 -948 3673 2524] def
/FontType 3 def
/Encoding [/space /hyphen /period /slash /zero /one /two /three /four /five /six /seven /eight /nine /colon /A /B /C /D /E /G /I /M /N /O /P /T /U /V /a /b /c /d /e /f /g /h /i /j /k /l /m /n /o /p /r /s /t /u /v /x /y] def
/CharStrings 53 dict dup begin
/.notdef 0 def
/space{651 0 0 0 0 0 sc
ce} d
/hyphen{739 0 100 479 639 643 sc
100 643 m
639 643 l
639 479 l
100 479 l
100 643 l

ce} d
/period{651 0 219 0 430 254 sc
219 254 m
430 254 l
430 0 l
219 0 l
219 254 l

ce} d
/slash{690 0 0 -190 690 1493 sc
520 1493 m
690 1493 l
170 -190 l
0 -190 l
520 1493 l

ce} d
/zero{1303 0 135 -29 1167 1520 sc
651 1360 m
547 1360 469 1309 416 1206 c
364 1104 338 950 338 745 c
338 540 364 387 416 284 c
469 182 547 131 651 131 c
756 131 834 182 886 284 c
939 387 965 540 965 745 c
965 950 939 1104 886 1206 c
834 1309 756 1360 651 1360 c

651 1520 m
818 1520 946 1454 1034 1321 c
1123 1189 1167 997 1167 745 c
1167 494 1123 302 1034 169 c
946 37 818 -29 651 -29 c
484 -29 356 37 267 169 c
179 302 135 494 135 745 c
135 997 179 1189 267 1321 c
356 1454 484 1520 651 1520 c

ce} d
/one{1303 0 225 0 1114 1493 sc
254 170 m
584 170 l
584 1309 l
225 1237 l
225 1421 l
582 1493 l
784 1493 l
784 170 l
1114 170 l
1114 0 l
254 0 l
254 170 l

ce} d
/two{1303 0 150 0 1098 1520 sc
393 170 m
1098 170 l
1098 0 l
150 0 l
150 170 l
227 249 331 356 463 489 c
596 623 679 709 713 748 c
778 821 823 882 848 932 c
874 983 887 1032 887 1081 c
887 1160 859 1225 803 1275 c
748 1325 675 1350 586 1350 c
523 1350 456 1339 385 1317 c
315 1295 240 1262 160 1217 c
160 1421 l
241 1454 317 1478 388 1495 c
459 1512 523 1520 582 1520 c
737 1520 860 1481 952 1404 c
1044 1327 1090 1223 1090 1094 c
1090 1033 1078 974 1055 919 c
1032 864 991 800 930 725 c
913 706 860 650 771 557 c
682 465 556 336 393 170 c

ce} d
/three{1303 0 156 -29 1139 1520 sc
831 805 m
928 784 1003 741 1057 676 c
1112 611 1139 530 1139 434 c
1139 287 1088 173 987 92 c
886 11 742 -29 555 -29 c
492 -29 428 -23 361 -10 c
295 2 227 20 156 45 c
156 240 l
212 207 273 183 340 166 c
407 149 476 141 549 141 c
676 141 772 166 838 216 c
905 266 938 339 938 434 c
938 522 907 591 845 640 c
784 690 698 715 588 715 c
414 715 l
414 881 l
596 881 l
695 881 771 901 824 940 c
877 980 903 1037 903 1112 c
903 1189 876 1247 821 1288 c
767 1329 689 1350 588 1350 c
533 1350 473 1344 410 1332 c
347 1320 277 1301 201 1276 c
201 1456 l
278 1477 349 1493 416 1504 c
483 1515 547 1520 606 1520 c
759 1520 881 1485 970 1415 c
1059 1346 1104 1252 1104 1133 c
1104 1050 1080 980 1033 923 c
986 866 918 827 831 805 c

ce} d
/four{1303 0 100 0 1188 1493 sc
774 1317 m
264 520 l
774 520 l
774 1317 l

721 1493 m
975 1493 l
975 520 l
1188 520 l
1188 352 l
975 352 l
975 0 l
774 0 l
774 352 l
100 352 l
100 547 l
721 1493 l

ce} d
/five{1303 0 158 -29 1124 1493 sc
221 1493 m
1014 1493 l
1014 1323 l
406 1323 l
406 957 l
435 967 465 974 494 979 c
523 984 553 987 582 987 c
749 987 881 941 978 850 c
1075 759 1124 635 1124 479 c
1124 318 1074 193 974 104 c
874 15 733 -29 551 -29 c
488 -29 424 -24 359 -13 c
294 -2 227 14 158 35 c
158 238 l
218 205 280 181 344 165 c
408 149 476 141 547 141 c
662 141 754 171 821 232 c
888 293 922 375 922 479 c
922 583 888 665 821 726 c
754 787 662 817 547 817 c
493 817 439 811 385 799 c
332 787 277 768 221 743 c
221 1493 l

ce} d
/six{1303 0 143 -29 1174 1520 sc
676 827 m
585 827 513 796 460 734 c
407 672 381 587 381 479 c
381 372 407 287 460 224 c
513 162 585 131 676 131 c
767 131 838 162 891 224 c
944 287 971 372 971 479 c
971 587 944 672 891 734 c
838 796 767 827 676 827 c

1077 1460 m
1077 1276 l
1026 1300 975 1318 923 1331 c
872 1344 821 1350 770 1350 c
637 1350 535 1305 464 1215 c
394 1125 354 989 344 807 c
383 865 433 909 492 940 c
551 971 617 987 688 987 c
838 987 956 941 1043 850 c
1130 759 1174 636 1174 479 c
1174 326 1129 203 1038 110 c
947 17 827 -29 676 -29 c
503 -29 371 37 280 169 c
189 302 143 494 143 745 c
143 981 199 1169 311 1309 c
423 1450 573 1520 762 1520 c
813 1520 864 1515 915 1505 c
967 1495 1021 1480 1077 1460 c

ce} d
/seven{1303 0 168 0 1128 1493 sc
168 1493 m
1128 1493 l
1128 1407 l
586 0 l
375 0 l
885 1323 l
168 1323 l
168 1493 l

ce} d
/eight{1303 0 139 -29 1163 1520 sc
651 709 m
555 709 479 683 424 632 c
369 581 342 510 342 420 c
342 330 369 259 424 208 c
479 157 555 131 651 131 c
747 131 823 157 878 208 c
933 260 961 331 961 420 c
961 510 933 581 878 632 c
823 683 748 709 651 709 c

449 795 m
362 816 295 857 246 916 c
198 975 174 1048 174 1133 c
174 1252 216 1347 301 1416 c
386 1485 503 1520 651 1520 c
800 1520 916 1485 1001 1416 c
1086 1347 1128 1252 1128 1133 c
1128 1048 1104 975 1055 916 c
1007 857 940 816 854 795 c
951 772 1027 728 1081 662 c
1136 596 1163 515 1163 420 c
1163 275 1119 164 1030 87 c
942 10 816 -29 651 -29 c
486 -29 360 10 271 87 c
183 164 139 275 139 420 c
139 515 166 596 221 662 c
276 728 352 772 449 795 c

375 1114 m
375 1037 399 976 447 933 c
496 890 564 868 651 868 c
738 868 805 890 854 933 c
903 976 928 1037 928 1114 c
928 1191 903 1252 854 1295 c
805 1338 738 1360 651 1360 c
564 1360 496 1338 447 1295 c
399 1252 375 1191 375 1114 c

ce} d
/nine{1303 0 129 -29 1159 1520 sc
225 31 m
225 215 l
276 191 327 173 379 160 c
431 147 482 141 532 141 c
665 141 767 186 837 275 c
908 365 948 501 958 684 c
919 627 870 583 811 552 c
752 521 686 506 614 506 c
465 506 346 551 259 641 c
172 732 129 855 129 1012 c
129 1165 174 1288 265 1381 c
356 1474 476 1520 627 1520 c
800 1520 931 1454 1022 1321 c
1113 1189 1159 997 1159 745 c
1159 510 1103 322 991 181 c
880 41 730 -29 541 -29 c
490 -29 439 -24 387 -14 c
335 -4 281 11 225 31 c

627 664 m
718 664 789 695 842 757 c
895 819 922 904 922 1012 c
922 1119 895 1204 842 1266 c
789 1329 718 1360 627 1360 c
536 1360 464 1329 411 1266 c
358 1204 332 1119 332 1012 c
332 904 358 819 411 757 c
464 695 536 664 627 664 c

ce} d
/colon{690 0 240 0 451 1059 sc
240 254 m
451 254 l
451 0 l
240 0 l
240 254 l

240 1059 m
451 1059 l
451 805 l
240 805 l
240 1059 l

ce} d
/A{1401 0 16 0 1384 1493 sc
700 1294 m
426 551 l
975 551 l
700 1294 l

586 1493 m
815 1493 l
1384 0 l
1174 0 l
1038 383 l
365 383 l
229 0 l
16 0 l
586 1493 l

ce} d
/B{1405 0 201 0 1260 1493 sc
403 713 m
403 166 l
727 166 l
836 166 916 188 968 233 c
1021 278 1047 347 1047 440 c
1047 533 1021 602 968 646 c
916 691 836 713 727 713 c
403 713 l

403 1327 m
403 877 l
702 877 l
801 877 874 895 922 932 c
971 969 995 1026 995 1102 c
995 1177 971 1234 922 1271 c
874 1308 801 1327 702 1327 c
403 1327 l

201 1493 m
717 1493 l
871 1493 990 1461 1073 1397 c
1156 1333 1198 1242 1198 1124 c
1198 1033 1177 960 1134 906 c
1091 852 1029 818 946 805 c
1045 784 1122 739 1177 671 c
1232 604 1260 519 1260 418 c
1260 285 1215 182 1124 109 c
1033 36 904 0 737 0 c
201 0 l
201 1493 l

ce} d
/C{1430 0 115 -29 1319 1520 sc
1319 1378 m
1319 1165 l
1251 1228 1178 1276 1101 1307 c
1024 1338 943 1354 856 1354 c
685 1354 555 1302 464 1197 c
373 1093 328 942 328 745 c
328 548 373 398 464 293 c
555 189 685 137 856 137 c
943 137 1024 153 1101 184 c
1178 215 1251 263 1319 326 c
1319 115 l
1248 67 1173 31 1094 7 c
1015 -17 932 -29 844 -29 c
618 -29 440 40 310 178 c
180 317 115 506 115 745 c
115 985 180 1174 310 1312 c
440 1451 618 1520 844 1520 c
933 1520 1017 1508 1096 1484 c
1175 1461 1250 1425 1319 1378 c

ce} d
/D{1577 0 201 0 1456 1493 sc
403 1327 m
403 166 l
647 166 l
853 166 1004 213 1099 306 c
1195 399 1243 547 1243 748 c
1243 948 1195 1094 1099 1187 c
1004 1280 853 1327 647 1327 c
403 1327 l

201 1493 m
616 1493 l
905 1493 1118 1433 1253 1312 c
1388 1192 1456 1004 1456 748 c
1456 491 1388 302 1252 181 c
1116 60 904 0 616 0 c
201 0 l
201 1493 l

ce} d
/E{1294 0 201 0 1163 1493 sc
201 1493 m
1145 1493 l
1145 1323 l
403 1323 l
403 881 l
1114 881 l
1114 711 l
403 711 l
403 170 l
1163 170 l
1163 0 l
201 0 l
201 1493 l

ce} d
/G{1587 0 115 -29 1419 1520 sc
1219 213 m
1219 614 l
889 614 l
889 780 l
1419 780 l
1419 139 l
1341 84 1255 42 1161 13 c
1067 -15 967 -29 860 -29 c
627 -29 444 39 312 175 c
181 312 115 502 115 745 c
115 989 181 1179 312 1315 c
444 1452 627 1520 860 1520 c
957 1520 1050 1508 1137 1484 c
1225 1460 1306 1425 1380 1378 c
1380 1163 l
1305 1226 1226 1274 1142 1306 c
1058 1338 970 1354 877 1354 c
694 1354 557 1303 465 1201 c
374 1099 328 947 328 745 c
328 544 374 392 465 290 c
557 188 694 137 877 137 c
948 137 1012 143 1068 155 c
1124 168 1174 187 1219 213 c

ce} d
/I{604 0 201 0 403 1493 sc
201 1493 m
403 1493 l
403 0 l
201 0 l
201 1493 l

ce} d
/M{1767 0 201 0 1567 1493 sc
201 1493 m
502 1493 l
883 477 l
1266 1493 l
1567 1493 l
1567 0 l
1370 0 l
1370 1311 l
985 287 l
782 287 l
397 1311 l
397 0 l
201 0 l
201 1493 l

ce} d
/N{1532 0 201 0 1331 1493 sc
201 1493 m
473 1493 l
1135 244 l
1135 1493 l
1331 1493 l
1331 0 l
1059 0 l
397 1249 l
397 0 l
201 0 l
201 1493 l

ce} d
/O{1612 0 115 -29 1497 1520 sc
807 1356 m
660 1356 544 1301 457 1192 c
371 1083 328 934 328 745 c
328 557 371 408 457 299 c
544 190 660 135 807 135 c
954 135 1070 190 1155 299 c
1241 408 1284 557 1284 745 c
1284 934 1241 1083 1155 1192 c
1070 1301 954 1356 807 1356 c

807 1520 m
1016 1520 1184 1450 1309 1309 c
1434 1169 1497 981 1497 745 c
1497 510 1434 322 1309 181 c
1184 41 1016 -29 807 -29 c
597 -29 429 41 303 181 c
178 321 115 509 115 745 c
115 981 178 1169 303 1309 c
429 1450 597 1520 807 1520 c

ce} d
/P{1235 0 201 0 1165 1493 sc
403 1327 m
403 766 l
657 766 l
751 766 824 790 875 839 c
926 888 952 957 952 1047 c
952 1136 926 1205 875 1254 c
824 1303 751 1327 657 1327 c
403 1327 l

201 1493 m
657 1493 l
824 1493 951 1455 1036 1379 c
1122 1304 1165 1193 1165 1047 c
1165 900 1122 788 1036 713 c
951 638 824 600 657 600 c
403 600 l
403 0 l
201 0 l
201 1493 l

ce} d
/T{1251 0 -6 0 1257 1493 sc
-6 1493 m
1257 1493 l
1257 1323 l
727 1323 l
727 0 l
524 0 l
524 1323 l
-6 1323 l
-6 1493 l

ce} d
/U{1499 0 178 -29 1321 1493 sc
178 1493 m
381 1493 l
381 586 l
381 426 410 311 468 240 c
526 170 620 135 750 135 c
879 135 973 170 1031 240 c
1089 311 1118 426 1118 586 c
1118 1493 l
1321 1493 l
1321 561 l
1321 366 1273 219 1176 120 c
1080 21 938 -29 750 -29 c
561 -29 419 21 322 120 c
226 219 178 366 178 561 c
178 1493 l

ce} d
/V{1401 0 16 0 1384 1493 sc
586 0 m
16 1493 l
227 1493 l
700 236 l
1174 1493 l
1384 1493 l
815 0 l
586 0 l

ce} d
/a{1255 0 123 -29 1069 1147 sc
702 563 m
553 563 450 546 393 512 c
336 478 307 420 307 338 c
307 273 328 221 371 182 c
414 144 473 125 547 125 c
649 125 731 161 792 233 c
854 306 885 402 885 522 c
885 563 l
702 563 l

1069 639 m
1069 0 l
885 0 l
885 170 l
843 102 791 52 728 19 c
665 -13 589 -29 498 -29 c
383 -29 292 3 224 67 c
157 132 123 218 123 326 c
123 452 165 547 249 611 c
334 675 460 707 627 707 c
885 707 l
885 725 l
885 810 857 875 801 921 c
746 968 668 991 567 991 c
503 991 441 983 380 968 c
319 953 261 930 205 899 c
205 1069 l
272 1095 338 1114 401 1127 c
464 1140 526 1147 586 1147 c
748 1147 869 1105 949 1021 c
1029 937 1069 810 1069 639 c

ce} d
/b{1300 0 186 -29 1188 1556 sc
997 559 m
997 694 969 800 913 877 c
858 954 781 993 684 993 c
587 993 510 954 454 877 c
399 800 371 694 371 559 c
371 424 399 317 454 240 c
510 163 587 125 684 125 c
781 125 858 163 913 240 c
969 317 997 424 997 559 c

371 950 m
410 1017 458 1066 517 1098 c
576 1131 647 1147 729 1147 c
865 1147 975 1093 1060 985 c
1145 877 1188 735 1188 559 c
1188 383 1145 241 1060 133 c
975 25 865 -29 729 -29 c
647 -29 576 -13 517 19 c
458 52 410 101 371 168 c
371 0 l
186 0 l
186 1556 l
371 1556 l
371 950 l

ce} d
/c{1126 0 113 -29 999 1147 sc
999 1077 m
999 905 l
947 934 895 955 842 969 c
790 984 737 991 684 991 c
565 991 472 953 406 877 c
340 802 307 696 307 559 c
307 422 340 316 406 240 c
472 165 565 127 684 127 c
737 127 790 134 842 148 c
895 163 947 184 999 213 c
999 43 l
948 19 894 1 839 -11 c
784 -23 726 -29 664 -29 c
495 -29 361 24 262 130 c
163 236 113 379 113 559 c
113 742 163 885 263 990 c
364 1095 501 1147 676 1147 c
733 1147 788 1141 842 1129 c
896 1118 948 1100 999 1077 c

ce} d
/d{1300 0 113 -29 1114 1556 sc
930 950 m
930 1556 l
1114 1556 l
1114 0 l
930 0 l
930 168 l
891 101 842 52 783 19 c
724 -13 654 -29 571 -29 c
436 -29 325 25 240 133 c
155 241 113 383 113 559 c
113 735 155 877 240 985 c
325 1093 436 1147 571 1147 c
654 1147 724 1131 783 1098 c
842 1066 891 1017 930 950 c

303 559 m
303 424 331 317 386 240 c
442 163 519 125 616 125 c
713 125 790 163 846 240 c
902 317 930 424 930 559 c
930 694 902 800 846 877 c
790 954 713 993 616 993 c
519 993 442 954 386 877 c
331 800 303 694 303 559 c

ce} d
/e{1260 0 113 -29 1151 1147 sc
1151 606 m
1151 516 l
305 516 l
313 389 351 293 419 226 c
488 160 583 127 705 127 c
776 127 844 136 910 153 c
977 170 1043 196 1108 231 c
1108 57 l
1042 29 974 8 905 -7 c
836 -22 765 -29 694 -29 c
515 -29 374 23 269 127 c
165 231 113 372 113 549 c
113 732 162 878 261 985 c
360 1093 494 1147 662 1147 c
813 1147 932 1098 1019 1001 c
1107 904 1151 773 1151 606 c

967 660 m
966 761 937 841 882 901 c
827 961 755 991 664 991 c
561 991 479 962 417 904 c
356 846 320 764 311 659 c
967 660 l

ce} d
/f{721 0 47 0 760 1556 sc
760 1556 m
760 1403 l
584 1403 l
518 1403 472 1390 446 1363 c
421 1336 408 1288 408 1219 c
408 1120 l
711 1120 l
711 977 l
408 977 l
408 0 l
223 0 l
223 977 l
47 977 l
47 1120 l
223 1120 l
223 1198 l
223 1323 252 1413 310 1470 c
368 1527 460 1556 586 1556 c
760 1556 l

ce} d
/g{1300 0 113 -426 1114 1147 sc
930 573 m
930 706 902 810 847 883 c
792 956 715 993 616 993 c
517 993 440 956 385 883 c
330 810 303 706 303 573 c
303 440 330 337 385 264 c
440 191 517 154 616 154 c
715 154 792 191 847 264 c
902 337 930 440 930 573 c

1114 139 m
1114 -52 1072 -193 987 -286 c
902 -379 773 -426 598 -426 c
533 -426 472 -421 415 -411 c
358 -402 302 -387 248 -367 c
248 -188 l
302 -217 355 -239 408 -253 c
461 -267 514 -274 569 -274 c
690 -274 780 -242 840 -179 c
900 -116 930 -21 930 106 c
930 197 l
892 131 843 82 784 49 c
725 16 654 0 571 0 c
434 0 323 52 239 157 c
155 262 113 400 113 573 c
113 746 155 885 239 990 c
323 1095 434 1147 571 1147 c
654 1147 725 1131 784 1098 c
843 1065 892 1016 930 950 c
930 1120 l
1114 1120 l
1114 139 l

ce} d
/h{1298 0 186 0 1124 1556 sc
1124 676 m
1124 0 l
940 0 l
940 670 l
940 776 919 855 878 908 c
837 961 775 987 692 987 c
593 987 514 955 457 892 c
400 829 371 742 371 633 c
371 0 l
186 0 l
186 1556 l
371 1556 l
371 946 l
415 1013 467 1064 526 1097 c
586 1130 655 1147 733 1147 c
862 1147 959 1107 1025 1027 c
1091 948 1124 831 1124 676 c

ce} d
/i{569 0 193 0 377 1556 sc
193 1120 m
377 1120 l
377 0 l
193 0 l
193 1120 l

193 1556 m
377 1556 l
377 1323 l
193 1323 l
193 1556 l

ce} d
/j{569 0 -37 -426 377 1556 sc
193 1120 m
377 1120 l
377 -20 l
377 -163 350 -266 295 -330 c
241 -394 154 -426 33 -426 c
-37 -426 l
-37 -270 l
12 -270 l
82 -270 130 -254 155 -221 c
180 -189 193 -122 193 -20 c
193 1120 l

193 1556 m
377 1556 l
377 1323 l
193 1323 l
193 1556 l

ce} d
/k{1186 0 186 0 1180 1556 sc
186 1556 m
371 1556 l
371 637 l
920 1120 l
1155 1120 l
561 596 l
1180 0 l
940 0 l
371 547 l
371 0 l
186 0 l
186 1556 l

ce} d
/l{569 0 193 0 377 1556 sc
193 1556 m
377 1556 l
377 0 l
193 0 l
193 1556 l

ce} d
/m{1995 0 186 0 1821 1147 sc
1065 905 m
1111 988 1166 1049 1230 1088 c
1294 1127 1369 1147 1456 1147 c
1573 1147 1663 1106 1726 1024 c
1789 943 1821 827 1821 676 c
1821 0 l
1636 0 l
1636 670 l
1636 777 1617 857 1579 909 c
1541 961 1483 987 1405 987 c
1310 987 1234 955 1179 892 c
1124 829 1096 742 1096 633 c
1096 0 l
911 0 l
911 670 l
911 778 892 858 854 909 c
816 961 757 987 678 987 c
584 987 509 955 454 891 c
399 828 371 742 371 633 c
371 0 l
186 0 l
186 1120 l
371 1120 l
371 946 l
413 1015 463 1065 522 1098 c
581 1131 650 1147 731 1147 c
812 1147 881 1126 938 1085 c
995 1044 1038 984 1065 905 c

ce} d
/n{1298 0 186 0 1124 1147 sc
1124 676 m
1124 0 l
940 0 l
940 670 l
940 776 919 855 878 908 c
837 961 775 987 692 987 c
593 987 514 955 457 892 c
400 829 371 742 371 633 c
371 0 l
186 0 l
186 1120 l
371 1120 l
371 946 l
415 1013 467 1064 526 1097 c
586 1130 655 1147 733 1147 c
862 1147 959 1107 1025 1027 c
1091 948 1124 831 1124 676 c

ce} d
/o{1253 0 113 -29 1141 1147 sc
627 991 m
528 991 450 952 393 875 c
336 798 307 693 307 559 c
307 425 335 319 392 242 c
449 165 528 127 627 127 c
725 127 803 166 860 243 c
917 320 946 426 946 559 c
946 692 917 797 860 874 c
803 952 725 991 627 991 c

627 1147 m
787 1147 913 1095 1004 991 c
1095 887 1141 743 1141 559 c
1141 376 1095 232 1004 127 c
913 23 787 -29 627 -29 c
466 -29 340 23 249 127 c
158 232 113 376 113 559 c
113 743 158 887 249 991 c
340 1095 466 1147 627 1147 c

ce} d
/p{1300 0 186 -426 1188 1147 sc
371 168 m
371 -426 l
186 -426 l
186 1120 l
371 1120 l
371 950 l
410 1017 458 1066 517 1098 c
576 1131 647 1147 729 1147 c
865 1147 975 1093 1060 985 c
1145 877 1188 735 1188 559 c
1188 383 1145 241 1060 133 c
975 25 865 -29 729 -29 c
647 -29 576 -13 517 19 c
458 52 410 101 371 168 c

997 559 m
997 694 969 800 913 877 c
858 954 781 993 684 993 c
587 993 510 954 454 877 c
399 800 371 694 371 559 c
371 424 399 317 454 240 c
510 163 587 125 684 125 c
781 125 858 163 913 240 c
969 317 997 424 997 559 c

ce} d
/r{842 0 186 0 842 1147 sc
842 948 m
821 960 799 969 774 974 c
750 980 723 983 694 983 c
590 983 510 949 454 881 c
399 814 371 717 371 590 c
371 0 l
186 0 l
186 1120 l
371 1120 l
371 946 l
410 1014 460 1064 522 1097 c
584 1130 659 1147 748 1147 c
761 1147 775 1146 790 1144 c
805 1143 822 1140 841 1137 c
842 948 l

ce} d
/s{1067 0 111 -29 967 1147 sc
907 1087 m
907 913 l
855 940 801 960 745 973 c
689 986 631 993 571 993 c
480 993 411 979 365 951 c
320 923 297 881 297 825 c
297 782 313 749 346 724 c
379 700 444 677 543 655 c
606 641 l
737 613 829 573 884 522 c
939 471 967 400 967 309 c
967 205 926 123 843 62 c
761 1 648 -29 504 -29 c
444 -29 381 -23 316 -11 c
251 0 183 18 111 41 c
111 231 l
179 196 246 169 312 151 c
378 134 443 125 508 125 c
595 125 661 140 708 169 c
755 199 778 241 778 295 c
778 345 761 383 727 410 c
694 437 620 462 506 487 c
442 502 l
328 526 246 563 195 612 c
144 662 119 730 119 817 c
119 922 156 1004 231 1061 c
306 1118 412 1147 549 1147 c
617 1147 681 1142 741 1132 c
801 1122 856 1107 907 1087 c

ce} d
/t{803 0 55 0 754 1438 sc
375 1438 m
375 1120 l
754 1120 l
754 977 l
375 977 l
375 369 l
375 278 387 219 412 193 c
437 167 488 154 565 154 c
754 154 l
754 0 l
565 0 l
423 0 325 26 271 79 c
217 132 190 229 190 369 c
190 977 l
55 977 l
55 1120 l
190 1120 l
190 1438 l
375 1438 l

ce} d
/u{1298 0 174 -29 1112 1147 sc
174 442 m
174 1120 l
358 1120 l
358 449 l
358 343 379 263 420 210 c
461 157 523 131 606 131 c
705 131 784 163 841 226 c
899 289 928 376 928 485 c
928 1120 l
1112 1120 l
1112 0 l
928 0 l
928 172 l
883 104 831 53 772 20 c
713 -13 645 -29 567 -29 c
438 -29 341 11 274 91 c
207 171 174 288 174 442 c

637 1147 m
637 1147 l

ce} d
/v{1212 0 61 0 1151 1120 sc
61 1120 m
256 1120 l
606 180 l
956 1120 l
1151 1120 l
731 0 l
481 0 l
61 1120 l

ce} d
/x{1212 0 59 0 1145 1120 sc
1124 1120 m
719 575 l
1145 0 l
928 0 l
602 440 l
276 0 l
59 0 l
494 586 l
96 1120 l
313 1120 l
610 721 l
907 1120 l
1124 1120 l

ce} d
/y{1212 0 61 -426 1151 1120 sc
659 -104 m
607 -237 556 -324 507 -365 c
458 -406 392 -426 309 -426 c
162 -426 l
162 -272 l
270 -272 l
321 -272 360 -260 388 -236 c
416 -212 447 -155 481 -66 c
514 18 l
61 1120 l
256 1120 l
606 244 l
956 1120 l
1151 1120 l
659 -104 l

ce} d
end readonly def

/BuildGlyph {
 exch begin
 CharStrings exch
 2 copy known not {pop /.notdef} if
 true 3 1 roll get exec
 end
} d

/BuildChar {
 1 index /Encoding get exch get
 1 index /BuildGlyph get exec
} d

FontName currentdict end definefont pop
end
%%EndProlog
mpldict begin
-247.63 -132.404 translate
1107.26 1056.809 0 0 clipbox
gsave
0 0 m
1107.26 0 l
1107.26 1056.808625 l
0 1056.808625 l
cl
1.000 setgray
fill
grestore
gsave
14.3 186.378125 m
1096.46 186.378125 l
1096.46 1046.008625 l
14.3 1046.008625 l
cl
1.000 setgray
fill
grestore
1.000 setlinewidth
0 setlinejoin
0 setlinecap
[] 0 setdash
0.000 setgray
gsave
14.3 151.2625 m
375.02 151.2625 l
375.02 186.378125 l
14.3 186.378125 l
cl
gsave
1.000 setgray
fill
grestore
stroke
grestore
/DejaVuSans 12.000 selectfont
gsave

176.949063 165.507812 translate
0.000000 rotate
0.000000 0 m /N glyphshow
8.976562 0 m /a glyphshow
16.330078 0 m /m glyphshow
28.019531 0 m /e glyphshow
grestore
gsave
375.02 151.2625 m
735.74 151.2625 l
735.74 186.378125 l
375.02 186.378125 l
cl
gsave
1.000 setgray
fill
grestore
stroke
grestore
gsave

543.770625 165.507812 translate
0.000000 rotate
0.000000 0 m /A glyphshow
8.208984 0 m /g glyphshow
15.826172 0 m /e glyphshow
grestore
gsave
735.74 151.2625 m
1096.46 151.2625 l
1096.46 186.378125 l
735.74 186.378125 l
cl
gsave
1.000 setgray
fill
grestore
stroke
grestore
gsave

894.810938 165.507812 translate
0.000000 rotate
0.000000 0 m /g glyphshow
7.617188 0 m /e glyphshow
15.000000 0 m /n glyphshow
22.605469 0 m /d glyphshow
30.222656 0 m /e glyphshow
37.605469 0 m /r glyphshow
grestore
gsave
14.3 116.146875 m
375.02 116.146875 l
375.02 151.2625 l
14.3 151.2625 l
cl
gsave
1.000 setgray
fill
grestore
stroke
grestore
gsave

314.588625 130.392187 translate
0.000000 rotate
0.000000 0 m /T glyphshow
5.330078 0 m /o glyphshow
12.671875 0 m /m glyphshow
grestore
gsave
375.02 116.146875 m
735.74 116.146875 l
735.74 151.2625 l
375.02 151.2625 l
cl
gsave
1.000 setgray
fill
grestore
stroke
grestore
gsave

684.386750 130.392187 translate
0.000000 rotate
0.000000 0 m /two glyphshow
7.634766 0 m /zero glyphshow
grestore
gsave
735.74 116.146875 m
1096.46 116.146875 l
1096.46 151.2625 l
735.74 151.2625 l
cl
gsave
1.000 setgray
fill
grestore
stroke
grestore
gsave

1050.028625 130.392187 translate
0.000000 rotate
0.000000 0 m /M glyphshow
grestore
gsave
14.3 81.03125 m
375.02 81.03125 l
375.02 116.146875 l
14.3 116.146875 l
cl
gsave
1.000 setgray
fill
grestore
stroke
grestore
gsave

314.463625 95.276562 translate
0.000000 rotate
0.000000 0 m /n glyphshow
7.605469 0 m /i glyphshow
10.939453 0 m /c glyphshow
17.537109 0 m /k glyphshow
grestore
gsave
375.02 81.03125 m
735.74 81.03125 l
735.74 116.146875 l
375.02 116.146875 l
cl
gsave
1.000 setgray
fill
grestore
stroke
grestore
gsave

684.386750 95.276562 translate
0.000000 rotate
0.000000 0 m /two glyphshow
7.634766 0 m /one glyphshow
grestore
gsave
735.74 81.03125 m
1096.46 81.03125 l
1096.46 116.146875 l
735.74 116.146875 l
cl
gsave
1.000 setgray
fill
grestore
stroke
grestore
gsave

1050.028625 95.276562 translate
0.000000 rotate
0.000000 0 m /M glyphshow
grestore
gsave
14.3 45.915625 m
375.02 45.915625 l
375.02 81.03125 l
14.3 81.03125 l
cl
gsave
1.000 setgray
fill
grestore
stroke
grestore
gsave

309.869875 60.160937 translate
0.000000 rotate
0.000000 0 m /k glyphshow
6.949219 0 m /r glyphshow
11.882812 0 m /i glyphshow
15.216797 0 m /s glyphshow
21.468750 0 m /h glyphshow
grestore
gsave
375.02 45.915625 m
735.74 45.915625 l
735.74 81.03125 l
375.02 81.03125 l
cl
gsave
1.000 setgray
fill
grestore
stroke
grestore
gsave

684.386750 60.160937 translate
0.000000 rotate
0.000000 0 m /one glyphshow
7.634766 0 m /nine glyphshow
grestore
gsave
735.74 45.915625 m
1096.46 45.915625 l
1096.46 81.03125 l
735.74 81.03125 l
cl
gsave
1.000 setgray
fill
grestore
stroke
grestore
gsave

1050.028625 60.160937 translate
0.000000 rotate
0.000000 0 m /M glyphshow
grestore
gsave
14.3 10.8 m
375.02 10.8 l
375.02 45.915625 l
14.3 45.915625 l
cl
gsave
1.000 setgray
fill
grestore
stroke
grestore
gsave

314.713625 25.045312 translate
0.000000 rotate
0.000000 0 m /j glyphshow
3.333984 0 m /a glyphshow
10.687500 0 m /c glyphshow
17.285156 0 m /k glyphshow
grestore
gsave
375.02 10.8 m
735.74 10.8 l
735.74 45.915625 l
375.02 45.915625 l
cl
gsave
1.000 setgray
fill
grestore
stroke
grestore
gsave

684.386750 25.045312 translate
0.000000 rotate
0.000000 0 m /one glyphshow
7.634766 0 m /eight glyphshow
grestore
gsave
735.74 10.8 m
1096.46 10.8 l
1096.46 45.915625 l
735.74 45.915625 l
cl
gsave
1.000 setgray
fill
grestore
stroke
grestore
gsave

1050.028625 25.045312 translate
0.000000 rotate
0.000000 0 m /M glyphshow
grestore
1.500 setlinewidth
1 setlinejoin
1 setlinecap
gsave
1082.16 859.63 14.3 186.378 clipbox
838.88 899.625875 m
838.88 879.735875 l
838.88 879.735875 l
838.88 849.135875 m
838.88 849.135875 l
838.88 829.245875 l
stroke
grestore
gsave
1082.16 859.63 14.3 186.378 clipbox
838.88 823.125875 m
838.88 803.235875 l
863.18 803.235875 l
863.18 772.635875 l
814.58 772.635875 l
814.58 803.235875 l
838.88 803.235875 l
838.88 772.635875 m
838.88 752.745875 l
stroke
grestore
gsave
1082.16 859.63 14.3 186.378 clipbox
838.88 746.625875 m
838.88 726.735875 l
863.18 726.735875 l
863.18 696.135875 l
814.58 696.135875 l
814.58 726.735875 l
838.88 726.735875 l
863.18 726.735875 m
814.58 696.135875 l
834.83 721.635875 m
818.63 721.635875 l
834.83 716.535875 m
818.63 716.535875 l
838.88 696.135875 m
838.88 676.245875 l
stroke
grestore
gsave
1082.16 859.63 14.3 186.378 clipbox
838.88 703.785875 m
839.555 705.369848 l
840.23 706.845875 l
840.905 708.113369 l
841.58 709.08595 l
842.255 709.697341 l
842.93 709.905875 l
843.605 709.697341 l
844.28 709.08595 l
844.955 708.113369 l
845.63 706.845875 l
846.305 705.369848 l
846.98 703.785875 l
847.655 702.201902 l
848.33 700.725875 l
849.005 699.458381 l
849.68 698.4858 l
850.355 697.874409 l
851.03 697.665875 l
851.705 697.874409 l
852.38 698.4858 l
853.055 699.458381 l
853.73 700.725875 l
854.405 702.201902 l
855.08 703.785875 l
stroke
grestore
gsave
1082.16 859.63 14.3 186.378 clipbox
838.88 670.125875 m
838.88 650.235875 l
863.18 650.235875 l
863.18 619.635875 l
814.58 619.635875 l
814.58 650.235875 l
838.88 650.235875 l
863.18 650.235875 m
814.58 619.635875 l
842.93 629.835875 m
859.13 629.835875 l
842.93 624.735875 m
859.13 624.735875 l
838.88 619.635875 m
838.88 599.745875 l
stroke
grestore
gsave
1082.16 859.63 14.3 186.378 clipbox
822.68 642.585875 m
823.355 644.169848 l
824.03 645.645875 l
824.705 646.913369 l
825.38 647.88595 l
826.055 648.497341 l
826.73 648.705875 l
827.405 648.497341 l
828.08 647.88595 l
828.755 646.913369 l
829.43 645.645875 l
830.105 644.169848 l
830.78 642.585875 l
831.455 641.001902 l
832.13 639.525875 l
832.805 638.258381 l
833.48 637.2858 l
834.155 636.674409 l
834.83 636.465875 l
835.505 636.674409 l
836.18 637.2858 l
836.855 638.258381 l
837.53 639.525875 l
838.205 641.001902 l
838.88 642.585875 l
stroke
grestore
gsave
1082.16 859.63 14.3 186.378 clipbox
838.88 593.625875 m
838.88 573.735875 l
863.18 573.735875 l
863.18 543.135875 l
814.58 543.135875 l
814.58 573.735875 l
838.88 573.735875 l
863.18 573.735875 m
814.58 543.135875 l
834.83 568.635875 m
818.63 568.635875 l
834.83 563.535875 m
818.63 563.535875 l
842.93 553.335875 m
859.13 553.335875 l
842.93 548.235875 m
859.13 548.235875 l
838.88 543.135875 m
838.88 523.245875 l
stroke
grestore
gsave
1082.16 859.63 14.3 186.378 clipbox
838.88 517.125875 m
838.88 490.542125 l
838.88 473.329625 m
838.88 446.745875 l
stroke
grestore
gsave
1082.16 859.63 14.3 186.378 clipbox
851.03 490.542125 m
826.73 490.542125 l
stroke
grestore
gsave
1082.16 859.63 14.3 186.378 clipbox
844.955 484.804625 m
832.805 484.804625 l
stroke
grestore
gsave
1082.16 859.63 14.3 186.378 clipbox
851.03 479.067125 m
826.73 479.067125 l
stroke
grestore
gsave
1082.16 859.63 14.3 186.378 clipbox
844.955 473.329625 m
832.805 473.329625 l
stroke
grestore
gsave
1082.16 859.63 14.3 186.378 clipbox
790.28 394.725875 m
822.68 394.725875 l
855.08 394.725875 l
stroke
grestore
gsave
1082.16 859.63 14.3 186.378 clipbox
158.48 899.625875 m
158.48 887.385875 l
150.38 887.385875 l
166.58 887.385875 l
152.81 883.713875 m
164.15 883.713875 l
156.86 880.041875 m
160.1 880.041875 l
stroke
grestore
gsave
1082.16 859.63 14.3 186.378 clipbox
158.48 899.625875 m
stroke
grestore
gsave
1082.16 859.63 14.3 186.378 clipbox
158.48 899.625875 m
190.88 899.625875 l
223.28 899.625875 l
stroke
grestore
gsave
1082.16 859.63 14.3 186.378 clipbox
223.28 899.625875 m
223.28 887.385875 l
231.38 887.385875 l
231.38 841.485875 l
215.18 841.485875 l
215.18 887.385875 l
223.28 841.485875 m
223.28 829.245875 l
stroke
grestore
0 setlinecap
[5.55 2.4] 0 setdash
gsave
1082.16 859.63 14.3 186.378 clipbox
223.28 829.245875 m
223.28 824.655875 l
223.28 763.455875 l
223.28 758.865875 l
stroke
grestore
1 setlinecap
[] 0 setdash
gsave
1082.16 859.63 14.3 186.378 clipbox
223.28 758.865875 m
223.28 746.625875 l
231.38 746.625875 l
231.38 700.725875 l
215.18 700.725875 l
215.18 746.625875 l
223.28 700.725875 m
223.28 688.485875 l
stroke
grestore
gsave
1082.16 859.63 14.3 186.378 clipbox
223.28 688.485875 m
260.54 688.485875 l
297.8 688.485875 l
stroke
grestore
gsave
1082.16 859.63 14.3 186.378 clipbox
297.8 688.485875 m
310.76 688.485875 l
326.15 688.485875 l
335.06 703.785875 m
318.86 673.185875 l
343.16 703.785875 m
326.96 673.185875 l
335.87 688.485875 m
359.36 688.485875 l
372.32 688.485875 l
stroke
grestore
gsave
1082.16 859.63 14.3 186.378 clipbox
223.28 899.625875 m
260.54 899.625875 l
297.8 899.625875 l
stroke
grestore
gsave
1082.16 859.63 14.3 186.378 clipbox
297.8 899.625875 m
310.76 899.625875 l
326.15 899.625875 l
335.06 914.925875 m
318.86 884.325875 l
343.16 914.925875 m
326.96 884.325875 l
335.87 899.625875 m
359.36 899.625875 l
372.32 899.625875 l
stroke
grestore
gsave
1082.16 859.63 14.3 186.378 clipbox
372.32 899.625875 m
372.32 887.385875 l
380.42 887.385875 l
380.42 841.485875 l
364.22 841.485875 l
364.22 887.385875 l
372.32 841.485875 m
372.32 829.245875 l
stroke
grestore
0 setlinecap
[5.55 2.4] 0 setdash
gsave
1082.16 859.63 14.3 186.378 clipbox
372.32 829.245875 m
372.32 824.655875 l
372.32 763.455875 l
372.32 758.865875 l
stroke
grestore
1 setlinecap
[] 0 setdash
gsave
1082.16 859.63 14.3 186.378 clipbox
372.32 758.865875 m
372.32 746.625875 l
380.42 746.625875 l
380.42 700.725875 l
364.22 700.725875 l
364.22 746.625875 l
372.32 700.725875 m
372.32 688.485875 l
stroke
grestore
gsave
1082.16 859.63 14.3 186.378 clipbox
223.28 688.485875 m
223.28 668.595875 l
247.58 668.595875 l
247.58 637.995875 l
198.98 637.995875 l
198.98 668.595875 l
223.28 668.595875 l
223.28 637.995875 m
223.28 618.105875 l
stroke
grestore
gsave
1082.16 859.63 14.3 186.378 clipbox
223.28 618.105875 m
223.28 598.215875 l
247.58 598.215875 l
247.58 567.615875 l
198.98 567.615875 l
198.98 598.215875 l
223.28 598.215875 l
247.58 598.215875 m
198.98 567.615875 l
219.23 593.115875 m
203.03 593.115875 l
219.23 588.015875 m
203.03 588.015875 l
223.28 567.615875 m
223.28 547.725875 l
stroke
grestore
gsave
1082.16 859.63 14.3 186.378 clipbox
223.28 575.265875 m
223.955 576.849848 l
224.63 578.325875 l
225.305 579.593369 l
225.98 580.56595 l
226.655 581.177341 l
227.33 581.385875 l
228.005 581.177341 l
228.68 580.56595 l
229.355 579.593369 l
230.03 578.325875 l
230.705 576.849848 l
231.38 575.265875 l
232.055 573.681902 l
232.73 572.205875 l
233.405 570.938381 l
234.08 569.9658 l
234.755 569.354409 l
235.43 569.145875 l
236.105 569.354409 l
236.78 569.9658 l
237.455 570.938381 l
238.13 572.205875 l
238.805 573.681902 l
239.48 575.265875 l
stroke
grestore
gsave
1082.16 859.63 14.3 186.378 clipbox
223.28 547.725875 m
stroke
grestore
gsave
1082.16 859.63 14.3 186.378 clipbox
482.48 899.625875 m
482.48 887.385875 l
474.38 887.385875 l
490.58 887.385875 l
476.81 883.713875 m
488.15 883.713875 l
480.86 880.041875 m
484.1 880.041875 l
stroke
grestore
gsave
1082.16 859.63 14.3 186.378 clipbox
482.48 899.625875 m
stroke
grestore
gsave
1082.16 859.63 14.3 186.378 clipbox
482.48 899.625875 m
514.88 899.625875 l
547.28 899.625875 l
stroke
grestore
gsave
1082.16 859.63 14.3 186.378 clipbox
547.28 899.625875 m
547.28 887.385875 l
555.38 887.385875 l
555.38 841.485875 l
539.18 841.485875 l
539.18 887.385875 l
547.28 841.485875 m
547.28 829.245875 l
stroke
grestore
0 setlinecap
[5.55 2.4] 0 setdash
gsave
1082.16 859.63 14.3 186.378 clipbox
547.28 829.245875 m
547.28 824.655875 l
547.28 763.455875 l
547.28 758.865875 l
stroke
grestore
1 setlinecap
[] 0 setdash
gsave
1082.16 859.63 14.3 186.378 clipbox
547.28 758.865875 m
547.28 746.625875 l
555.38 746.625875 l
555.38 700.725875 l
539.18 700.725875 l
539.18 746.625875 l
547.28 700.725875 m
547.28 688.485875 l
stroke
grestore
gsave
1082.16 859.63 14.3 186.378 clipbox
547.28 688.485875 m
584.54 688.485875 l
621.8 688.485875 l
stroke
grestore
gsave
1082.16 859.63 14.3 186.378 clipbox
621.8 688.485875 m
634.76 688.485875 l
650.15 688.485875 l
659.06 703.785875 m
642.86 673.185875 l
667.16 703.785875 m
650.96 673.185875 l
659.87 688.485875 m
683.36 688.485875 l
696.32 688.485875 l
stroke
grestore
gsave
1082.16 859.63 14.3 186.378 clipbox
547.28 899.625875 m
584.54 899.625875 l
621.8 899.625875 l
stroke
grestore
gsave
1082.16 859.63 14.3 186.378 clipbox
621.8 899.625875 m
634.76 899.625875 l
650.15 899.625875 l
659.06 914.925875 m
642.86 884.325875 l
667.16 914.925875 m
650.96 884.325875 l
659.87 899.625875 m
683.36 899.625875 l
696.32 899.625875 l
stroke
grestore
gsave
1082.16 859.63 14.3 186.378 clipbox
696.32 899.625875 m
696.32 887.385875 l
704.42 887.385875 l
704.42 841.485875 l
688.22 841.485875 l
688.22 887.385875 l
696.32 841.485875 m
696.32 829.245875 l
stroke
grestore
0 setlinecap
[5.55 2.4] 0 setdash
gsave
1082.16 859.63 14.3 186.378 clipbox
696.32 829.245875 m
696.32 824.655875 l
696.32 763.455875 l
696.32 758.865875 l
stroke
grestore
1 setlinecap
[] 0 setdash
gsave
1082.16 859.63 14.3 186.378 clipbox
696.32 758.865875 m
696.32 746.625875 l
704.42 746.625875 l
704.42 700.725875 l
688.22 700.725875 l
688.22 746.625875 l
696.32 700.725875 m
696.32 688.485875 l
stroke
grestore
gsave
1082.16 859.63 14.3 186.378 clipbox
547.28 688.485875 m
547.28 668.595875 l
571.58 668.595875 l
571.58 637.995875 l
522.98 637.995875 l
522.98 668.595875 l
547.28 668.595875 l
547.28 637.995875 m
547.28 618.105875 l
stroke
grestore
gsave
1082.16 859.63 14.3 186.378 clipbox
547.28 618.105875 m
547.28 598.215875 l
571.58 598.215875 l
571.58 567.615875 l
522.98 567.615875 l
522.98 598.215875 l
547.28 598.215875 l
571.58 598.215875 m
522.98 567.615875 l
543.23 593.115875 m
527.03 593.115875 l
543.23 588.015875 m
527.03 588.015875 l
547.28 567.615875 m
547.28 547.725875 l
stroke
grestore
gsave
1082.16 859.63 14.3 186.378 clipbox
547.28 575.265875 m
547.955 576.849848 l
548.63 578.325875 l
549.305 579.593369 l
549.98 580.56595 l
550.655 581.177341 l
551.33 581.385875 l
552.005 581.177341 l
552.68 580.56595 l
553.355 579.593369 l
554.03 578.325875 l
554.705 576.849848 l
555.38 575.265875 l
556.055 573.681902 l
556.73 572.205875 l
557.405 570.938381 l
558.08 569.9658 l
558.755 569.354409 l
559.43 569.145875 l
560.105 569.354409 l
560.78 569.9658 l
561.455 570.938381 l
562.13 572.205875 l
562.805 573.681902 l
563.48 575.265875 l
stroke
grestore
gsave
1082.16 859.63 14.3 186.378 clipbox
547.28 547.725875 m
409.58 547.725875 l
394.19 547.725875 l
385.28 532.425875 m
401.48 563.025875 l
377.18 532.425875 m
393.38 563.025875 l
384.47 547.725875 m
360.98 547.725875 l
223.28 547.725875 l
stroke
grestore
gsave
1082.16 859.63 14.3 186.378 clipbox
223.28 547.725875 m
223.28 527.835875 l
247.58 527.835875 l
247.58 497.235875 l
198.98 497.235875 l
198.98 527.835875 l
223.28 527.835875 l
223.28 497.235875 m
223.28 477.345875 l
stroke
grestore
gsave
1082.16 859.63 14.3 186.378 clipbox
223.28 477.345875 m
271.88 477.345875 l
320.48 477.345875 l
stroke
grestore
gsave
1082.16 859.63 14.3 186.378 clipbox
320.48 477.345875 m
341.54 477.345875 l
341.54 500.295875 l
373.94 500.295875 l
373.94 454.395875 l
341.54 454.395875 l
341.54 477.345875 l
341.54 500.295875 m
373.94 454.395875 l
363.14 481.170875 m
363.14 496.470875 l
368.54 481.170875 m
368.54 496.470875 l
373.94 477.345875 m
395 477.345875 l
stroke
grestore
gsave
1082.16 859.63 14.3 186.378 clipbox
349.64 462.045875 m
347.962853 462.683375 l
346.4 463.320875 l
345.057948 463.958375 l
344.028155 464.595875 l
343.380801 465.233375 l
343.16 465.870875 l
343.380801 466.508375 l
344.028155 467.145875 l
345.057948 467.783375 l
346.4 468.420875 l
347.962853 469.058375 l
349.64 469.695875 l
351.317147 470.333375 l
352.88 470.970875 l
354.222052 471.608375 l
355.251845 472.245875 l
355.899199 472.883375 l
356.12 473.520875 l
355.899199 474.158375 l
355.251845 474.795875 l
354.222052 475.433375 l
352.88 476.070875 l
351.317147 476.708375 l
349.64 477.345875 l
stroke
grestore
gsave
1082.16 859.63 14.3 186.378 clipbox
395 477.345875 m
423.1475 477.345875 l
441.3725 477.345875 m
469.52 477.345875 l
stroke
grestore
gsave
1082.16 859.63 14.3 186.378 clipbox
423.1475 488.820875 m
423.1475 465.870875 l
stroke
grestore
gsave
1082.16 859.63 14.3 186.378 clipbox
429.2225 483.083375 m
429.2225 471.608375 l
stroke
grestore
gsave
1082.16 859.63 14.3 186.378 clipbox
435.2975 488.820875 m
435.2975 465.870875 l
stroke
grestore
gsave
1082.16 859.63 14.3 186.378 clipbox
441.3725 483.083375 m
441.3725 471.608375 l
stroke
grestore
gsave
1082.16 859.63 14.3 186.378 clipbox
223.28 477.345875 m
223.28 416.145875 l
223.28 354.945875 l
stroke
grestore
gsave
1082.16 859.63 14.3 186.378 clipbox
223.28 354.945875 m
223.28 331.230875 l
247.58 331.230875 l
247.58 285.330875 l
198.98 285.330875 l
198.98 331.230875 l
223.28 331.230875 l
223.28 308.280875 l
223.28 284.565875 l
stroke
grestore
0.800 setlinewidth
0 setlinejoin
2 setlinecap
gsave
14.3 186.378125 m
14.3 1046.008625 l
stroke
grestore
gsave
1096.46 186.378125 m
1096.46 1046.008625 l
stroke
grestore
gsave
14.3 186.378125 m
1096.46 186.378125 l
stroke
grestore
gsave
14.3 1046.008625 m
1096.46 1046.008625 l
stroke
grestore
1.500 setlinewidth
0 setlinecap
gsave
1082.16 859.63 14.3 186.378 clipbox
838.88 849.135875 m
843.17629 849.135875 847.297194 850.74798 850.33513 853.617141 c
853.373066 856.486303 855.08 860.378268 855.08 864.435875 c
855.08 868.493482 853.373066 872.385447 850.33513 875.254609 c
847.297194 878.12377 843.17629 879.735875 838.88 879.735875 c
834.58371 879.735875 830.462806 878.12377 827.42487 875.254609 c
824.386934 872.385447 822.68 868.493482 822.68 864.435875 c
822.68 860.378268 824.386934 856.486303 827.42487 853.617141 c
830.462806 850.74798 834.58371 849.135875 838.88 849.135875 c
cl
stroke
grestore
gsave
1082.16 859.63 14.3 186.378 clipbox
838.88 780.285875 m
841.028145 780.285875 843.088597 781.091927 844.607565 782.526508 c
846.126533 783.961089 846.98 785.907071 846.98 787.935875 c
846.98 789.964679 846.126533 791.910661 844.607565 793.345242 c
843.088597 794.779823 841.028145 795.585875 838.88 795.585875 c
836.731855 795.585875 834.671403 794.779823 833.152435 793.345242 c
831.633467 791.910661 830.78 789.964679 830.78 787.935875 c
830.78 785.907071 831.633467 783.961089 833.152435 782.526508 c
834.671403 781.091927 836.731855 780.285875 838.88 780.285875 c
cl
stroke
grestore
gsave
1082.16 859.63 14.3 186.378 clipbox
158.48 897.330875 m
159.124444 897.330875 159.742579 897.572691 160.198269 898.003065 c
160.65396 898.433439 160.91 899.017234 160.91 899.625875 c
160.91 900.234516 160.65396 900.818311 160.198269 901.248685 c
159.742579 901.679059 159.124444 901.920875 158.48 901.920875 c
157.835556 901.920875 157.217421 901.679059 156.761731 901.248685 c
156.30604 900.818311 156.05 900.234516 156.05 899.625875 c
156.05 899.017234 156.30604 898.433439 156.761731 898.003065 c
157.217421 897.572691 157.835556 897.330875 158.48 897.330875 c
cl
gsave
fill
grestore
stroke
grestore
gsave
1082.16 859.63 14.3 186.378 clipbox
231.38 887.385875 m
223.28 876.675875 l
215.18 887.385875 l
cl
stroke
grestore
gsave
1082.16 859.63 14.3 186.378 clipbox
231.38 746.625875 m
223.28 735.915875 l
215.18 746.625875 l
cl
stroke
grestore
gsave
1082.16 859.63 14.3 186.378 clipbox
380.42 887.385875 m
372.32 876.675875 l
364.22 887.385875 l
cl
stroke
grestore
gsave
1082.16 859.63 14.3 186.378 clipbox
380.42 746.625875 m
372.32 735.915875 l
364.22 746.625875 l
cl
stroke
grestore
gsave
1082.16 859.63 14.3 186.378 clipbox
223.28 645.645875 m
225.428145 645.645875 227.488597 646.451927 229.007565 647.886508 c
230.526533 649.321089 231.38 651.267071 231.38 653.295875 c
231.38 655.324679 230.526533 657.270661 229.007565 658.705242 c
227.488597 660.139823 225.428145 660.945875 223.28 660.945875 c
221.131855 660.945875 219.071403 660.139823 217.552435 658.705242 c
216.033467 657.270661 215.18 655.324679 215.18 653.295875 c
215.18 651.267071 216.033467 649.321089 217.552435 647.886508 c
219.071403 646.451927 221.131855 645.645875 223.28 645.645875 c
cl
stroke
grestore
gsave
1082.16 859.63 14.3 186.378 clipbox
223.28 545.430875 m
223.924444 545.430875 224.542579 545.672691 224.998269 546.103065 c
225.45396 546.533439 225.71 547.117234 225.71 547.725875 c
225.71 548.334516 225.45396 548.918311 224.998269 549.348685 c
224.542579 549.779059 223.924444 550.020875 223.28 550.020875 c
222.635556 550.020875 222.017421 549.779059 221.561731 549.348685 c
221.10604 548.918311 220.85 548.334516 220.85 547.725875 c
220.85 547.117234 221.10604 546.533439 221.561731 546.103065 c
222.017421 545.672691 222.635556 545.430875 223.28 545.430875 c
cl
gsave
fill
grestore
stroke
grestore
gsave
1082.16 859.63 14.3 186.378 clipbox
482.48 897.330875 m
483.124444 897.330875 483.742579 897.572691 484.198269 898.003065 c
484.65396 898.433439 484.91 899.017234 484.91 899.625875 c
484.91 900.234516 484.65396 900.818311 484.198269 901.248685 c
483.742579 901.679059 483.124444 901.920875 482.48 901.920875 c
481.835556 901.920875 481.217421 901.679059 480.761731 901.248685 c
480.30604 900.818311 480.05 900.234516 480.05 899.625875 c
480.05 899.017234 480.30604 898.433439 480.761731 898.003065 c
481.217421 897.572691 481.835556 897.330875 482.48 897.330875 c
cl
gsave
fill
grestore
stroke
grestore
gsave
1082.16 859.63 14.3 186.378 clipbox
555.38 887.385875 m
547.28 876.675875 l
539.18 887.385875 l
cl
stroke
grestore
gsave
1082.16 859.63 14.3 186.378 clipbox
555.38 746.625875 m
547.28 735.915875 l
539.18 746.625875 l
cl
stroke
grestore
gsave
1082.16 859.63 14.3 186.378 clipbox
704.42 887.385875 m
696.32 876.675875 l
688.22 887.385875 l
cl
stroke
grestore
gsave
1082.16 859.63 14.3 186.378 clipbox
704.42 746.625875 m
696.32 735.915875 l
688.22 746.625875 l
cl
stroke
grestore
gsave
1082.16 859.63 14.3 186.378 clipbox
547.28 645.645875 m
549.428145 645.645875 551.488597 646.451927 553.007565 647.886508 c
554.526533 649.321089 555.38 651.267071 555.38 653.295875 c
555.38 655.324679 554.526533 657.270661 553.007565 658.705242 c
551.488597 660.139823 549.428145 660.945875 547.28 660.945875 c
545.131855 660.945875 543.071403 660.139823 541.552435 658.705242 c
540.033467 657.270661 539.18 655.324679 539.18 653.295875 c
539.18 651.267071 540.033467 649.321089 541.552435 647.886508 c
543.071403 646.451927 545.131855 645.645875 547.28 645.645875 c
cl
stroke
grestore
gsave
1082.16 859.63 14.3 186.378 clipbox
223.28 504.885875 m
225.428145 504.885875 227.488597 505.691927 229.007565 507.126508 c
230.526533 508.561089 231.38 510.507071 231.38 512.535875 c
231.38 514.564679 230.526533 516.510661 229.007565 517.945242 c
227.488597 519.379823 225.428145 520.185875 223.28 520.185875 c
221.131855 520.185875 219.071403 519.379823 217.552435 517.945242 c
216.033467 516.510661 215.18 514.564679 215.18 512.535875 c
215.18 510.507071 216.033467 508.561089 217.552435 507.126508 c
219.071403 505.691927 221.131855 504.885875 223.28 504.885875 c
cl
stroke
grestore
/DejaVuSans 8.000 selectfont
gsave

858.320000 871.198375 translate
0.000000 rotate
0.000000 0 m /P glyphshow
4.824219 0 m /V glyphshow
10.296875 0 m /space glyphshow
12.839844 0 m /m glyphshow
20.632812 0 m /o glyphshow
25.527344 0 m /d glyphshow
30.605469 0 m /u glyphshow
35.675781 0 m /l glyphshow
37.898438 0 m /e glyphshow
grestore
gsave

858.320000 862.232750 translate
0.000000 rotate
0.000000 0 m /P glyphshow
4.824219 0 m /V glyphshow
10.296875 0 m /N glyphshow
16.281250 0 m /a glyphshow
21.183594 0 m /m glyphshow
28.976562 0 m /e glyphshow
grestore
gsave

858.320000 853.267125 translate
0.000000 rotate
0.000000 0 m /three glyphshow
5.089844 0 m /nine glyphshow
10.179688 0 m /period glyphshow
12.722656 0 m /zero glyphshow
17.812500 0 m /V glyphshow
grestore
gsave

866.420000 785.732750 translate
0.000000 rotate
0.000000 0 m /C glyphshow
5.585938 0 m /o glyphshow
10.480469 0 m /m glyphshow
18.273438 0 m /b glyphshow
23.351562 0 m /i glyphshow
25.574219 0 m /n glyphshow
30.644531 0 m /e glyphshow
35.566406 0 m /r glyphshow
38.855469 0 m /space glyphshow
41.398438 0 m /B glyphshow
46.886719 0 m /o glyphshow
51.531250 0 m /x glyphshow
grestore
gsave

866.420000 713.715562 translate
0.000000 rotate
0.000000 0 m /I glyphshow
2.359375 0 m /n glyphshow
7.429688 0 m /v glyphshow
12.164062 0 m /e glyphshow
17.085938 0 m /r glyphshow
20.375000 0 m /t glyphshow
23.511719 0 m /e glyphshow
28.433594 0 m /r glyphshow
31.722656 0 m /space glyphshow
34.265625 0 m /D glyphshow
40.425781 0 m /C glyphshow
46.011719 0 m /A glyphshow
51.359375 0 m /C glyphshow
56.945312 0 m /space glyphshow
59.488281 0 m /t glyphshow
62.625000 0 m /y glyphshow
67.359375 0 m /p glyphshow
72.437500 0 m /e glyphshow
77.359375 0 m /colon glyphshow
grestore
gsave

866.420000 704.749937 translate
0.000000 rotate
0.000000 0 m /I glyphshow
2.359375 0 m /n glyphshow
7.429688 0 m /v glyphshow
12.164062 0 m /N glyphshow
18.148438 0 m /a glyphshow
23.050781 0 m /m glyphshow
30.843750 0 m /e glyphshow
grestore
gsave

866.420000 637.215562 translate
0.000000 rotate
0.000000 0 m /I glyphshow
2.359375 0 m /n glyphshow
7.429688 0 m /v glyphshow
12.164062 0 m /e glyphshow
17.085938 0 m /r glyphshow
20.375000 0 m /t glyphshow
23.511719 0 m /e glyphshow
28.433594 0 m /r glyphshow
31.722656 0 m /space glyphshow
34.265625 0 m /A glyphshow
39.613281 0 m /C glyphshow
45.199219 0 m /D glyphshow
51.359375 0 m /C glyphshow
56.945312 0 m /space glyphshow
59.488281 0 m /t glyphshow
62.625000 0 m /y glyphshow
67.359375 0 m /p glyphshow
72.437500 0 m /e glyphshow
77.359375 0 m /colon glyphshow
grestore
gsave

866.420000 628.249937 translate
0.000000 rotate
0.000000 0 m /I glyphshow
2.359375 0 m /n glyphshow
7.429688 0 m /v glyphshow
12.164062 0 m /N glyphshow
18.148438 0 m /a glyphshow
23.050781 0 m /m glyphshow
30.843750 0 m /e glyphshow
grestore
gsave

866.420000 560.715562 translate
0.000000 rotate
0.000000 0 m /D glyphshow
6.160156 0 m /C glyphshow
11.746094 0 m /D glyphshow
17.906250 0 m /C glyphshow
23.492188 0 m /space glyphshow
26.035156 0 m /C glyphshow
31.621094 0 m /o glyphshow
36.515625 0 m /n glyphshow
41.585938 0 m /v glyphshow
46.320312 0 m /e glyphshow
51.242188 0 m /r glyphshow
54.531250 0 m /t glyphshow
57.667969 0 m /e glyphshow
62.589844 0 m /r glyphshow
65.878906 0 m /space glyphshow
68.421875 0 m /t glyphshow
71.558594 0 m /y glyphshow
76.292969 0 m /p glyphshow
81.371094 0 m /e glyphshow
86.292969 0 m /colon glyphshow
grestore
gsave

866.420000 551.749937 translate
0.000000 rotate
0.000000 0 m /I glyphshow
2.359375 0 m /n glyphshow
7.429688 0 m /v glyphshow
12.164062 0 m /N glyphshow
18.148438 0 m /a glyphshow
23.050781 0 m /m glyphshow
30.843750 0 m /e glyphshow
grestore
gsave

854.270000 484.215562 translate
0.000000 rotate
0.000000 0 m /B glyphshow
5.488281 0 m /a glyphshow
10.390625 0 m /t glyphshow
13.527344 0 m /t glyphshow
16.664062 0 m /e glyphshow
21.585938 0 m /r glyphshow
24.875000 0 m /y glyphshow
29.609375 0 m /space glyphshow
32.152344 0 m /t glyphshow
35.289062 0 m /y glyphshow
40.023438 0 m /p glyphshow
45.101562 0 m /e glyphshow
50.023438 0 m /colon glyphshow
grestore
gsave

854.270000 475.249937 translate
0.000000 rotate
0.000000 0 m /b glyphshow
5.078125 0 m /a glyphshow
9.980469 0 m /t glyphshow
13.117188 0 m /t glyphshow
16.253906 0 m /e glyphshow
21.175781 0 m /r glyphshow
24.464844 0 m /y glyphshow
grestore
gsave

858.320000 397.005562 translate
0.000000 rotate
0.000000 0 m /C glyphshow
5.585938 0 m /a glyphshow
10.488281 0 m /b glyphshow
15.566406 0 m /l glyphshow
17.789062 0 m /e glyphshow
22.710938 0 m /space glyphshow
25.253906 0 m /t glyphshow
28.390625 0 m /y glyphshow
33.125000 0 m /p glyphshow
38.203125 0 m /e glyphshow
43.125000 0 m /colon glyphshow
grestore
gsave

858.320000 388.039937 translate
0.000000 rotate
0.000000 0 m /C glyphshow
5.585938 0 m /a glyphshow
10.488281 0 m /b glyphshow
15.566406 0 m /l glyphshow
17.789062 0 m /e glyphshow
grestore
/DejaVuSans 16.000 selectfont
gsave

158.480000 925.811812 translate
0.000000 rotate
0.000000 0 m /E glyphshow
10.109375 0 m /l glyphshow
14.554688 0 m /e glyphshow
24.398438 0 m /c glyphshow
33.195312 0 m /t glyphshow
39.468750 0 m /r glyphshow
46.046875 0 m /i glyphshow
50.492188 0 m /c glyphshow
59.289062 0 m /a glyphshow
69.093750 0 m /l glyphshow
73.539062 0 m /space glyphshow
78.625000 0 m /s glyphshow
86.960938 0 m /c glyphshow
95.757812 0 m /h glyphshow
105.898438 0 m /e glyphshow
115.742188 0 m /m glyphshow
131.328125 0 m /e glyphshow
141.171875 0 m /space glyphshow
146.257812 0 m /space glyphshow
151.343750 0 m /P glyphshow
160.742188 0 m /r glyphshow
166.945312 0 m /o glyphshow
176.734375 0 m /j glyphshow
181.179688 0 m /N glyphshow
193.148438 0 m /a glyphshow
202.953125 0 m /m glyphshow
218.539062 0 m /e glyphshow
grestore
/DejaVuSans 8.000 selectfont
gsave

149.308125 870.903750 translate
0.000000 rotate
0.000000 0 m /G glyphshow
6.199219 0 m /N glyphshow
12.183594 0 m /D glyphshow
grestore
/DejaVuSans 16.000 selectfont
gsave

142.280000 797.291812 translate
0.000000 rotate
0.000000 0 m /B glyphshow
10.976562 0 m /B glyphshow
21.953125 0 m /space glyphshow
27.039062 0 m /space glyphshow
32.125000 0 m /one glyphshow
grestore
/DejaVuSans 8.000 selectfont
gsave

188.565000 862.232750 translate
0.000000 rotate
0.000000 0 m /P glyphshow
4.824219 0 m /V glyphshow
10.296875 0 m /one glyphshow
15.386719 0 m /hyphen glyphshow
18.273438 0 m /one glyphshow
grestore
gsave

183.471250 721.472750 translate
0.000000 rotate
0.000000 0 m /P glyphshow
4.824219 0 m /V glyphshow
10.296875 0 m /one glyphshow
15.386719 0 m /hyphen glyphshow
18.273438 0 m /two glyphshow
23.363281 0 m /five glyphshow
grestore
gsave

332.511250 862.232750 translate
0.000000 rotate
0.000000 0 m /P glyphshow
4.824219 0 m /V glyphshow
10.296875 0 m /one glyphshow
15.386719 0 m /zero glyphshow
20.476562 0 m /hyphen glyphshow
23.363281 0 m /one glyphshow
grestore
gsave

327.417500 721.472750 translate
0.000000 rotate
0.000000 0 m /P glyphshow
4.824219 0 m /V glyphshow
10.296875 0 m /one glyphshow
15.386719 0 m /zero glyphshow
20.476562 0 m /hyphen glyphshow
23.363281 0 m /two glyphshow
28.453125 0 m /five glyphshow
grestore
gsave

131.818125 660.058375 translate
0.000000 rotate
0.000000 0 m /C glyphshow
5.585938 0 m /o glyphshow
10.480469 0 m /m glyphshow
18.273438 0 m /b glyphshow
23.351562 0 m /i glyphshow
25.574219 0 m /n glyphshow
30.644531 0 m /e glyphshow
35.566406 0 m /r glyphshow
38.855469 0 m /space glyphshow
41.398438 0 m /B glyphshow
46.886719 0 m /o glyphshow
51.531250 0 m /x glyphshow
56.265625 0 m /space glyphshow
58.808594 0 m /one glyphshow
grestore
gsave

155.396250 651.092750 translate
0.000000 rotate
0.000000 0 m /I glyphshow
2.359375 0 m /n glyphshow
7.429688 0 m /p glyphshow
12.507812 0 m /u glyphshow
17.578125 0 m /t glyphshow
20.714844 0 m /s glyphshow
24.882812 0 m /colon glyphshow
27.578125 0 m /space glyphshow
30.121094 0 m /one glyphshow
35.210938 0 m /zero glyphshow
grestore
gsave

153.411875 642.127125 translate
0.000000 rotate
0.000000 0 m /O glyphshow
6.296875 0 m /u glyphshow
11.367188 0 m /t glyphshow
14.503906 0 m /p glyphshow
19.582031 0 m /u glyphshow
24.652344 0 m /t glyphshow
27.789062 0 m /s glyphshow
31.957031 0 m /colon glyphshow
34.652344 0 m /space glyphshow
37.195312 0 m /one glyphshow
grestore
/DejaVuSans 6.400 selectfont
gsave

228.140000 672.687304 translate
0.000000 rotate
0.000000 0 m /I glyphshow
1.880127 0 m /n glyphshow
5.920532 0 m /space glyphshow
7.946960 0 m /nine glyphshow
12.002930 0 m /seven glyphshow
16.058899 0 m /five glyphshow
20.114868 0 m /space glyphshow
22.141296 0 m /V glyphshow
26.502319 0 m /space glyphshow
28.528748 0 m /slash glyphshow
30.676575 0 m /space glyphshow
32.703003 0 m /nine glyphshow
36.758972 0 m /space glyphshow
38.785400 0 m /A glyphshow
grestore
gsave

228.140000 630.591946 translate
0.000000 rotate
0.000000 0 m /O glyphshow
5.017822 0 m /u glyphshow
9.058228 0 m /t glyphshow
11.557800 0 m /space glyphshow
13.584229 0 m /nine glyphshow
17.640198 0 m /seven glyphshow
21.696167 0 m /five glyphshow
25.752136 0 m /space glyphshow
27.778564 0 m /V glyphshow
32.139587 0 m /space glyphshow
34.166016 0 m /slash glyphshow
36.313843 0 m /space glyphshow
38.340271 0 m /nine glyphshow
42.396240 0 m /zero glyphshow
46.452209 0 m /space glyphshow
48.478638 0 m /A glyphshow
grestore
/DejaVuSans 8.000 selectfont
gsave

144.521250 589.678375 translate
0.000000 rotate
0.000000 0 m /I glyphshow
2.359375 0 m /n glyphshow
7.429688 0 m /v glyphshow
12.164062 0 m /e glyphshow
17.085938 0 m /r glyphshow
20.375000 0 m /t glyphshow
23.511719 0 m /e glyphshow
28.433594 0 m /r glyphshow
31.722656 0 m /space glyphshow
34.265625 0 m /N glyphshow
40.250000 0 m /r glyphshow
43.539062 0 m /space glyphshow
46.082031 0 m /one glyphshow
grestore
gsave

141.396250 580.712750 translate
0.000000 rotate
0.000000 0 m /M glyphshow
6.902344 0 m /a glyphshow
11.804688 0 m /x glyphshow
16.539062 0 m /space glyphshow
19.082031 0 m /I glyphshow
21.441406 0 m /n glyphshow
26.511719 0 m /p glyphshow
31.589844 0 m /u glyphshow
36.660156 0 m /t glyphshow
39.796875 0 m /s glyphshow
43.964844 0 m /colon glyphshow
46.660156 0 m /space glyphshow
49.203125 0 m /one glyphshow
grestore
gsave

137.911875 571.747125 translate
0.000000 rotate
0.000000 0 m /U glyphshow
5.855469 0 m /s glyphshow
10.023438 0 m /e glyphshow
14.945312 0 m /d glyphshow
20.023438 0 m /space glyphshow
22.566406 0 m /I glyphshow
24.925781 0 m /n glyphshow
29.996094 0 m /p glyphshow
35.074219 0 m /u glyphshow
40.144531 0 m /t glyphshow
43.281250 0 m /s glyphshow
47.449219 0 m /colon glyphshow
50.144531 0 m /space glyphshow
52.687500 0 m /one glyphshow
grestore
/DejaVuSans 6.400 selectfont
gsave

228.140000 602.307304 translate
0.000000 rotate
0.000000 0 m /I glyphshow
1.880127 0 m /n glyphshow
5.920532 0 m /space glyphshow
7.946960 0 m /nine glyphshow
12.002930 0 m /seven glyphshow
16.058899 0 m /five glyphshow
20.114868 0 m /space glyphshow
22.141296 0 m /V glyphshow
26.502319 0 m /space glyphshow
28.528748 0 m /slash glyphshow
30.676575 0 m /space glyphshow
32.703003 0 m /nine glyphshow
36.758972 0 m /zero glyphshow
40.814941 0 m /space glyphshow
42.841370 0 m /A glyphshow
grestore
gsave

228.140000 560.211946 translate
0.000000 rotate
0.000000 0 m /O glyphshow
5.017822 0 m /u glyphshow
9.058228 0 m /t glyphshow
11.557800 0 m /space glyphshow
13.584229 0 m /two glyphshow
17.640198 0 m /three glyphshow
21.696167 0 m /zero glyphshow
25.752136 0 m /space glyphshow
27.778564 0 m /V glyphshow
32.139587 0 m /space glyphshow
34.166016 0 m /slash glyphshow
36.313843 0 m /space glyphshow
38.340271 0 m /two glyphshow
42.396240 0 m /five glyphshow
46.452209 0 m /six glyphshow
50.508179 0 m /space glyphshow
52.534607 0 m /A glyphshow
grestore
/DejaVuSans 8.000 selectfont
gsave

473.308125 870.903750 translate
0.000000 rotate
0.000000 0 m /G glyphshow
6.199219 0 m /N glyphshow
12.183594 0 m /D glyphshow
grestore
/DejaVuSans 16.000 selectfont
gsave

466.280000 797.291812 translate
0.000000 rotate
0.000000 0 m /B glyphshow
10.976562 0 m /B glyphshow
21.953125 0 m /space glyphshow
27.039062 0 m /space glyphshow
32.125000 0 m /four glyphshow
grestore
/DejaVuSans 8.000 selectfont
gsave

512.565000 862.232750 translate
0.000000 rotate
0.000000 0 m /P glyphshow
4.824219 0 m /V glyphshow
10.296875 0 m /one glyphshow
15.386719 0 m /hyphen glyphshow
18.273438 0 m /one glyphshow
grestore
gsave

507.471250 721.472750 translate
0.000000 rotate
0.000000 0 m /P glyphshow
4.824219 0 m /V glyphshow
10.296875 0 m /one glyphshow
15.386719 0 m /hyphen glyphshow
18.273438 0 m /two glyphshow
23.363281 0 m /five glyphshow
grestore
gsave

656.511250 862.232750 translate
0.000000 rotate
0.000000 0 m /P glyphshow
4.824219 0 m /V glyphshow
10.296875 0 m /one glyphshow
15.386719 0 m /zero glyphshow
20.476562 0 m /hyphen glyphshow
23.363281 0 m /one glyphshow
grestore
gsave

651.417500 721.472750 translate
0.000000 rotate
0.000000 0 m /P glyphshow
4.824219 0 m /V glyphshow
10.296875 0 m /one glyphshow
15.386719 0 m /zero glyphshow
20.476562 0 m /hyphen glyphshow
23.363281 0 m /two glyphshow
28.453125 0 m /five glyphshow
grestore
gsave

455.818125 660.058375 translate
0.000000 rotate
0.000000 0 m /C glyphshow
5.585938 0 m /o glyphshow
10.480469 0 m /m glyphshow
18.273438 0 m /b glyphshow
23.351562 0 m /i glyphshow
25.574219 0 m /n glyphshow
30.644531 0 m /e glyphshow
35.566406 0 m /r glyphshow
38.855469 0 m /space glyphshow
41.398438 0 m /B glyphshow
46.886719 0 m /o glyphshow
51.531250 0 m /x glyphshow
56.265625 0 m /space glyphshow
58.808594 0 m /two glyphshow
grestore
gsave

479.396250 651.092750 translate
0.000000 rotate
0.000000 0 m /I glyphshow
2.359375 0 m /n glyphshow
7.429688 0 m /p glyphshow
12.507812 0 m /u glyphshow
17.578125 0 m /t glyphshow
20.714844 0 m /s glyphshow
24.882812 0 m /colon glyphshow
27.578125 0 m /space glyphshow
30.121094 0 m /one glyphshow
35.210938 0 m /zero glyphshow
grestore
gsave

477.411875 642.127125 translate
0.000000 rotate
0.000000 0 m /O glyphshow
6.296875 0 m /u glyphshow
11.367188 0 m /t glyphshow
14.503906 0 m /p glyphshow
19.582031 0 m /u glyphshow
24.652344 0 m /t glyphshow
27.789062 0 m /s glyphshow
31.957031 0 m /colon glyphshow
34.652344 0 m /space glyphshow
37.195312 0 m /one glyphshow
grestore
/DejaVuSans 6.400 selectfont
gsave

552.140000 672.687304 translate
0.000000 rotate
0.000000 0 m /I glyphshow
1.880127 0 m /n glyphshow
5.920532 0 m /space glyphshow
7.946960 0 m /nine glyphshow
12.002930 0 m /seven glyphshow
16.058899 0 m /five glyphshow
20.114868 0 m /space glyphshow
22.141296 0 m /V glyphshow
26.502319 0 m /space glyphshow
28.528748 0 m /slash glyphshow
30.676575 0 m /space glyphshow
32.703003 0 m /nine glyphshow
36.758972 0 m /space glyphshow
38.785400 0 m /A glyphshow
grestore
gsave

552.140000 630.591946 translate
0.000000 rotate
0.000000 0 m /O glyphshow
5.017822 0 m /u glyphshow
9.058228 0 m /t glyphshow
11.557800 0 m /space glyphshow
13.584229 0 m /nine glyphshow
17.640198 0 m /seven glyphshow
21.696167 0 m /five glyphshow
25.752136 0 m /space glyphshow
27.778564 0 m /V glyphshow
32.139587 0 m /space glyphshow
34.166016 0 m /slash glyphshow
36.313843 0 m /space glyphshow
38.340271 0 m /nine glyphshow
42.396240 0 m /zero glyphshow
46.452209 0 m /space glyphshow
48.478638 0 m /A glyphshow
grestore
/DejaVuSans 8.000 selectfont
gsave

468.521250 589.678375 translate
0.000000 rotate
0.000000 0 m /I glyphshow
2.359375 0 m /n glyphshow
7.429688 0 m /v glyphshow
12.164062 0 m /e glyphshow
17.085938 0 m /r glyphshow
20.375000 0 m /t glyphshow
23.511719 0 m /e glyphshow
28.433594 0 m /r glyphshow
31.722656 0 m /space glyphshow
34.265625 0 m /N glyphshow
40.250000 0 m /r glyphshow
43.539062 0 m /space glyphshow
46.082031 0 m /two glyphshow
grestore
gsave

465.396250 580.712750 translate
0.000000 rotate
0.000000 0 m /M glyphshow
6.902344 0 m /a glyphshow
11.804688 0 m /x glyphshow
16.539062 0 m /space glyphshow
19.082031 0 m /I glyphshow
21.441406 0 m /n glyphshow
26.511719 0 m /p glyphshow
31.589844 0 m /u glyphshow
36.660156 0 m /t glyphshow
39.796875 0 m /s glyphshow
43.964844 0 m /colon glyphshow
46.660156 0 m /space glyphshow
49.203125 0 m /one glyphshow
grestore
gsave

461.911875 571.747125 translate
0.000000 rotate
0.000000 0 m /U glyphshow
5.855469 0 m /s glyphshow
10.023438 0 m /e glyphshow
14.945312 0 m /d glyphshow
20.023438 0 m /space glyphshow
22.566406 0 m /I glyphshow
24.925781 0 m /n glyphshow
29.996094 0 m /p glyphshow
35.074219 0 m /u glyphshow
40.144531 0 m /t glyphshow
43.281250 0 m /s glyphshow
47.449219 0 m /colon glyphshow
50.144531 0 m /space glyphshow
52.687500 0 m /one glyphshow
grestore
/DejaVuSans 6.400 selectfont
gsave

552.140000 602.307304 translate
0.000000 rotate
0.000000 0 m /I glyphshow
1.880127 0 m /n glyphshow
5.920532 0 m /space glyphshow
7.946960 0 m /nine glyphshow
12.002930 0 m /seven glyphshow
16.058899 0 m /five glyphshow
20.114868 0 m /space glyphshow
22.141296 0 m /V glyphshow
26.502319 0 m /space glyphshow
28.528748 0 m /slash glyphshow
30.676575 0 m /space glyphshow
32.703003 0 m /nine glyphshow
36.758972 0 m /zero glyphshow
40.814941 0 m /space glyphshow
42.841370 0 m /A glyphshow
grestore
gsave

552.140000 560.211946 translate
0.000000 rotate
0.000000 0 m /O glyphshow
5.017822 0 m /u glyphshow
9.058228 0 m /t glyphshow
11.557800 0 m /space glyphshow
13.584229 0 m /two glyphshow
17.640198 0 m /three glyphshow
21.696167 0 m /zero glyphshow
25.752136 0 m /space glyphshow
27.778564 0 m /V glyphshow
32.139587 0 m /space glyphshow
34.166016 0 m /slash glyphshow
36.313843 0 m /space glyphshow
38.340271 0 m /two glyphshow
42.396240 0 m /five glyphshow
46.452209 0 m /six glyphshow
50.508179 0 m /space glyphshow
52.534607 0 m /A glyphshow
grestore
/DejaVuSans 8.000 selectfont
gsave

113.490000 519.298375 translate
0.000000 rotate
0.000000 0 m /C glyphshow
5.585938 0 m /o glyphshow
10.480469 0 m /m glyphshow
18.273438 0 m /b glyphshow
23.351562 0 m /i glyphshow
25.574219 0 m /n glyphshow
30.644531 0 m /e glyphshow
35.566406 0 m /r glyphshow
38.855469 0 m /space glyphshow
41.398438 0 m /B glyphshow
46.886719 0 m /o glyphshow
51.531250 0 m /x glyphshow
56.265625 0 m /space glyphshow
58.808594 0 m /A glyphshow
64.281250 0 m /l glyphshow
66.503906 0 m /l glyphshow
68.726562 0 m /space glyphshow
71.269531 0 m /B glyphshow
76.757812 0 m /B glyphshow
grestore
gsave

160.490000 510.332750 translate
0.000000 rotate
0.000000 0 m /I glyphshow
2.359375 0 m /n glyphshow
7.429688 0 m /p glyphshow
12.507812 0 m /u glyphshow
17.578125 0 m /t glyphshow
20.714844 0 m /s glyphshow
24.882812 0 m /colon glyphshow
27.578125 0 m /space glyphshow
30.121094 0 m /four glyphshow
grestore
gsave

153.411875 501.367125 translate
0.000000 rotate
0.000000 0 m /O glyphshow
6.296875 0 m /u glyphshow
11.367188 0 m /t glyphshow
14.503906 0 m /p glyphshow
19.582031 0 m /u glyphshow
24.652344 0 m /t glyphshow
27.789062 0 m /s glyphshow
31.957031 0 m /colon glyphshow
34.652344 0 m /space glyphshow
37.195312 0 m /one glyphshow
grestore
/DejaVuSans 6.400 selectfont
gsave

228.140000 531.927304 translate
0.000000 rotate
0.000000 0 m /I glyphshow
1.880127 0 m /n glyphshow
5.920532 0 m /space glyphshow
7.946960 0 m /two glyphshow
12.002930 0 m /three glyphshow
16.058899 0 m /zero glyphshow
20.114868 0 m /space glyphshow
22.141296 0 m /V glyphshow
26.502319 0 m /space glyphshow
28.528748 0 m /slash glyphshow
30.676575 0 m /space glyphshow
32.703003 0 m /two glyphshow
36.758972 0 m /five glyphshow
40.814941 0 m /six glyphshow
44.870911 0 m /space glyphshow
46.897339 0 m /A glyphshow
grestore
gsave

228.140000 489.831946 translate
0.000000 rotate
0.000000 0 m /O glyphshow
5.017822 0 m /u glyphshow
9.058228 0 m /t glyphshow
11.557800 0 m /space glyphshow
13.584229 0 m /two glyphshow
17.640198 0 m /three glyphshow
21.696167 0 m /zero glyphshow
25.752136 0 m /space glyphshow
27.778564 0 m /V glyphshow
32.139587 0 m /space glyphshow
34.166016 0 m /slash glyphshow
36.313843 0 m /space glyphshow
38.340271 0 m /one glyphshow
42.396240 0 m /zero glyphshow
46.452209 0 m /two glyphshow
50.508179 0 m /four glyphshow
54.564148 0 m /space glyphshow
56.590576 0 m /A glyphshow
grestore
/DejaVuSans 8.000 selectfont
gsave

316.849375 505.027750 translate
0.000000 rotate
0.000000 0 m /I glyphshow
2.359375 0 m /n glyphshow
7.429688 0 m /v glyphshow
12.164062 0 m /e glyphshow
17.085938 0 m /r glyphshow
20.375000 0 m /t glyphshow
23.511719 0 m /e glyphshow
28.433594 0 m /r glyphshow
31.722656 0 m /space glyphshow
34.265625 0 m /t glyphshow
37.402344 0 m /r glyphshow
40.691406 0 m /a glyphshow
45.593750 0 m /n glyphshow
50.664062 0 m /s glyphshow
54.832031 0 m /f glyphshow
57.648438 0 m /o glyphshow
62.542969 0 m /r glyphshow
65.707031 0 m /m glyphshow
73.500000 0 m /e glyphshow
78.421875 0 m /r glyphshow
grestore
/DejaVuSans 6.400 selectfont
gsave

287.203304 468.193375 translate
0.000000 rotate
0.000000 0 m /I glyphshow
1.880127 0 m /n glyphshow
5.920532 0 m /space glyphshow
7.946960 0 m /two glyphshow
12.002930 0 m /three glyphshow
16.058899 0 m /zero glyphshow
20.114868 0 m /space glyphshow
22.141296 0 m /V glyphshow
26.502319 0 m /space glyphshow
28.528748 0 m /slash glyphshow
30.676575 0 m /space glyphshow
32.703003 0 m /two glyphshow
36.758972 0 m /five glyphshow
40.814941 0 m /six glyphshow
44.870911 0 m /space glyphshow
46.897339 0 m /A glyphshow
grestore
gsave

376.948571 468.193375 translate
0.000000 rotate
0.000000 0 m /O glyphshow
5.017822 0 m /u glyphshow
9.058228 0 m /t glyphshow
11.557800 0 m /space glyphshow
13.584229 0 m /two glyphshow
17.640198 0 m /three glyphshow
21.696167 0 m /zero glyphshow
25.752136 0 m /space glyphshow
27.778564 0 m /V glyphshow
32.139587 0 m /space glyphshow
34.166016 0 m /slash glyphshow
36.313843 0 m /space glyphshow
38.340271 0 m /two glyphshow
42.396240 0 m /five glyphshow
46.452209 0 m /six glyphshow
50.508179 0 m /space glyphshow
52.534607 0 m /A glyphshow
grestore
/DejaVuSans 8.000 selectfont
gsave

404.463125 493.552750 translate
0.000000 rotate
0.000000 0 m /B glyphshow
5.488281 0 m /a glyphshow
10.390625 0 m /t glyphshow
13.527344 0 m /t glyphshow
16.664062 0 m /e glyphshow
21.585938 0 m /r glyphshow
24.875000 0 m /y glyphshow
29.609375 0 m /space glyphshow
32.152344 0 m /A glyphshow
37.625000 0 m /l glyphshow
39.847656 0 m /l glyphshow
42.070312 0 m /space glyphshow
44.613281 0 m /B glyphshow
50.101562 0 m /B glyphshow
grestore
gsave

132.286875 317.552750 translate
0.000000 rotate
0.000000 0 m /G glyphshow
6.199219 0 m /r glyphshow
9.488281 0 m /i glyphshow
11.710938 0 m /d glyphshow
16.789062 0 m /space glyphshow
19.332031 0 m /c glyphshow
23.730469 0 m /o glyphshow
28.625000 0 m /n glyphshow
33.695312 0 m /n glyphshow
38.765625 0 m /e glyphshow
43.687500 0 m /c glyphshow
48.085938 0 m /t glyphshow
51.222656 0 m /i glyphshow
53.445312 0 m /o glyphshow
58.339844 0 m /n glyphshow
grestore

end
showpage
