Update painlessMeshSTA.cpp

Status Job ID Name Coverage
  Test
failed #135241758
arduino

00:01:13

failed #135241757
platformio

00:02:07

 
Name Stage Failure
failed
arduino Test
	at cc.arduino.contributions.packages.ContributionInstaller.install(ContributionInstaller.java:102)
at processing.app.Base.<init>(Base.java:323)
at processing.app.Base.main(Base.java:144)
Caused by: java.io.IOException: Received invalid http status code from server: 404
at cc.arduino.utils.network.FileDownloader.downloadFile(FileDownloader.java:194)
at cc.arduino.utils.network.FileDownloader.download(FileDownloader.java:128)
at cc.arduino.contributions.DownloadableContributionsDownloader.download(DownloadableContributionsDownloader.java:129)
... 4 more
ERROR: Job failed: exit code 1
failed
platformio Test
*
*****************************************************************

#include <TimeLib.h>
^
compilation terminated.
*** [.pioenvs/nodemcuv2/lib62b/painlessMesh/painlessMeshSTA.cpp.o] Error 1
========================== [ERROR] Took 38.46 seconds ==========================
ERROR: Job failed: exit code 1