{
    "defaultSeverity": "error",
    "extends": ["tslint:recommended", "tslint-config-prettier"],
    "jsRules": {
        "no-unused-expression": true
    },
    "rules": {
        "eofline": false,
        "quotemark": [true, "single"],
        "indent": [true, "spaces"],
        "semicolon": [true, "always"],
        "member-access": [false],
        "ordered-imports": [false],
        "max-line-length": [true, 120],
        "member-ordering": [false],
        "curly": true,
        "no-duplicate-super": true,
        "no-shadowed-variable": false,
        "interface-name": [false],
        "array-type": [false],
        "no-empty-interface": false,
        "no-empty": false,
        "arrow-parens": false,
        "object-literal-sort-keys": false,
        "no-unused-expression": true,
        "max-classes-per-file": [false],
        "variable-name": [false],
        "one-line": [false],
        "one-variable-per-declaration": [false],
        "prefer-for-of": false
    },
    "rulesDirectory": []
}
