43.569 8.637 96.31
34.1 -7.1373 111.11
36.914 -9.1193 109.86
24.761 14.518 110.85
19.092 -13.501 127.93
37.635 3.7974 102.29
46.546 11.936 96.675
30.458 -8.7036 116.73
44.18 -0.13249 97.662
30.119 3.8449 106.26
48.698 -10.222 110.63
37.218 9.2166 98.643
21.467 9.2129 116.1
44.582 -0.22478 97.94
39.957 -5.6956 103.84
44.367 7.9852 96.08
32.614 -9.7053 110.66
45.288 -7.0954 105.82
48.859 -6.967 106.9
43.591 -0.49246 96.36
22.07 -3.8198 118.16
30.267 -9.6524 110.06
23.202 -2.9216 117.72
24.89 -17.866 129.99
49.368 2.1258 96.163
48.039 0.50631 97.124
23.443 -5.8819 117.26
20.112 -5.104 117.09
28.471 4.767 106.81
16.673 -1.2302 138.77
20.118 3.7559 126.83
43.23 -18.72 143.04
24.851 -9.1054 117.68
38.002 11.003 99.73
46.944 10.271 96.374
19.786 -5.5214 124
31.677 -9.1394 108.87
19.697 4.7979 112.22
44.796 4.628 95.65
19.002 6.137 117.7
21.591 7.4034 116.77
35.503 3.1491 103.07
25.983 -5.6636 117.3
42.993 -13.902 128.31
39.555 2.4239 101.07
34.278 -15.195 125.07
50.198 10.58 96.719
26.792 -6.7464 116.99
18.204 -6.6285 125.12
38.62 6.5814 99.392
20.776 -2.9696 119.65
32.284 -2.7178 105.51
53.344 -2.3161 100.95
27.351 -4.8817 117.03
51.377 4.7535 96.375
43.141 -6.8555 105.19
26.919 -10.047 117.06
39.477 -10.755 115.24
29.121 5.2409 106.26
18.506 10.848 120.96
37.509 -1.3822 101.95
43.314 1.5689 100.98
22.651 7.3273 112.25
48.055 3.3795 95.884
23.71 -8.5798 118.04
47.09 8.9978 96.302
45.553 4.9014 95.731
38.384 11.811 100.24
32.78 -3.015 105.52
23.993 -14.576 117.26
23.777 11.173 109.67
39.83 11.457 98.008
26.433 4.0366 108.74
47.116 10.088 96.355
34.053 10.396 103.96
26.632 -10.503 117.25
30.656 -4.4965 107.8
44.573 -16.642 138.05
18.409 5.5171 114.03
31.681 -14.029 120.12
45.283 12.613 96.303
44.559 -5.2852 103.43
47.521 -3.092 98.506
27.476 9.1467 108.83
43.784 -15.303 138.84
19.527 12.406 119.57
14.933 -3.3036 138.34
24.392 7.333 109.2
35.254 3.4339 102.91
33.982 -10.487 113.5
32.251 0.94518 105.41
33.027 -0.43825 105.04
43.725 8.4514 96.256
47.701 -0.13234 97.551
44.239 10.838 96.589
39.443 -2.7431 102.75
17.213 -4.6272 128.24
23.664 0.82758 116.72
38.269 5.8018 100.43
39.159 12.143 99.105
33.666 4.6304 101.61
34.284 3.9053 102.61
46.992 -0.22357 97.411
36.047 -17.72 126.34
20.928 -2.2115 121.18
19.857 5.7477 114.35
17.575 -2.2481 123.18
30.387 -13.024 118.16
20.787 -1.329 123.72
37.527 7.4819 100.21
41.534 -17.395 137.86
45.173 9.2651 96.263
41.196 0.053 101.84
32.946 4.5942 102.94
51.363 1.0467 96.519
27.605 -7.8259 116.71
38.202 -6.3613 103.57
36.887 -8.1293 107.67
19.709 -7.8879 126.49
19.653 -10.791 121.74
34.336 -11.602 116.14
47.864 4.7281 95.861
49.67 2.3937 96.048
20.603 -15.415 124.02
14.845 -5.5262 138.72
21.465 -13.241 119.11
46.403 -0.5899 97.518
22.56 1.8487 118.99
45.524 9.1725 96.239
43.859 -8.7761 108.17
27.991 -6.1474 116.04
28.189 0.36433 109.21
18.133 14.961 123.05
41.813 0.81476 101.48
50.49 0.68847 97.104
36.209 10.137 102.33
34.09 -8.3373 109.07
27.8 5.0917 107.32
34.909 -0.13977 103.03
30.203 -0.90769 114.52
32.71 -5.3788 107.24
41.113 -11.371 117.12
16.068 -10.548 141.47
49.424 -9.1639 110.4
34.109 8.4107 103.54
16.103 -9.5365 138.35
49.52 0.23425 97.708
44.575 -7.3073 106.01
29.72 11.649 103.82
23.034 14.232 111.05
51.895 0.14253 97.692
17.5 -2.4131 132.23
29.104 -6.209 107.67
30.405 -11.83 119.54
37.059 12.277 103.36
49.593 5.3698 96.074
35.538 8.0466 102.61
27.039 7.4483 107.9
52.375 11.75 97.389
25.72 10.018 108.31
23.659 -4.25 117.79
24.868 -4.1201 117.24
27.895 -0.88229 111.31
31.213 1.4421 105.57
37.224 10.961 101.96
37.666 -8.1585 106.73
34.002 -11.927 116.11
46.178 -3.8978 100.21
29.173 2.7527 106.45
36.706 11.229 102.65
53.66 -2.113 100.31
28.943 -11.129 114.63
34.903 9.8728 103.59
26.619 -16.089 121.2
19.773 4.6228 115.75
25.594 5.38 109.08
27.064 3.6172 108.4
23.144 12.822 110.57
25.755 1.1186 112.92
21.184 12.255 113.99
23.293 -3.1399 117.61
38.265 7.5742 98.958
38.207 5.4428 100.76
56.706 -4.0165 105.81
20.888 10.871 149.35
52.648 -2.216 100.71
47.825 10.266 96.327
30.413 -9.6003 116.98
31.642 8.0137 104.7
26.93 -5.5444 117.11
35.5 1.8195 104.49
27.998 11.116 104.3
44.587 -10.751 110.74
42.38 0.90989 101.47
29.836 -9.0367 108.87
44.071 0.78377 97.623
23.106 10.465 110.89
48.863 -6.1765 105.39
50.255 -1.6479 100.65
43.878 1.9621 96.994
17.289 -8.6976 129.71
32.044 -7.0856 111.94
42.473 5.9364 96.49
17.826 -6.7227 129.19
42.893 8.2847 96.417
32.73 7.7955 104.41
31.947 2.9321 105.71
50.19 4.4651 96.009
31.826 -16.372 124.21
23.993 12.155 109.24
21.067 2.7968 112.22
44.454 5.2584 95.687
29.683 1.8481 106.13
20.041 -12.503 126.34
50.738 9.1267 96.71
20.187 15.008 116.26
19.562 4.6183 118.42
25.681 -12.393 117.43
32.268 11.069 103.87
22.665 13.217 111.28
40.165 -7.6424 105.15
22.735 7.9518 112.14
34.656 8.2307 103.72
28.355 -2.0122 110.26
42.291 12.081 97.112
48.544 0.32494 97.406
24.811 -11.685 116.97
45.119 5.4423 95.763
41.931 1.9411 100.62
19.017 2.8528 129.05
34.207 1.1357 104.73
48.102 11.352 96.338
45.529 -21.395 152.54
34.637 1.2079 102.51
18.215 6.231 139.61
25.975 -4.7814 117.27
24.774 -2.8987 116.79
47.825 8.7289 96.326
37.815 10.012 98.269
26.149 4.4486 108.83
20.102 -6.7937 128.24
17.249 -4.216 126.74
22.59 -0.17367 128.02
46.33 7.1427 95.665
44.464 0.87231 97.279
38.299 -6.2483 103.31
32.698 4.4728 104.62
41.903 -0.23183 101.01
27.129 9.9385 107.45
25.389 13.609 107.77
44.141 -2.0012 99.43
22.253 2.2642 117.37
16.634 -7.0584 133.24
24.998 -13.153 117.33
20.787 -4.9978 117.18
42.882 8.0111 96.393
42.642 -0.60805 100.52
35.769 12.724 103.84
44.023 -12.743 121.83
29.14 8.747 105.25
21.495 -6.3642 118.04
44.866 2.0401 96.378
42.381 10.033 96.693
36.004 5.9097 102.3
42.991 0.33437 100.23
16.569 -2.1119 136.83
16.233 -11.059 142.92
49.929 3.9182 95.853
49.746 5.9182 96.194
47.05 2.3033 96.037
40.92 10.075 97.103
15.796 0.8699 141.41
17.286 -10.887 129.69
22.532 0.93005 131.18
37.848 -0.42486 101.83
39.95 3.4441 100.39
23.724 0.39038 117.02
45.145 -4.6631 102.56
19.898 -12.152 123.97
45.572 3.4654 95.771
40.035 -10.078 106.91
49.563 6.0986 96.191
25.421 12.465 106.63
44.242 -15.263 133.92
32.987 0.74607 105.23
37.236 6.8741 100.95
33.047 11.362 103.87
34.115 6.0452 102.97
17.29 -9.6044 128.81
50.297 11.965 96.909
26.574 4.6378 108.48
18.612 6.8297 120.17
22.837 6.7618 111.61
21.729 -11.135 118.11
31.469 0.054871 105.44
34.295 -1.7142 104.7
20.923 11.225 115.5
40 3.1654 100.52
17.498 -8.4999 128.57
13.804 -7.773 144.18
45.56 5.0819 95.746
35.682 -12.276 118.44
15.671 -10.552 145.18
29.382 -3.2871 107.95
28.864 9.4146 103.89
38.946 13.002 100.72
45.733 -5.1782 103.24
37.356 8.6433 99.504
18.237 -3.5857 117.75
42.684 9.2935 96.557
17.167 14.518 110.85
15.98 0.20527 140.7
38.008 4.6483 102.01
43.053 10.02 96.573
18.103 4.6269 134.87
44.778 -4.4628 102.38
23.094 10.771 110.83
40.983 -8.5407 106.5
21.618 8.9672 115.74
31.19 10.124 104.17
26.48 -3.6443 116.1
22.957 4.8188 112.71
32.478 -11.64 116.51
15.532 -0.45345 140.23
42.426 -6.0065 104.16
20.016 7.1458 119.8
26.779 -13.108 116.93
33.303 -1.0291 104.98
44.243 6.1645 95.813
25.95 -3.2103 116.17
47.367 0.9577 96.683
39.365 6.086 98.92
33.545 -3.3191 105.74
47.17 -10.411 112.69
36.703 -19.995 135.31
47.553 8.9998 96.324
38.099 -7.6238 103.55
47.111 -9.4264 109.84
50.061 -11.473 119.33
38.001 2.6374 101.99
32.372 -14.134 121.02
29.434 12.821 103.84
21.16 -8.3545 121.2
24.504 -6.5609 117.6
45.969 -9.4461 110.07
35.628 -0.71885 102.87
40.528 -2.9238 102.32
17.77 3.9626 138.19
48.803 2.3051 96.115
41.899 3.3103 99.205
24.521 1.3501 114.58
18.698 -2.5588 121.47
21.847 -13.023 118.15
19.319 -0.17236 127.05
43.095 10.665 96.667
35.395 -17.203 129.59
17.128 -7.0776 131.28
45.973 -3.3309 97.383
40.994 4.8521 98.374
48.086 8.3655 96.306
51.9 2.4009 96.339
25.281 14.518 110.85
21.383 3.6496 127.27
32.037 5.7083 105.68
31.766 2.7351 105.77
21.058 -1.2151 123.95
41.578 7.7834 96.936
16.564 -5.7835 132.68
50.636 -1.8473 101.22
51.274 -4.0019 102.88
46.329 -10.086 111.43
15.44 -9.9856 146.87
39.456 12.893 99.148
22.987 1.0609 118.31
32.085 4.8378 106.17
38.43 -1.4765 101.85
44.766 2.8421 95.969
50.64 3.6541 96.007
30.274 -8.6974 115.2
42.308 -8.6068 107.33
26.815 13.312 106.21
26.89 5.231 108.11
44.217 4.4443 95.562
26.714 -15.897 120.6
26.256 0.058941 113.26
44.562 -1.6982 98.098
42.518 -0.13657 100.67
26.132 3.5408 109.18
32.474 7.9027 104.53
38.606 -9.4389 109.98
42.082 -6.8438 105.01
30.458 -12.519 117.58
18.035 -11.418 131.6
24.732 -4.9069 117.63
20.35 -11.118 119.13
36.341 -3.178 104.37
42.678 -4.581 102.88
19.697 -12.605 122.72
32.903 2.8128 104.96
27.455 1.3989 109.97
24.236 10.998 108.95
36.557 -0.042742 102.23
36.322 3.7806 101.84
39.632 9.4778 97.521
34.614 12.241 103.89
30.377 -10.173 116
20.713 10.8 116.76
28.87 -0.74891 107.18
50.375 11.689 96.885
19.204 -5.1104 122.51
50.354 12.434 97.019
34.332 1.674 101.61
25.662 -12.824 117.34
21.954 -7.8899 119.34
42.302 -0.13679 100.83
44.698 4.5374 95.632
16.762 -11.676 130.35
37.895 -8.6571 107.96
18.089 4.5843 120.45
31.187 3.0442 106.16
43.473 -2.7948 101.13
29.537 -4.44 108.89
40.54 8.2679 97.285
15.952 -9.4714 139.3
13.319 -6.1128 143.32
43.689 6.7019 95.781
40.9 4.9442 98.369
52.97 -1.0636 99.016
21.372 -3.0708 119.22
21.403 -15.321 123.26
47.325 2.3035 96.046
37.494 -4.7424 104.31
17.645 2.3287 141.34
24.252 8.4829 109.49
17.29 -7.2886 130.64
38.513 6.5015 99.597
32.372 3.9156 105.48
33.027 -0.33966 105.04
23.377 11.848 110.21
25.058 -8.4381 117.61
23.408 5.9084 109.38
37.805 5.7373 100.95
16.228 6.6202 145.28
27.989 -11.655 115.58
45.119 1.2305 96.726
46.339 10.548 96.431
32.739 9.9244 104.13
38.934 5.1303 100.2
36.908 -4.6694 104.86
38.591 -4.4062 103.31
19.703 10.996 121.34
23.775 8.9463 110.13
44.326 -3.8637 101.79
43.348 -3.3842 101.73
44.603 1.8633 96.592
47.123 12.489 96.742
35.488 -2.0965 104.16
40.484 -4.9943 103.44
43.594 -1.0638 99.037
38.662 7.6172 98.314
24.638 11.208 108.03
27.814 2.172 107.37
40.189 9.1842 97.319
16.132 -7.0418 135.33
24.008 9.3298 109.78
30.216 -18.892 130.34
17.573 2.6671 131.84
34.385 -9.4991 110.68
35.851 -6.6276 107.9
37.98 8.7656 97.744
27.415 -1.1013 112.34
46.532 0.59567 96.834
16.574 1.0015 141.26
34.807 -1.4123 104.17
16.629 2.5601 139.5
14.585 -7.2179 141.26
42.889 10.115 96.611
43.52 -15.386 138.41
17.831 -4.1211 117.27
48.58 -7.7528 108.06
37.293 -4.8523 104.56
18.649 -14.158 127.36
39.108 1.8606 101.38
16.717 -11.889 130
17.412 -3.7409 122.85
38.449 2.438 101.65
21.621 8.5772 116.34
27.258 7.829 107.56
24.522 -7.56 117.69
40.185 -1.2803 101.46
33.964 1.925 104.89
49.122 1.6785 96.388
36.784 7.7512 101.27
41.514 6.177 97.428
42.137 -4.2854 102.74
40.783 8.1704 97.211
39.61 -2.8376 102.68
22.873 4.314 113.35
40.907 9.6164 97.072
39.676 10.13 97.63
39.15 11.435 98.612
21.917 8.2644 115.03
37.357 -11.492 119.53
42.179 1.4743 100.99
30.879 -6.6776 110.4
40.562 -6.8201 104.64
44.821 -5.5971 103.82
31.193 -1.9255 105.51
51.659 8.9631 96.904
46.489 10.089 96.367
50.173 10.03 96.669
37.378 -2.0712 102.91
35.606 10.822 103.37
36.046 6.476 102.14
39.216 3.3678 100.93
36.418 -2.7772 104.03
23.74 4.1731 112.42
21.729 11.929 112.93
37.736 0.052974 101.79
44.402 3.1956 95.769
22.635 2.7542 114.84
18.478 -8.6432 125.39
26.278 1.9346 111.1
13.444 -5.1166 141.81
23.718 4.6963 112.31
22.346 4.2904 115.57
32.726 4.8408 104.09
47.369 8.6377 96.318
45.185 2.9301 95.903
45.662 -1.4219 98.089
16.19 -10.4 129.69
45.74 -3.9248 100.9
37.644 10.015 98.306
39.326 8.3007 97.671
21.445 -8.8533 120.25
51.728 11.637 97.205
23.496 -14.719 117.52
31.663 9.924 104.12
33.066 1.5398 105.48
40.239 2.23 100.88
44.047 -9.4914 109.4
38.662 -0.99709 101.71
44.957 -2.9451 99.793
28.501 -3.2017 112.05
21.957 14.202 112.47
20.149 11.081 118.6
39.301 6.0904 98.993
26.754 12.837 105.57
33.174 -19.131 129.47
39.416 9.8587 97.667
34.199 6.3506 103.22
42.747 6.828 96.292
25.103 1.2342 113.81
28.965 -8.4965 116.9
39.3 10.727 98.064
51.991 -4.3271 103.74
21.673 10.734 113.75
38.19 -6.7653 103.8
17.762 9.3805 150.18
21.335 12.219 113.65
27.389 3.505 108.08
23.493 10.509 110.26
17.528 5.4756 140.4
41.62 -1.1826 101.24
31.757 9.8249 104.11
30.555 4.9158 105.7
54.205 -2.8349 102.58
27.301 -14.135 116.35
38.711 -1.3739 101.34
17.569 2.4892 135.64
16.09 -8.6802 137.13
20.478 -8.9087 122.57
18.648 13.233 124.17
14.947 2.8761 142.18
31.303 5.1067 105.54
47.118 -4.2657 97.861
31.347 8.0135 104.7
35.537 -18.802 130.56
31.843 3.9481 106.35
18.847 11.325 126.29
14.784 -2.1513 139.39
25.909 -1.4514 115.02
38.275 13.591 103.77
26.187 13.198 106.9
32.232 8.0138 104.7
19.655 10.867 122.46
39.668 2.1403 101.11
24.174 8.6972 109.6
20.099 12.465 146.67
47.535 -0.77648 97.964
27.882 -11.593 116.04
32.28 7.1184 104.54
37.764 5.5556 101.1
35.12 0.92434 103.08
28.811 -1.0596 108.09
51.73 -1.3736 101.32
26.997 8.3077 108.54
19.831 -1.5591 123.55
31.559 -6.3981 109.17
16.192 -10.112 139.12
47.118 3.6466 95.808
43.133 -5.0832 103.27
21.107 3.8074 120.9
54.832 -4.0394 106.42
32.95 11.069 103.87
26.793 5.9422 108.13
42.958 -16.197 135.42
46.507 -8.8162 108.67
14.939 -3.1751 138.4
23.944 6.6051 109.02
50.741 12.166 97.062
23.167 -11.19 117.54
15.141 -8.558 141.49
33.727 -4.8771 107.27
44.325 -5.596 103.8
27.603 -15.774 120.53
28.902 1.4504 106.18
20.364 8.6075 124.69
40.959 -9.7534 107.75
38.366 5.9761 100.19
38.819 4.6802 100.63
20.232 10.233 119.09
30.141 4.6307 105.98
22.567 2.142 116.71
50.862 -0.13318 98.175
25.47 -0.58765 114.99
46.112 -10.317 111.66
46.075 9.2647 96.258
16.238 -9.5925 137.29
45.493 -9.1851 109.42
30.242 -4.9162 108.13
42.692 4.8335 96.167
21.118 -7.0918 127.12
44.466 5.4395 95.713
20.361 -13.17 120.51
45.872 -8.1099 107.42
27.543 -1.5243 112.43
18.006 9.9897 116.26
23.553 4.3886 112.53
30.668 -5.6116 107.84
33.196 -11.293 115.21
40.021 5.5169 98.705
19.984 -13.565 123.07
24.475 -15.303 116.93
14.585 -6.1017 139.98
20.104 -8.1637 125.26
35.623 -6.6607 108.44
37.698 -8.831 108.85
38.97 4.9468 100.29
43.761 4.6229 95.545
20.688 -9.0797 121.78
26.632 5.545 108.3
30.294 -3.882 107.59
46.692 -8.934 108.86
20.305 3.9379 125.05
41.148 -4.2929 102.92
41.35 7.7919 97.042
37.446 12.941 100.25
19.395 12.953 119.44
37.73 -9.4005 110.74
29.531 12.236 103.84
33.246 -2.6166 105.42
43.254 9.0084 96.415
22.152 -1.8585 120.41
43.757 0.88198 98.358
46.042 1.4974 96.379
26.304 6.6832 108.63
22.511 2.0472 117.57
47.536 8.0026 96.29
36.803 4.8577 102.38
40.375 4.1639 99.579
33.815 5.3367 102.36
45.097 5.0804 95.717
45.237 10.092 96.399
39.075 -14.998 130.51
41.616 -3.9924 102.64
42.007 10.779 96.877
27.878 5.1883 107.23
19.542 -10.5 130.94
27.374 12.274 104.16
23.549 -12.149 116.16
23.03 -5.4479 117.4
52.906 -2.6593 103.24
25.162 10.781 106.81
28.491 1.0514 106.14
24.837 -11.087 117.61
44.554 5.3494 95.708
25.636 -14.413 117.73
48.87 9.3714 96.427
50.655 0.68824 97.072
34.561 -5.9058 107.67
29.302 7.1821 105.47
52.731 -0.59626 98.569
25.798 -0.58529 114.52
46.609 8.9018 96.241
21.714 12.239 112.85
43.441 -0.13191 97.238
27.374 11.673 104.91
38.485 -5.1547 102.77
38.192 6.5265 99.98
42.97 -1.6475 100.62
28.882 6.2295 106.11
42.639 -0.41934 100.51
22.068 8.6289 114.14
37.701 3.9862 102.21
44.208 10.468 96.522
33.17 8.6173 104.87
44.927 5.351 95.738
29.386 6.1106 105.77
13.95 -6.8992 142.89
35.845 9.6886 102.66
39.252 -3.7259 103.26
26.391 -13.683 117.16
32.563 3.5082 105.13
19.723 -13.355 124.34
23.092 -13.417 117.72
13.465 -6.9959 144.9
31.818 10.399 103.99
34.957 -6.7445 111.51
38.765 10.875 98.574
43.213 -16.245 135.82
37.808 7.5382 99.71
42.996 -3.291 101.8
38.84 8.9359 97.601
20.52 -3.5064 118.81
41.867 2.5865 100.02
27.3 13.311 104.63
32.15 -4.2776 107.38
20.067 2.6053 128.79
44.305 -6.3307 104.67
13.519 -7.7066 145.48
25.163 -8.436 117.58
48.173 8.2745 96.299
36.044 -1.792 103.51
44.004 -4.069 102.15
17.709 8.7214 148.56
43.206 2.8147 98.155
30.115 -15.792 121.54
35.99 -5.7586 106.81
46.58 5.3551 95.81
30.681 4.7215 105.79
23.201 -9.1515 118.27
32.28 -3.4106 105.5
25.195 -0.37254 115.21
37.176 1.9795 102.61
23.493 -2.4754 117.51
26.833 -3.6331 115.74
43.084 -1.2648 100.23
13.845 -5.9158 141.82
35.748 5.16 102.66
26.185 -4.4495 117.22
36.994 7.3563 101.07
47.51 2.3037 96.055
38.067 -7.559 104
37.141 1.3008 102.26
30.84 5.5721 104.98
35.646 13.591 103.77
51.402 -2.6467 102.75
22.185 -16.336 125.73
16.223 2.0347 139.38
33.993 -10.63 113.89
35.044 6.4071 102.58
32.351 2.8249 105.41
23.418 13.734 110.4
26.888 0.7903 111.47
18.367 -1.621 138.78
27.383 5.3099 107.66
21.446 10.889 114.24
33.476 -2.1176 105.21
23.205 9.9424 110.87
37.642 -4.0415 103.9
33.128 7.7738 104.12
47.408 -4.5749 100.62
17.535 -9.0603 127.96
43.247 10.386 96.601
21.376 6.2891 114.44
39.493 2.2361 101.15
43.546 8.271 96.259
43.683 -10.086 110.29
17.128 -7.3241 131.28
45.745 8.6213 96.135
16.925 -10.691 128.8
19.74 9.419 121.57
25.777 -7.4291 117.37
26.908 4.7267 108.18
51.9 9.2725 96.339
49.407 4.3615 95.712
27.706 2.9883 107.74
34.659 -8.176 108.29
18.245 -5.1466 126.22
28.334 8.5149 104.82
51.096 5.1144 96.357
55.816 -3.367 104.15
29.214 -16.995 124.5
21.541 12.791 113.06
28.154 13.348 104.16
28.332 -6.536 115.21
37.598 -4.3402 104.05
22.742 -3.2663 118.2
22.943 -16.075 122.83
49.487 7.9207 96.393
47.836 -10.051 111.04
34.13 5.8378 102.72
44.406 -6.8678 105.37
22.885 -4.3606 117.79
41.486 -16.098 133.54
27.441 1.7077 109.91
45.886 -6.6696 105.37
28.352 -5.6108 113.99
46.871 6.437 95.854
56.646 -3.8006 105.33
18.365 -7.6147 127.88
45.685 1.588 96.388
23.54 1.4771 116.11
19.259 12.41 120.7
27.704 3.0891 107.73
37.717 8.6482 98.497
40.425 6.6505 97.667
23.803 3.6553 112.72
19.369 4.8482 124.31
51.9 2.4914 96.339
15.012 -2.1465 139.07
49.977 -3.4627 101.24
19.185 9.5981 128.55
44.312 2.4013 96.353
41.426 11.638 97.22
27.886 9.1214 103.89
25.82 10.422 106.22
35.319 1.7174 104.24
50.305 -7.7842 108.5
47.488 -3.1823 98.438
37.209 -4.756 104.6
24.643 -8.8889 117.74
15.555 -0.19052 140.44
47.194 9.6332 96.33
37.149 11.38 102.28
17.189 -6.3156 130.8
20.106 -10.5 121.02
53.056 -1.2515 99.175
26.29 -6.3184 117.2
20.343 13.004 115.9
45.624 -1.4236 98.205
18.878 6.0576 118.31
24.94 6.4198 109.35
39.181 -1.9586 102.07
32.613 10.111 104.04
45.864 2.4827 96.006
18.072 -12.462 128.36
37.764 10.801 99.594
18.606 0.42662 127.88
39.124 10.061 97.852
37.084 9.3688 99.275
50.789 8.0311 96.633
31.084 -13.69 119.13
22.271 -3.927 118.05
24.044 -17.809 131.37
45.165 -8.8131 108.63
50.234 12.336 96.963
48.641 -1.4365 99.095
39.549 0.052843 101.54
44.128 -3.9671 101.99
36.43 -1.787 103.23
51.08 6.118 96.497
38.612 7.366 98.657
43.598 10.474 96.576
30.246 0.84829 105.66
44.15 4.8953 95.612
26.44 -3.4212 115.93
49.367 12.392 96.691
46.292 2.5716 95.959
29.992 -2.1296 105.81
42.589 6.1082 96.343
38.939 -9.5269 107.48
37.227 9.4948 97.696
38.684 -17.051 135.13
22.757 -7.4864 118.27
22.706 3.6833 113.58
37.427 -4.1476 104.12
44.894 12.046 96.829
19.09 -12.497 128.72
37.832 -8.7439 107.78
33.381 -13.835 121.38
14.445 -5.573 139.9
41.931 10.874 96.911
20.918 9.7999 117.92
37.147 0.53177 102.01
44.468 -1.5109 97.893
23.228 -0.049505 118.41
45.372 12.325 96.878
29.945 -3.3719 107.42
27.772 8.4934 104.56
35.514 0.9373 104.53
24.142 12.127 108.99
32.021 2.7315 105.62
38.811 2.9064 101.35
38.602 3.7606 101.3
26.551 11.434 106.35
44.34 -2.4789 99.879
45.712 -10.065 111.2
30.503 12.82 103.83
39.72 11.662 98.191
22.323 -16.095 123.87
39.744 -8.2495 105.34
21.459 10.195 114.89
43.928 2.8462 96.108
31.922 -13.378 119.34
29.071 5.9287 106.07
15.406 3.9586 142.72
23.486 2.0789 133.81
40.687 4.7779 98.748
42.392 0.052469 100.82
36.898 -6.9438 106.54
48.098 -13.36 130.07
39.024 -4.617 103.69
43.476 -3.7772 102.03
28.891 -10.226 116.6
41.457 -5.7985 103.93
48.033 -4.1977 98.42
26.791 6.2461 108.12
26.196 3.1387 109.45
28.405 8.0432 105.09
16.207 -6.8929 134.9
53.775 -3.225 105.91
36.569 -18.399 130.31
19.428 3.3455 129.37
28.759 -0.56533 110.62
23.11 14.11 110.91
38.129 1.8686 101.82
42.714 1.9381 100.47
28.4 -10.794 116.83
21.599 -13.075 118.62
17.586 2.3642 135.77
15.994 -2.8715 136.32
18.006 7.3848 144.23
19.833 -2.3302 121.44
16.194 -9.0526 136.92
41.317 8.4228 96.966
50.501 -3.2945 101.91
45.309 -13.344 128.73
41.827 -13.093 125.18
42.436 -4.3828 102.76
45.591 8.0686 96
38.977 -2.6676 103.56
34.728 -13.258 121.31
29.081 -5.3238 110.26
18.89 -1.9057 123.47
38.814 -6.887 104.17
42.219 -0.4208 100.86
51.108 3.0245 96.041
35.13 -1.1137 103.68
43.999 10.008 96.46
27.606 5.899 107.34
25.995 10.332 107.35
20.82 10.195 117.36
33.527 -1.7202 105.06
35.626 9.8042 102.87
47.198 0.32386 97.082
45.768 -3.0675 97.726
21.572 0.30782 128.4
20.63 8.1305 122.79
20.089 12.684 116.96
36.098 -7.8747 108.34
33.931 10.389 103.89
36.932 -7.6925 107.22
37.016 9.6346 100.1
25.146 3.5756 110.25
17.523 -7.476 129.64
34.1 -2.7126 105.31
35.438 7.8532 102.6
41.978 4.725 97.655
33.467 2.9898 104.26
23.744 -11.865 117.66
20.442 11.865 116.47
50.242 9.3002 96.627
16.988 -9.2861 131.15
27.984 3.0755 107.25
42.662 6.4672 96.303
50.713 3.2926 95.974
30.795 -5.4136 107.93
44.767 2.1302 96.361
44.264 -2.5792 100.13
23.551 11.006 110.05
19.55 -5.8935 127
45.918 -3.7039 100.05
23.537 -13.971 117.73
43.632 1.1882 100.84
13.796 -5.3644 141.32
25.142 -6.5547 117.49
46.38 4.8135 95.768
17.653 -2.9164 122.12
33.051 5.3529 102.67
51.491 7.6785 96.76
49.965 7.6533 96.443
40.7 11.391 97.449
44.231 -1.6142 98.592
30.545 -7.5262 110.69
28.983 -2.1581 107.22
48.997 -13.719 131.17
30.303 -4.5041 107.98
23.898 -6.2735 118.42
23.457 9.2943 110.58
34.811 12.242 103.89
24.462 2.3986 113.32
36.421 5.0769 102.93
18.633 -7.0541 126.44
23.985 4.0555 112.08
34.751 -0.33443 103.42
31.248 7.2731 105.36
20.95 -2.4283 120.65
23.089 -2.2693 118.27
27.35 4.1078 107.93
37.783 -6.5206 104.56
49.336 -2.4898 100.32
29.952 -2.2334 106.02
43.08 0.51128 98.077
23.197 0.94208 132.87
26.753 4.4302 108.38
40.342 5.0591 98.811
38.945 1.7667 101.45
39.137 12.613 96.303
23.394 0.61288 117.57
13.256 -3.505 141.22
33.027 -0.24108 105.04
18.244 -13.015 127.88
29.456 -7.0244 109.35
26.136 7.509 108.78
25.352 3.8543 109.36
44.608 6.3452 95.825
28.621 -13.174 114.64
52.302 -1.5753 102.06
23.428 -7.0107 117.74
44.805 9.0831 96.248
26.958 -2.5179 114.43
28.929 -0.34487 106.65
35.596 9.6033 102.78
27.22 -9.2677 116.94
36.151 -1.5938 103.26
29.719 2.2491 106.25
44.173 -6.6499 105.06
47.831 -4.7402 100.12
28.146 -11.91 114.9
37.812 -7.3302 104.91
19.851 6.2769 116.2
46.453 9.4489 96.294
42.449 4.686 96.849
32.084 -5.1378 108.52
45.167 4.3598 95.675
51.157 4.6596 96.302
33.843 -0.43607 104.52
23.252 -10.235 117.97
29.82 -3.1677 107.34
20.198 -11.046 119.55
29.427 4.4441 106.28
38.032 5.6341 100.8
30.459 -6.9212 112.68
24.017 -8.4602 117.92
46.494 10.181 96.378
19.624 4.5849 126.71
20.461 13.7 115.34
23.766 -7.2338 117.77
21.234 12.756 113.68
53.963 -3.2814 104.54
36.046 11.744 103.8
35.366 10.838 103.52
30.205 -0.24217 105.51
25.057 -9.8726 117.61
34.307 -15.495 125.61
42.675 -14.779 132.95
23.725 -14.283 117.57
24.438 -0.26677 116.23
32.249 9.1145 103.81
15.412 2.8633 141.54
37.114 10.861 101.92
38.657 -2.7837 104.27
21.953 8.5604 114.65
46.253 -3.7791 99.558
47.434 -9.9498 111.08
50.545 -0.041013 98.096
24.648 -12.372 117.23
32.855 10.778 103.87
21.113 -3.289 119.01
21.237 9.0485 124.32
36.982 -10.969 115.21
30.995 12.724 103.85
40.455 2.4153 100.71
26.271 3.8386 108.91
36.063 -6.3909 107.33
46.285 2.0349 96.133
38.459 -10.605 114.78
36.995 -5.6821 105.39
16.902 5.2633 141.78
29.82 -2.5461 106.62
41.757 1.9418 100.66
19.12 3.2335 129.74
35.41 -2.0976 104.22
32.414 -6.5298 113.23
22.874 -9.8201 118.3
42.017 -18.658 142.57
46.667 7.0631 95.804
19.16 -0.8805 126.01
27.43 12.103 104.37
36.053 12.039 103.82
34.613 -0.72591 103.88
23.494 -6.6666 117.52
24.458 3.716 111.36
21.056 -7.1451 121.92
22.023 0.066727 128.22
52.392 0.14263 97.763
21.721 7.336 115.71
42.853 9.3815 96.531
21.435 9.0696 121.47
39.129 4.0218 100.7
37.273 -5.2559 104.78
47.314 3.3779 95.839
40.985 9.4311 97.04
23.203 -8.4863 118.28
26.033 -15.05 117.53
21.317 7.0925 117.07
44.662 3.2848 95.747
49.389 4.6377 95.852
51.856 8.6928 96.933
34.808 3.9101 102.73
21.294 -8.6579 120.68
20.458 -8.6038 123.14
49.864 -2.5249 98.025
21.045 9.4143 118.63
43.85 2.3943 99.83
47.904 12.613 96.303
38.444 -5.4657 103.18
20.011 9.5048 119.77
47.466 9.6334 96.331
18.518 -0.054266 129.8
49.792 -6.4304 106.32
25.162 0.91587 114.08
18.889 7.0241 139.75
27.98 -6.3625 115.99
48.792 3.5607 95.917
36.994 -9.3982 110.72
41.066 -8.2174 106.2
34.044 6.0497 103.05
44.494 -2.9641 100.44
30.757 -5.8935 107.44
25.431 -1.7871 115.79
36.678 10.151 101.5
34.968 7.2014 102.92
49.703 3.1112 95.938
28.743 -14.31 116.89
41.727 5.6324 97.497
30.835 -8.7817 109.51
38.551 7.3721 98.738
24.484 -14.98 116.98
24.616 4.8975 109.73
38.764 9.2145 97.64
30.494 -9.701 116.87
29.102 -0.44303 106.19
40.021 -10.698 114.62
20.002 -5.104 117.09
43.837 12.055 96.902
32.426 3.5147 105.33
43.756 -6.6464 105
54.055 -3.2751 104.34
23.623 3.251 113.37
23.005 -10.776 117.83
34.928 3.0529 103.09
32.284 -3.1139 105.51
