75.799 19.287 8.6342
41.871 7.9701 45.896
77.557 19.315 -25.168
104.54 -2.4089 -25.868
50.804 10.999 15.967
92.054 -12.502 24.849
117.7 6.5411 -5.8888
66.335 -11.168 -15.02
93.411 6.5661 -37.544
93.411 6.5661 -37.544
89.981 0.5451 -10.725
92.188 3.2591 -38.611
93.244 -5.4549 -36.762
87.502 11.885 48.351
90.384 2.3911 41.891
73.963 6.6821 -1.5288
65.29 12.36 18.856
70.41 14.905 38.4
87.324 -9.2539 -38.665
93.718 6.9391 9.6912
87.892 0.34512 -39.665
83.057 8.8221 19.323
91.772 -0.47488 39.791
87.892 -2.5379 -39.665
91.543 7.1291 12.261
81.554 -1.7579 1.6512
67.698 10.738 1.9522
101.21 -9.2369 -25.627
56.343 24.203 10.156
85.181 38.831 1.2492
77.538 48.23 42.47
51.576 31.495 53.422
52.236 33.211 30.07
85.699 -1.6979 1.3632
92.413 4.8021 2.6512
65.618 19.348 41.553
71.868 25.502 29.67
87.138 3.6271 -15.599
99.685 -2.3559 30.361
75.08 21.577 -20.405
63.554 19.816 40.124
69.887 47.174 51.713
88.477 3.0951 8.7282
49.44 6.7251 20.324
83.651 -14.466 22.099
61.101 6.8991 24.442
61.191 16.132 41.268
105.38 3.4861 25.062
95.378 12.93 -33.347
86.195 -8.6559 -39.075
79.925 2.6001 -36.85
76.434 0.26511 -9.0918
79.131 23.215 34.239
75.546 24.187 13.577
56.86 -0.25589 42.97
64.45 19.361 41.394
81.773 0.32413 5.5452
69.887 47.174 51.713
47.545 13.121 18.507
70.497 4.5611 -2.2588
98.563 8.6301 -33.922
72.97 24.738 28.733
64.789 34.564 10.158
85.486 11.721 13.748
88.28 10.203 -6.0808
108.1 19.423 -18.735
79.374 23.279 29.776
62.921 17.654 41.872
50.496 31.525 50.479
85.737 6.4891 -38.893
42.732 3.7281 38.154
61.856 17.895 36.249
64.08 28.642 61.135
58.494 37.146 61.729
40.592 14.196 41.677
93.968 -12.609 -31.389
118.46 16.654 3.4332
65.123 5.3411 -5.1528
71.242 29.326 -5.2228
76.868 40.981 54.567
52.421 16.388 12.081
96.892 17.355 38.855
83.996 -14.432 -34.502
65.666 -0.75989 -17.478
91.014 35.435 -5.3498
115.12 23.229 13.158
86.4 0.79813 -14.64
71.424 16.449 39.217
80.512 21.197 29.15
47.961 14.042 54.208
47.408 26.85 34.425
79.364 19.263 35.054
86.549 41.347 46.592
120.7 10.397 6.7162
66.494 12.661 -16.464
79.69 18.691 8.3672
89.628 8.6941 13.504
80.952 21.123 15.941
60.088 3.2311 49.794
79.122 21.59 35.133
65.07 40.568 18.345
46.82 22.873 49.085
57.157 43.345 47.351
83.708 -0.56589 -15.352
75.519 -2.1489 11.284
72.273 9.1831 -27.489
89.955 7.5801 1.9052
63.269 -0.95987 43.395
64.744 10.436 -7.7258
116.39 6.8911 -10.381
75.57 4.5751 22.97
112.88 4.2971 -18.556
91.772 -0.47488 39.791
45 16.55 52.153
71.581 43.893 55.603
77.645 46.745 48.961
62.392 30.995 61.995
42.652 3.9281 40.74
83.675 2.0241 -15.636
80.418 23.699 12.469
59.713 42.619 56.736
68.127 -13.855 -6.6118
118.46 16.654 3.4332
63.977 15.13 38.35
66.317 23.344 39.459
56.001 4.2031 23.215
80.672 -4.4369 -37.589
98.969 6.3431 -34.144
64.963 14.331 31.083
63.451 11.582 13.466
82.33 -0.99289 -39
90.818 -5.3159 -39.382
78.186 -18.371 -27.536
90.842 2.2441 -39.316
91.749 3.8791 11.443
55.105 -0.23587 30.872
55.205 36.86 29.157
44.962 10.718 51.526
80.405 20.014 17.375
62.93 38.552 60.744
78.213 -2.8699 -4.4488
78.688 18.533 35.928
65.462 13.274 23.201
79.643 24.026 16.61
71.967 32.207 58.831
88.567 11.528 -36.124
90.696 3.3701 -13.976
84.924 34.099 49.094
104.52 9.5521 -29.357
42.373 6.4231 33.478
86.879 -21.416 -1.4658
60.471 33.916 63.535
72.874 8.7501 27.206
50.888 34.066 37.648
73.413 -15.495 -26.77
78.101 16.862 -28.072
93.719 6.4261 6.8682
94.784 -3.2449 -35.65
50.523 3.4751 25.249
117.29 5.0531 12.106
65.48 13.25 32.688
80.94 -21.632 -13.633
89.981 0.5451 -10.725
89.844 25.512 -21.528
68.272 25.752 33.592
79.843 17.834 29.665
96.99 32.651 37.085
79.305 27.062 -15.005
85.467 46.437 38.874
84.506 -3.7729 -6.3088
105.49 19.138 -22.289
63.877 15.421 40.261
74.337 -10.473 19.069
82.922 -15.893 -33.001
88.185 6.0051 -15.625
109.84 -2.5879 -18.362
78.885 16.865 28.6
78.967 19.272 20.079
91.826 3.7401 2.2902
68.13 -12.667 0.32419
66.754 -11.986 -7.0418
78.289 23.524 26.504
89.144 36.926 -2.7908
53.871 39.774 49.373
94.993 -18.964 -14.699
65.286 12.043 -0.68384
82.361 45.486 47.209
78.688 18.533 35.928
96.835 9.7911 -34.26
103.85 30.725 -3.5278
89.808 17.135 -31.855
81.652 -2.0629 -14.337
89.009 4.6641 16.284
65.031 26.52 60.026
78.289 23.524 26.504
56.601 10.451 14.607
49.151 31.628 41.998
50.941 1.3551 45.065
111.68 20.891 -8.9348
49.087 19.73 54.016
40.917 12.276 46.699
90.902 2.4021 -12.855
89.71 5.8461 16.03
88.627 3.7551 -15.46
69.676 13.507 -21.812
72.088 26.361 32.384
92.651 2.8091 -9.7288
91.14 1.1131 -38.783
83.194 7.5641 -11.13
81.877 -3.0679 -14.237
117.63 1.7401 -1.2788
79.41 0.89813 -36.595
72.081 48.342 49.162
96.99 32.651 37.085
101.52 16.547 -27.649
57.264 27.284 12.472
83.523 20.073 52.624
64.901 8.5551 54.259
99.89 39.652 22.846
90.384 2.3911 41.891
84.408 3.2971 46.356
42.885 14.102 49.935
49.724 10.939 17.056
89.808 17.135 -31.855
91.516 -6.7239 -38.087
69.485 10.593 32.017
107.58 3.8901 22.543
73.295 24.125 14.848
92.663 6.8991 6.1572
75.868 9.5091 0.68817
118.28 2.3541 7.0612
82.405 9.1431 50.692
91.603 29.66 42.881
86.984 -4.4599 -39.665
73.958 24.801 21.502
70.008 -2.3499 -5.8278
81.286 -7.5509 -37.381
55.856 35.539 59.196
68.67 2.7941 -3.8338
64.532 5.4731 -14.414
91.138 -14.397 -31.992
114.72 21.922 17.807
91.89 2.0371 -38.502
64.828 17.643 41.935
67.282 -8.2299 -4.5428
79.622 -13.735 -33.703
84.89 16.511 -31.989
73.413 -15.495 -26.77
51.755 19.075 56.176
78.115 11.929 20.902
72.763 21.494 39.181
74.626 -13.943 11.678
79.52 4.2021 -36.315
91.49 6.3761 -13.642
97.601 -1.0619 33.726
64.174 2.5621 -13.133
65.874 38.303 13.741
62.669 5.1551 51.603
112 27.704 16.101
50.888 34.066 37.648
83.471 42.613 48.273
85.736 -2.0739 42.528
75.803 25.126 16.563
68.23 11.632 34.096
81.42 21.303 10.296
95.493 -15.452 -25.59
89.049 8.9061 7.6902
84.294 10.132 -36.195
82.92 -11.868 -36.229
51.327 24.819 53.726
116.39 6.8911 -10.381
47.049 1.3941 40.942
61.452 10.489 15.885
75.661 46.138 26.488
105.63 17.195 -24.166
82.405 9.1431 50.692
56.055 34.832 60.316
75.672 21.986 37.189
87.708 -11.681 -36.515
70.504 42.849 56.839
93.083 -2.9139 -37.197
54.599 5.8241 20.141
73.773 -4.1589 18.028
50.381 28.398 51.715
98.969 6.3431 -34.144
82.405 -10.327 -36.871
64.854 12.532 3.6412
81.276 -17.816 11.221
84.86 46.574 33.338
64.976 17.976 30.327
46.89 14.149 20.155
63.001 18.655 41.342
90.324 10.347 -9.2918
106.02 30.108 27.011
85.916 -3.4989 -39.665
40.823 10.418 45.669
79.857 11.038 -33.306
42.678 8.5921 30.584
64.244 6.4511 -7.1568
68.412 -14.599 -12.4
76.502 -7.3089 -34.114
65.789 18.581 41.876
66.75 18.581 41.876
90.036 4.1721 -15.027
100.94 -16.536 -10.275
83.197 5.2161 -14.802
82.595 -3.0799 -14.709
82.742 -19.104 9.3032
79.843 17.834 29.665
60.741 44.704 54.806
76.794 25.055 34.406
58.093 31.692 61.932
73.715 24.688 16.919
83.046 1.7151 8.4552
116.35 20.803 4.4092
84.924 34.099 49.094
75.386 48.353 38.734
73.184 8.1501 0.42618
67.822 19.954 26.991
87.073 -15.375 18.385
108.71 11.212 -24.591
54.157 3.2691 24.5
75.803 25.126 16.563
73.413 -15.495 -26.77
63.801 15.382 -1.2638
68.276 -6.6079 -23.461
69.747 -12.132 -24.376
83.084 7.4421 -37.03
71.95 39.277 8.3802
56.603 32.555 61.21
95.542 -11.186 24.14
53.912 11.958 55.411
74.253 24.843 19.144
70.412 19.946 -17.053
52.14 7.5551 17.762
70.523 8.8271 29.641
90.816 37.995 42.952
86.877 -2.5379 -39.665
82.366 -1.3079 -15.161
61.65 41.565 26.636
66.871 21.836 39.606
79.267 -6.4899 -36.35
113.53 14.618 -14.118
85.971 -5.4189 -39.665
78.77 20.217 35.876
73.381 -12.145 11.188
86.887 10.981 13.909
77.793 -13.022 22.427
55.76 7.5891 17.941
75.4 18.916 38.08
109.73 -6.2609 11.402
110.17 21.132 -12.606
92.236 6.3071 -12.474
68.383 -2.0839 -23.519
80.956 20.864 9.0732
99.978 21.596 -23.9
50.838 14.516 15.239
64.525 -2.2359 -8.8898
74.993 25.287 36.316
75.707 13.97 5.3632
64.781 36.353 61.464
66.796 11.682 5.8262
88.728 19.55 -29.276
79.001 -4.2439 -8.5008
50.688 5.8681 51.333
87.694 -13.004 26.06
53.367 28.206 56.54
78.302 23.538 19.72
96.009 23.018 -23.997
76.991 24.073 24.617
59.468 32.559 63.265
72.742 11.41 30.19
76.01 -2.8199 -3.3148
78.181 23.012 35.504
91.014 35.435 -5.3498
79.305 27.062 -15.005
43.372 3.3761 35.591
82.296 -8.9019 -37.391
86.555 9.5741 -11.483
70.204 20.04 18.579
51.751 35.144 50.967
65.471 22.753 35.348
53.129 36.74 35.182
79.355 8.3051 -34.446
116.29 0.086121 -3.9128
45.333 12.491 52.603
84.374 6.6411 -37.892
90.464 -6.6459 -39.128
77.377 2.6571 -34.745
55.007 26.296 57.339
85.97 -1.4479 -39.665
63.688 20.915 38.35
79.001 -8.0719 35.606
58.126 4.4791 25.244
89.203 -11.975 -35.447
73.086 0.69211 22.904
61.218 17.322 37.857
92.057 42.063 13.274
79.988 1.8421 -13.19
95.542 -11.186 24.14
86.458 6.9301 -15.264
81.179 -2.9999 -4.6288
73.07 -9.6239 12.178
92.246 4.6301 -2.6708
112.73 22.011 21.057
92.206 11.002 -35.938
89.049 8.9061 7.6902
80.964 -16.067 15.23
53.171 15.215 11.269
71.309 -14.514 3.7162
63.808 18.982 -2.7468
84.217 -1.4749 -14.642
87.873 1.3281 -14.248
72.358 -6.4769 26.841
89.57 -9.1959 -37.727
68.622 14.931 39.542
76.66 17.093 36.716
77.675 23.825 28.961
86.549 41.347 46.592
49.031 12.102 17.194
93.088 4.7771 -38.11
65.547 -9.4339 -13.105
70.429 21.943 22.297
47.545 13.121 18.507
91.158 -19.086 -22.51
74.649 -18.285 1.7202
57.972 -0.18088 30.08
52.14 7.5551 17.762
86.945 34.692 -6.9298
63.681 46.367 53.448
85.572 14.918 -33.52
108.57 2.6391 -23.873
94 25.961 40.594
75.05 -5.1299 -32.858
48.466 9.5761 18.098
88.113 -15.735 -32.333
77.833 26.609 55.578
44.937 19.172 49.964
65.462 13.274 23.201
66.474 18.63 -10.107
47.049 1.3941 40.942
54.292 34.918 57.756
88.248 -20.854 3.1772
99.978 21.596 -23.9
80.727 23.67 14.589
65.737 -2.1189 -6.7018
76.833 43.285 14.613
102.57 37.244 25.062
61.392 42.558 58.094
105.34 21.651 -19.348
69.304 -10.126 1.4592
92.841 3.3211 -5.4768
81.176 1.3451 -37.665
78.35 17.394 35.705
92.541 6.9821 -10.5
102.86 29.577 -7.7268
90.119 1.5771 0.44818
102.81 -5.4259 -26.374
66.073 20.693 39.95
71.27 3.8541 28.386
62.034 35.04 15.201
55.105 -0.23587 30.872
64.578 20.23 33.269
92.636 3.7421 -11.365
88.103 9.7251 8.9482
70.931 -16.346 -21.116
46.58 16.955 22.983
82.56 -6.5789 -38.456
94.239 31.497 39.981
93.442 4.3561 5.4642
71.962 23.346 14.403
62.377 -1.2429 38.746
50.586 14.337 55.723
75.594 20.286 37.813
77.95 29.408 -10.567
71.532 -3.2029 24.987
77.689 -3.9369 -8.1768
106.44 8.3511 -27.745
82.662 4.7851 48.584
108.84 31.445 13.565
71.36 33.864 -0.38281
110.84 -6.2709 5.4612
74.492 12.871 -27.899
69.271 21.41 39.861
51.925 15.282 13.242
56.343 24.203 10.156
77.406 1.2761 -34.898
104.35 35.613 14.189
65.07 40.568 18.345
91.338 -9.5069 -36.052
90.923 8.1631 10.755
75.018 44.868 21.7
91.603 29.66 42.881
63.688 20.915 38.35
72.446 -7.4259 -30.088
59.747 23.286 4.2812
91.084 4.6621 -14.321
72.796 -2.3219 21.09
92.432 7.2451 10.881
87.057 6.4771 -39.471
89.93 1.4231 -12.592
47.952 9.1921 52.837
91.535 -11.664 -34.197
94.224 5.5131 7.9442
58.093 31.692 61.932
47.685 3.7901 27.132
68.228 14.331 -19.068
92.413 4.8021 2.6512
72.171 26.85 36.034
49.991 2.0961 27.976
75.799 19.287 8.6342
82.437 -3.6359 -13.685
83.581 -3.1709 -3.1728
80.397 -3.9319 -10.967
67.244 22.646 30.64
81.442 4.4301 -14.127
65.783 13.177 56.303
86.013 12.634 -35.184
84.949 5.6901 -15.209
73.068 5.7971 52.066
56.229 22.648 8.9202
77.791 -1.2349 -9.5318
50.93 -0.26587 35.795
83.917 -11.361 30.505
63.867 17.643 41.935
89.93 1.4231 -12.592
90.109 -20.817 -13.157
78.231 24.5 17.849
114.23 18.548 19.233
72.009 24.354 22.256
77.045 18.291 36.947
49.972 21.386 53.88
85.516 -2.5129 -39.654
53.129 36.74 35.182
77.708 20.07 8.4202
56.603 32.555 61.21
100.4 -15.007 -17.537
81.42 21.303 10.296
40.576 7.6501 40.535
76.045 -1.5409 -8.1638
79.254 20.903 24.042
98.436 -10.732 21.75
92.236 6.3071 -12.474
77.823 0.49213 -10.476
64.08 28.642 61.135
99.925 -4.9859 27.915
74.788 -1.8139 -6.8618
62.93 38.552 60.744
106.33 32.014 25.284
87.892 -2.5379 -39.665
79.243 22.568 10.384
98.603 -8.4629 25.916
97.425 20.503 -26.24
78.494 -0.69589 45.157
87.176 6.9531 19.018
70.931 -16.346 -21.116
76.038 21.809 10.815
61.978 15.939 41.476
95.17 42.518 26.651
89.221 5.1461 -39.659
79.559 4.9981 -10.526
58.234 40.656 29.97
84.408 3.2971 46.356
80.672 -4.4369 -37.589
69.474 -1.4689 30.043
84.768 -3.5899 -39.633
59.46 44.904 48.45
92.31 6.1021 -4.8328
59.766 34.853 17.303
75.924 -3.6239 -6.3238
48.962 25.071 25.734
73.155 16.806 9.3122
87.717 16.193 49.12
88.349 27.419 -18.35
71.098 26.685 38.011
90.606 -7.3609 34.424
61.699 15.43 39.026
74.214 -10.236 22.397
65.518 40.782 58.868
93.732 5.4001 5.8082
69.652 -15.466 -9.0488
67.509 35.206 6.3352
106.77 -7.2579 14.952
112.44 24.171 20.492
88.489 -0.28189 -0.05484
81.49 -18.572 -29.439
57.854 13.286 56.016
51.849 17.327 13.774
82.459 13.336 52.701
66.271 -6.4539 -6.1548
91.192 8.9831 -7.8718
67.244 22.646 30.64
56.574 31.01 60.77
80.414 -15.411 -32.796
71.242 29.326 -5.2228
97.723 40.79 31.329
89.205 -7.6769 -39.164
75.854 0.091125 -33.395
81.962 -4.0999 -6.6428
64.08 28.642 61.135
81.706 -4.2509 41.238
50.066 19.452 55.299
48.25 26.804 47.459
92.51 14.062 43.975
84.401 -7.9449 -39.072
65.547 -9.4339 -13.105
100.31 -6.5819 -28.862
57.765 27.013 59.367
77.296 -2.8209 -8.6658
84.801 8.5971 -10.973
66.335 -11.168 -15.02
78.819 13.99 5.2572
64.26 14.904 33.726
54.409 12.83 12.214
73.917 48.858 43.371
77.487 24.249 31.575
91.766 7.5071 6.9592
85.737 6.4891 -38.893
66.434 46.977 52.25
92.057 42.063 13.274
100.31 -6.5819 -28.862
52.933 31.069 24.655
45.045 8.2891 25.876
69.982 16.959 -19.661
75.737 8.2011 53.076
80.51 6.3261 20.859
60.452 -0.094879 44.163
118.83 9.6131 -2.6628
70.412 19.946 -17.053
75.176 37.834 56.201
72.273 9.1831 -27.489
109.01 25.942 -4.3748
69.249 -14.355 -20.561
86.835 -0.21289 -13.329
101.07 8.3051 31.63
86.126 4.2301 19.222
75.7 -14.291 -30.472
75.492 36.412 -0.078827
105.67 33.828 11.049
73.967 -13.787 -29.107
61.926 15.492 36.983
109.16 -0.13989 -21.4
72.173 24.366 20.215
65.759 2.8591 -5.3538
88.604 3.4411 11.72
72.904 5.0221 -2.8438
85.507 7.1151 -14.472
69.216 26.681 33.357
83.917 -11.361 30.505
74.59 18.905 56.379
89.96 6.8111 15.496
68.352 19.504 -13.548
89.144 36.926 -2.7908
85.707 8.2311 -13.112
91.781 3.4431 -12.857
74.747 16.35 -25.688
113.88 -3.2909 -3.2608
75.736 -0.13489 18.97
101.07 8.3051 31.63
75.479 24.207 29.243
73.283 22.164 -17.66
73.769 -3.8839 39.379
56.428 43.047 51.01
103.45 35.304 9.5042
86.931 -3.4989 -39.665
55.856 35.539 59.196
86.897 5.4161 19.346
71.649 26.129 38.989
65.375 -1.7919 40.699
62.915 42.045 58.66
78.881 -0.30789 8.6602
58.086 6.2371 21.376
62.906 16.706 41.876
81.533 13.322 16.375
81.168 22.299 15.366
86.879 -21.416 -1.4658
70.943 23.496 24.085
84.057 27.751 -16.527
88.878 9.0061 15.618
79.032 -9.3469 -35.57
67.889 11.477 -20.291
69.031 -5.2169 -4.8228
47.121 18.533 52.913
75.672 21.986 37.189
64.45 19.361 41.394
89.203 -11.975 -35.447
93.879 4.3751 7.3032
79.001 -4.2439 -8.5008
47.892 11.083 17.991
53.18 36.927 53.526
99.787 19.637 34.599
73.514 2.6761 -6.4778
48.716 1.8751 30.068
77.608 -15.837 12.764
55.76 7.5891 17.941
89.409 8.1091 -39.05
102.37 24.173 -18.793
109.26 -7.9759 -10.344
78.186 -18.371 -27.536
105.67 33.828 11.049
92.721 0.87012 -37.506
83.886 3.8431 -15.587
61 32.689 63.366
86.913 -10.774 -37.46
114.39 23.887 6.3642
77.608 -15.837 12.764
73.161 1.8811 -30.226
80.128 -3.7669 -6.2938
49.031 12.102 17.194
74.805 25.193 -14.329
83.167 -13.217 -35.254
80.232 22.543 31.478
48.856 29.102 47.138
63.269 -0.95987 43.395
49.493 14.165 16.883
55.048 41.55 48.165
63.913 1.7091 -9.7148
68.642 -12.443 -21.669
70.044 23.684 39.535
49.412 0.21313 39.609
90.8 3.2481 -39.492
79.004 -18.127 8.9392
87.311 45.311 41.691
87.694 -13.004 26.06
86.863 8.9551 -13.239
77.347 23.513 55.913
100.55 38.898 18.461
66.881 16.569 24.606
79.131 23.215 34.239
89.812 3.2281 -39.656
73.519 15.816 37.313
44.937 19.172 49.964
63.186 16.449 33.174
63.002 40.156 59.241
108.73 9.6521 23.651
85.507 7.1151 -14.472
88.193 4.9281 -15.646
93.013 -15.427 -28.904
50.53 16.567 16.164
83.146 -1.6529 -15.3
80.887 40.273 52.003
101.21 -9.2369 -25.627
107.06 12.88 -25.682
53.511 21.491 13.032
73.973 -7.5449 -31.914
59.954 39.338 59.587
92.145 -3.8129 -38.303
71.722 21.938 13.607
77.245 20.854 36.938
66.584 24.6 38.928
49.189 23.317 23.297
59.09 27.493 9.5322
53.734 9.1311 54.205
72.969 -15.259 6.8902
45.997 9.3811 51.521
71.378 22.622 16.769
73.499 -5.7399 11.466
85.971 -5.4189 -39.665
104.52 9.5521 -29.357
89.384 -16.521 14.367
75.734 4.8391 50.753
89.178 -5.1359 -39.653
97.435 -6.7769 30.08
73.362 -18.339 -8.6448
55.856 35.539 59.196
114.61 8.9621 17.395
81.349 -2.3839 -1.3688
69.344 13.552 36.714
104.87 -5.2059 -23.61
62.034 35.04 15.201
89.846 8.9051 10.802
84.401 -7.9449 -39.072
69.239 12.305 7.8282
86.071 7.9921 19.24
114.64 -1.0949 -8.6288
92.383 13.426 -34.365
64.525 -2.2359 -8.8898
89.6 -16.895 -29.861
65.518 40.782 58.868
89.815 34.605 44.517
66.117 15.524 -12.729
73.519 15.816 37.313
96.892 17.355 38.855
67.351 25.539 -4.6278
89.07 14.046 -34.328
62.377 -1.2429 38.746
67.351 25.539 -4.6278
81.91 16.737 -30.41
98.686 18.011 -28.063
64.26 14.904 33.726
81.406 -0.61588 -14.412
86.001 3.7031 -39.627
108.1 19.423 -18.735
70.895 0.73212 26.846
58.494 37.146 61.729
88.339 7.4361 -39.356
66.793 12.593 34.325
46.542 3.0341 29.873
44.417 14.344 26.249
74.688 16.431 7.7582
63.986 31.828 6.9982
78.231 24.5 17.849
69.801 21.47 24.229
103.96 -14.057 -9.3978
64.976 17.976 30.327
55.486 2.4181 26.092
85.358 7.3881 20.004
110.18 -7.4969 -1.1898
60.741 44.704 54.806
65.462 13.274 23.201
82.537 14.999 10.925
75.57 4.5751 22.97
64.168 16.194 31.523
45.319 4.1341 45.98
73.034 -13.553 8.8702
82.664 46.48 45.26
71.27 3.8541 28.386
67.068 -11.735 -3.7848
112.89 11.395 -17.746
118.02 7.8141 12.098
80.271 28.404 53.822
90.324 10.347 -9.2918
75.487 -11.582 23.761
91.138 -14.397 -31.992
41.175 8.1811 34.39
75.519 -2.1489 11.284
87.88 7.0251 -15.504
68.412 -14.599 -12.4
74.492 12.871 -27.899
68.288 -1.2509 -5.8338
77.201 19.442 36.979
119.46 4.4891 3.1882
83.627 12.472 -34.551
70.523 8.8271 29.641
68.642 -12.443 -21.669
76.914 14.736 31.521
64.923 7.7641 -5.4788
114.72 21.922 17.807
93.088 4.7771 -38.11
69.015 5.9321 -1.7138
75.934 5.8201 -5.1638
81.448 37.491 52.124
116.94 0.15811 6.5752
62.055 15.482 40.584
68.774 22.994 28.147
72.216 -17.294 -1.6358
93.083 -2.9139 -37.197
119.88 5.5161 6.5352
54.916 37.866 56.57
91.583 6.6111 -2.9628
55.205 36.86 29.157
86.483 10.398 6.8432
118.08 14.045 -2.0908
81.395 19.048 -27.713
83.313 -19.85 -26.407
85.862 1.2531 -39.664
62.89 35.928 63.001
65.781 21.778 39.591
74.527 11.769 3.4942
65.597 38.192 59.837
41.657 14.013 47.978
93.033 3.9161 -9.3858
95.094 20.993 40.671
87.892 0.34512 -39.665
85.567 21.258 -26.53
80 21.014 54.869
41.782 10.984 48.041
44.856 3.4881 31.694
109.18 13.07 -22.986
63.428 17.5 32.371
81.735 -2.6799 -38.541
86.396 -19.474 -26.618
92.413 4.8021 2.6512
73.184 8.1501 0.42618
40.383 8.7561 42.916
89.366 6.7291 -15.284
57.826 21.988 6.0742
88.323 44.396 42.127
76.59 -11.722 -32.923
76.699 -19.985 -5.6708
89.816 -5.9479 -39.592
72.657 24.671 21.668
61.179 39.416 59.918
61.297 17.634 40.274
81.91 16.737 -30.41
90.696 3.3701 -13.976
91.284 -3.9629 -39.082
92.971 37.317 -0.31982
89.059 45.522 32.329
74.521 40.887 9.5442
85.274 -8.2759 -39.142
81.198 -11.063 -35.91
71.625 -2.8769 -5.3118
67.511 25.474 36.56
91.129 -4.7529 37.211
92.91 6.0991 -9.3008
94 25.961 40.594
81.146 23.383 13.207
72.009 24.354 22.256
84.294 10.132 -36.195
73.963 6.6821 -1.5288
94.961 -9.4169 28.244
88.853 2.2671 -39.665
61.191 16.132 41.268
84.945 1.8601 -15.594
76.154 24.021 26.65
81.138 1.1841 -14.531
92.398 40.673 8.3242
81.919 47.145 34.467
91.302 1.6561 -2.2828
67.042 11.959 9.0212
82.56 -6.5789 -38.456
66.871 21.836 39.606
92.04 7.3781 -6.8928
77.538 48.23 42.47
98.075 10.563 35.657
81.221 4.7611 20.244
95.508 -13.703 17.367
88.061 23.731 -23.829
84.824 9.4051 18.027
67.535 -12.383 -18.186
41.175 8.1811 34.39
61.261 45.642 52.855
99.16 -17.886 -5.6558
112.74 -2.6219 11.879
53.943 26.623 17.907
60.828 35.324 63.483
90.734 3.5941 9.6292
50.375 12.246 15.898
73.973 -7.5449 -31.914
45.78 13.95 22.942
94.92 29.293 -15.568
82.12 14.355 -32.551
81.441 22.649 13.899
103.61 -11.647 -18.038
81.125 -10.803 31.251
90.24 21.133 46.14
72.366 26.508 37.883
90.495 9.4721 -6.6798
88.878 9.0061 15.618
84.176 29.609 50.44
86.931 1.3061 -39.665
41.782 10.984 48.041
75.76 2.8391 -33.091
56.125 21.104 56.667
110.66 7.3201 -22.508
82.361 45.486 47.209
93.354 -0.50287 38.629
67.822 19.954 26.991
87.343 2.9601 11.121
61.699 15.43 39.026
84.098 -10.713 -37.219
86.835 -0.21289 -13.329
70.044 40.341 12.477
91.138 -14.397 -31.992
82.742 -19.104 9.3032
96.187 -18.982 -10.347
116.91 20.301 10.279
69.252 19.597 40.952
58.648 38.088 59.956
97.927 28.965 -14.435
75.259 24.419 24.848
46.518 10.944 53.04
44.962 10.718 51.526
77.789 21.94 -22.01
92.188 3.2591 -38.611
72.005 3.1871 49.639
75.802 -2.2529 7.0752
56.001 4.2031 23.215
81.91 16.737 -30.41
90.665 0.32013 -7.3828
77.094 47.406 32.423
60.452 -0.094879 44.163
102.31 36.912 12.973
62.89 35.928 63.001
100.55 32.596 33.277
71.341 24.887 39.437
46.583 2.5181 44.008
109.44 -4.0669 15.407
78.723 6.5541 22.096
108.35 31.925 18.786
79.735 24.179 14.334
77.005 11.161 23.108
59.713 42.619 56.736
107.37 15.388 -23.725
49.183 25.135 51.183
67.752 16.19 41.55
89.955 7.5801 1.9052
49.644 30.064 31.85
117.7 6.5411 -5.8888
72.429 48.731 39.876
113.25 26.293 11.33
111.88 -4.2889 -11.365
115.32 -0.51489 10.425
80.448 -1.9859 -12.176
69.385 9.0781 -23.673
92.5 7.0981 -8.5298
75.76 2.8391 -33.091
83.241 -3.7619 -5.6468
83.197 5.2161 -14.802
46.46 9.4951 22.399
84.088 24.739 51.436
79.765 18.515 27.95
78.515 -3.4469 -9.1348
65.286 12.043 -0.68384
71.967 32.207 58.831
77.833 26.609 55.578
66.972 -10.256 -3.9018
71.967 32.207 58.831
86.952 1.8671 4.9892
84.401 -7.9449 -39.072
99.387 23.834 -21.523
83.241 -3.7619 -5.6468
77.347 23.513 55.913
88.104 0.32111 42.579
75.734 4.8391 50.753
100.58 8.4841 -32.581
58.14 24.456 6.9102
90.449 -17.994 10.442
83.145 -1.8859 -39.437
65.732 45.056 56.125
102.38 33.584 1.5432
56.574 31.01 60.77
86.984 -5.4199 -39.665
69.365 24.892 29.439
67.72 -13.638 -15.226
47.685 3.7901 27.132
107.31 23.867 -13.17
80.622 -17.029 -31.222
81.117 9.8751 19.661
95.437 25.717 -20.629
65.286 12.043 -0.68384
63.497 45.062 56.162
95.876 42.152 30.662
63.074 -0.42188 33.929
77.122 47.93 46.187
68.667 1.7521 30.328
101.15 35.958 30.939
52.717 15.383 56.306
61 32.689 63.366
100.39 -16.949 -1.6088
52.801 10.575 15.345
69.588 -15.014 -0.50284
74.007 14.191 56.012
56.295 32.534 20.167
65.75 21.782 33.265
92.145 -3.8129 -38.303
103.45 35.304 9.5042
45.421 14.502 53.076
74.298 23.83 13.511
61.129 17.588 39.133
69.254 -15.325 -18.056
90.017 -3.6949 -39.519
103.15 17.879 -25.481
92.736 5.8351 40.168
64.871 13.202 -9.9528
83.015 33.153 -8.1618
61.432 -0.58688 31.767
84.627 -1.5299 -39.647
66.879 0.45413 -5.5938
55.252 29.41 58.83
78.968 12.608 -31.861
75.506 -13.218 14.334
92.744 4.6631 -4.9108
48.312 1.8471 44.323
106.31 34.154 16.596
75.868 9.5091 0.68817
79.791 22.202 27.306
75.757 10.912 54.69
78.881 -0.30789 8.6602
99.787 19.637 34.599
70.303 17.721 13.975
96.99 32.651 37.085
51.521 27.356 23.312
107.82 17.486 -21.412
77.557 19.315 -25.168
46.518 10.944 53.04
110.84 -6.2709 5.4612
59.601 20.623 57.294
88.259 38.254 45.79
116.28 10.628 15.352
87.189 31.951 -11.343
87.093 3.4281 17.01
68.327 18.539 41.831
73.362 -18.339 -8.6448
64.489 26.86 0.34018
71.13 22.715 -13.898
62.06 22.5 1.1622
84.217 -1.4749 -14.642
108.84 -6.9029 -14.62
72.857 18.505 39.506
61.081 40.985 58.736
93.725 21.454 -26.472
102.31 36.912 12.973
64.789 34.564 10.158
74.249 13.763 33.235
103.51 -8.3949 -22.769
90.304 21.734 -26.602
104.73 34.956 23.119
80.508 20.228 29.15
93.879 4.3751 7.3032
79.336 -17.702 -29.769
43.541 10.882 27.935
84.924 34.099 49.094
90.696 3.3701 -13.976
73.813 4.2601 -5.2978
76.833 43.285 14.613
49.412 0.21313 39.609
106.49 8.3161 25.422
93.763 43.484 29.271
80.206 3.3821 -13.191
75.168 21.767 56.525
82.33 -0.99289 -39
92.718 6.0871 -6.9188
111.17 21.06 23.143
58.862 8.6551 17.794
109.1 5.7281 -24.326
61.858 18.411 38.728
103.88 29.505 30.126
47.585 1.0371 34.167
77.57 16.441 22.412
84.409 -20.322 5.7602
65.036 32.132 61.299
88.853 1.3071 -39.662
73.789 -3.5779 -0.32083
63.451 11.582 13.466
66.117 15.524 -12.729
65.504 20.046 40.735
79.987 18.934 34.113
84.401 -7.9449 -39.072
104.48 33.798 27.02
59.8 14.567 6.3902
68.13 -12.667 0.32419
49.183 25.135 51.183
86.77 2.1391 -39.665
49.972 21.386 53.88
91.772 7.8151 -38.098
43.541 10.882 27.935
66.64 -0.77887 44.623
85.141 10.518 49.843
109.44 24.873 24.008
84.542 11.999 5.3072
75.963 10.265 -30.677
42.534 13.965 30.767
110.83 4.4851 -21.772
56.785 13.884 10.022
49.644 30.064 31.85
88.853 1.3071 -39.662
77.157 -9.8589 31.012
88.971 1.4651 -13.617
61.854 46.303 50.561
71.625 -2.8769 -5.3118
81.084 0.80411 46.459
64.976 17.976 30.327
113.62 16.85 -11.052
60.26 28.76 60.987
75.884 46.117 50.88
85.288 0.32013 44.19
57.264 27.284 12.472
73.283 6.1381 25.782
60.821 15.942 39.916
81.777 -12.534 27.697
91.516 -6.7239 -38.087
104.48 33.798 27.02
67.752 16.19 41.55
54.576 13.688 11.218
80.779 23.216 11.381
42.732 3.7281 38.154
82.662 4.7851 48.584
89.657 7.9161 15.23
90.449 -17.994 10.442
64.866 15.391 40.324
58.14 24.456 6.9102
89.657 7.9161 15.23
80.875 23.624 53.953
75.646 23.88 37.054
95.241 35.835 38.453
90.08 11.145 -36.383
50.496 31.525 50.479
81.962 -4.0999 -6.6428
53.171 15.215 11.269
92.871 3.8551 6.8932
73.582 -8.2849 15.448
50.426 12.333 54.564
81.138 1.1841 -14.531
86.984 -4.4599 -39.665
74.653 -11.832 -31.082
90.745 8.6121 -13.27
74.223 21.571 38.168
43.416 6.3621 46.849
88.315 -4.4239 -39.66
63.472 19.032 33.507
61.699 15.43 39.026
85.445 3.3471 17.932
78.213 -2.8699 -4.4488
76.59 -11.722 -32.923
44.417 14.344 26.249
92.881 2.9641 -7.3698
85.288 0.32013 44.19
105.49 19.138 -22.289
85.336 11.886 10.027
94.961 -9.4169 28.244
87.694 -13.004 26.06
103.88 29.505 30.126
64.901 8.5551 54.259
92.04 7.3781 -6.8928
74.445 -2.9539 -5.1138
50.804 10.999 15.967
94.961 -9.4169 28.244
59.8 14.567 6.3902
118.41 10.925 11.763
70.237 -15.683 -5.7418
80.414 -15.411 -32.796
66.317 -4.7579 -19.2
92.52 9.2111 41.876
112.44 24.171 20.492
63.913 1.7091 -9.7148
80.226 39.679 3.4772
85.59 -13.529 -35.177
112.44 24.171 20.492
77.899 23.367 22.2
81.554 -1.7579 1.6512
47.854 28.792 41.681
44.067 20.844 40.132
61.101 6.8991 24.442
111.2 29.06 11.975
56.574 12.066 12.31
80.491 18.759 31.055
71.13 22.715 -13.898
40.437 11.994 37.954
109.26 -7.9759 -10.344
76.01 -2.8199 -3.3148
74.609 45.66 52.437
51.521 27.356 23.312
113.06 15.935 20.788
68.195 16.859 -16.574
111.68 20.891 -8.9348
53.734 9.1311 54.205
85.184 -9.5109 -38.165
90.826 5.9961 14.373
90.923 8.1631 10.755
78.243 14.357 54.707
81.714 10.982 0.89618
46.381 24.846 42.746
55.083 15.006 10.064
57.121 24.908 57.854
83.886 3.8431 -15.587
78.243 14.357 54.707
100.55 38.898 18.461
92.612 5.7481 -38.414
75.519 -2.1489 11.284
90.787 38.96 2.8872
50.688 5.8681 51.333
59.749 19.331 3.5872
49.945 0.56311 32.173
86.877 -1.5769 -39.665
73.381 -12.145 11.188
106.1 -10.689 -13.529
76.922 23.918 -18.344
81.292 -21.229 -3.3028
114.73 -2.7409 1.7462
93.603 6.1381 11.02
77.689 -3.9369 -8.1768
72.615 -10.95 -29.229
106.31 34.154 16.596
54.326 16.509 10.074
91.129 -4.7529 37.211
67.168 24.557 34.079
72.754 13.795 6.9952
77.525 -5.1249 -35.054
86.11 -3.1799 -5.7988
67.282 -8.2299 -4.5428
69.239 12.305 7.8282
79.41 0.89813 -36.595
83.2 -4.4139 -39.155
85.467 46.437 38.874
65.286 12.043 -0.68384
72.344 24.108 17.63
84.374 6.6411 -37.892
90.131 0.25613 -39.275
77.456 -8.8459 -34.716
50.627 21.261 18.38
59.523 11.161 13.464
79.217 1.5631 17.241
81.286 -7.5509 -37.381
73.561 -8.5969 27.196
59.523 11.161 13.464
66.127 -9.6959 -16.938
51.669 8.7591 16.874
94.208 -7.1599 -34.943
81.954 10.28 -34.989
57.804 18.973 6.2072
58.417 39.158 58.714
43.818 5.8331 30.55
81.177 -2.1619 43.643
62.034 35.04 15.201
70.487 12.438 33.871
69.968 -16.416 -15.136
89.199 9.1571 -3.6268
70.293 0.43411 46.284
51.779 12.544 55.515
76.419 -2.3839 2.0502
104.69 35.799 18.239
65.737 -2.1189 -6.7018
78.455 43.942 51.284
87.608 14.918 -33.729
56.428 43.047 51.01
102.3 1.0471 28.079
105.95 10.998 27.48
64.975 30.071 3.1512
68.381 -10.157 -22.941
68.853 43.612 22.076
91.766 7.5071 6.9592
57.157 43.345 47.351
75.95 4.0051 -7.8208
89.824 3.8671 13.097
98.02 1.9901 -34.032
69.029 18.684 20.923
41.657 14.013 47.978
70.497 4.5611 -2.2588
52.431 30.602 55.822
62.93 15.27 38.426
74.223 21.571 38.168
78.35 17.394 35.705
65.728 -8.5989 -7.2048
75.884 46.117 50.88
72.03 26.329 -9.5678
87.892 1.3061 -39.665
93.296 6.1651 5.3232
94.784 -3.2449 -35.65
76.376 23.362 12.368
96.009 23.018 -23.997
81.177 -2.1619 43.643
83.475 -5.4459 -39.235
73.16 -4.6599 -30.778
95.017 1.2201 -35.991
83.83 -3.9109 -9.6078
43.6 16.094 50.511
53.18 36.927 53.526
91.732 30.559 -13.93
56.574 31.01 60.77
68.127 -13.855 -6.6118
106.22 33.792 21.861
80.094 20.082 8.4312
86.612 44.813 43.892
74.472 -11.24 16.443
79.01 -19.451 4.6082
62.243 36.897 62.736
85.734 7.5971 48.246
76.634 -20.532 -15.52
88.061 23.731 -23.829
72.874 8.7501 27.206
84.359 -18.785 -28.961
99.825 13.086 -31.001
43.308 4.6841 44.653
59.692 40.851 58.338
76.819 6.7851 22.869
114.39 23.887 6.3642
90.606 -7.3609 34.424
70.204 20.04 18.579
79.915 23.255 11.173
84.088 24.739 51.436
76.348 43.744 52.967
59.72 -0.98987 38.002
79.29 6.0361 -35.417
70.523 8.8271 29.641
82.522 6.2481 20.33
92.786 5.8651 -11.237
57.29 36.447 60.578
89.492 -0.56989 -3.6848
88.993 0.62311 -12.547
78.948 16.415 31.25
99.885 39.619 27.658
73.958 24.801 21.502
70.14 25.643 39.207
95.437 25.717 -20.629
75.719 15.552 35.655
62.551 22.229 58.848
74.993 25.287 36.316
90.544 8.4681 -4.3818
75.707 13.97 5.3632
53.553 38.6 40.775
85.551 -10.909 -37.332
42.101 9.5951 47.584
65.359 23.708 38.356
54.736 20.444 10.459
94.101 -17.657 -22.101
62.377 -1.2429 38.746
82.455 2.5741 -15.418
89.199 9.1571 -3.6268
73.362 -18.339 -8.6448
82.042 7.6081 -9.3878
83.975 -6.7489 -39.256
84.627 -1.5299 -39.647
89.811 2.2701 -39.645
48.457 16.167 19.142
43.436 12.305 50.5
75.4 18.916 38.08
108.57 2.6391 -23.873
84.422 -12.618 -36.014
75.204 34.943 56.514
88.462 -10.364 -37.313
57.071 8.5191 54.065
76.819 6.7851 22.869
78.638 42.145 10.351
67.479 4.4261 -3.2728
63.355 20.324 36.238
49.183 25.135 51.183
83.201 3.0541 18.745
66.261 20.302 30.054
105.34 21.651 -19.348
71.788 13.883 35.887
107.31 23.867 -13.17
110.56 -4.1259 -15.233
67.168 24.557 34.079
60.828 35.324 63.483
69.087 26.311 38.417
94.357 -7.3639 31.938
86.09 -12.176 -36.419
51.144 16.208 56.277
67.101 -3.9999 -6.0398
42.513 15.97 48.21
50.941 1.3551 45.065
78.563 2.7341 -35.849
68.264 45.383 55.077
74.747 16.35 -25.688
64.975 30.071 3.1512
56.601 10.451 14.607
64.791 11.381 26.484
88.8 -6.5059 -39.631
53.18 36.927 53.526
115.74 17.18 17.043
99.566 39.41 29.817
87.13 41.387 7.8392
54.604 39.877 53.432
87.073 -15.375 18.385
55.443 32.07 59.639
87.457 12.54 -35.351
115.25 -1.9889 6.5242
41.291 15.457 39.507
103.51 -8.3949 -22.769
106.69 -8.6639 11.768
51.205 4.7831 22.907
78.751 13.591 19.584
109.01 25.942 -4.3748
63.355 20.324 36.238
73.917 48.858 43.371
89.824 3.8671 13.097
42.54 15.618 32.353
68.94 34.388 3.2252
107.31 23.867 -13.17
78.231 24.5 17.849
65.781 21.778 39.591
81.533 13.322 16.375
83.201 3.0541 18.745
94.074 -5.6649 34.294
57.239 -1.0039 37.818
59.978 26.119 5.7952
112.22 17.928 -13.114
91.464 7.7761 -5.4528
73.184 8.1501 0.42618
93.927 15.773 -32.134
77.005 11.161 23.108
75.868 9.5091 0.68817
82.253 -0.53787 44.796
68.001 -10.725 -2.3888
57.889 37.846 25.015
59.8 14.567 6.3902
60.279 31.066 62.295
89.409 8.1091 -39.05
90.036 4.1721 -15.027
71.101 -8.1739 6.0802
88.137 10.026 -12.392
88.355 40.095 45.179
75.695 24.77 21.194
51.521 27.356 23.312
78.289 23.524 26.504
51.791 0.20612 42.485
99.432 29.235 34.757
112.13 19.426 21.783
74.223 21.571 38.168
80.464 21.745 33.029
82.296 -8.9019 -37.391
85.239 -16.546 -32.202
89.955 7.5801 1.9052
89.144 36.926 -2.7908
70.624 -1.8809 42.854
96.187 -18.982 -10.347
79.469 23.824 12.277
110.56 -4.1259 -15.233
80.271 28.404 53.822
78.343 24.817 16.06
78.928 -2.5229 -9.9828
79.032 -9.3469 -35.57
75.963 10.265 -30.677
78.181 23.012 35.504
88.137 10.026 -12.392
83.644 -1.9709 43.367
60.156 16.835 4.2052
112.44 24.171 20.492
