o convex_0
v -0.000196 -0.004914 0.002592
v 0.000329 0.009941 -0.000694
v 0.000329 0.009941 -0.000956
v -0.008611 0.003761 -0.000036
v 0.002562 -0.003598 -0.001220
v 0.007559 0.004681 0.002724
v -0.004666 0.008231 0.002724
v 0.008611 0.002973 -0.001220
v -0.007296 -0.000443 -0.001220
v -0.007822 0.001003 0.002724
v 0.006770 -0.000312 0.002724
v -0.005061 0.009019 -0.001220
v 0.004666 0.008625 0.002461
v 0.007822 0.006522 -0.001220
v -0.002562 -0.003598 -0.001220
v -0.008085 0.005733 0.001409
v 0.007427 -0.000575 0.000227
v 0.004666 0.009282 -0.001220
v -0.001642 -0.004517 0.002724
v -0.008085 0.006258 -0.001220
v 0.008348 0.002973 0.002724
v -0.000327 0.009151 0.002724
v 0.001642 -0.004519 0.002724
v -0.007426 -0.000575 0.000883
v -0.004666 0.009415 -0.000562
v -0.008348 0.003368 0.002724
v 0.008085 0.005733 0.001409
v 0.007296 -0.000443 -0.001220
v 0.000197 -0.004255 -0.001220
v -0.008611 0.002974 -0.001220
v 0.004666 0.009415 -0.000562
v -0.008611 0.002186 0.000752
v -0.004666 0.008625 0.002461
v 0.008611 0.002186 0.000752
v 0.007689 0.000609 0.002592
v -0.006770 -0.000312 0.002724
v 0.004666 0.008231 0.002724
v 0.007427 -0.000575 0.000883
v 0.008611 0.003761 -0.000036
v -0.006507 -0.001102 -0.001220
v 0.000329 0.009151 0.002724
v 0.008085 0.006259 -0.000825
v -0.000855 0.009809 -0.001220
v -0.007689 0.004814 0.002592
v 0.006507 -0.001102 -0.001220
v -0.000196 0.009941 -0.000562
v -0.000327 -0.004255 -0.001088
v -0.002694 -0.003598 -0.000956
v 0.002694 -0.003598 -0.000956
v 0.008348 0.003367 0.002724
v -0.007033 -0.000838 -0.000168
v 0.001247 -0.004650 0.002592
v -0.008085 0.006258 -0.000825
v 0.007690 0.004814 0.002592
v 0.008085 0.001660 0.002724
v -0.004140 0.009413 -0.001220
v 0.008611 0.002186 0.000358
v -0.008611 0.002186 0.000358
v -0.008215 0.002186 0.002724
v -0.001247 -0.004650 0.002592
v 0.008216 0.005602 -0.001220
v 0.000197 -0.004914 0.002724
v -0.007689 -0.000049 0.000883
v -0.003614 0.008756 0.002592
v 0.003614 0.008756 0.002592
v 0.007033 -0.000837 -0.000168
f 49 45 66 
f 8 5 9 
f 6 7 10 
f 6 10 11 
f 8 9 12 
f 8 12 14 
f 9 5 15 
f 14 12 18 
f 11 10 19 
f 12 9 20 
f 6 11 21 
f 7 6 22 
f 11 19 23 
f 12 20 25 
f 10 7 26 
f 16 4 26 
f 5 8 28 
f 15 5 29 
f 4 20 30 
f 20 9 30 
f 3 2 31 
f 18 3 31 
f 14 18 31 
f 13 27 31 
f 26 4 32 
f 4 30 32 
f 25 16 33 
f 19 10 36 
f 10 24 36 
f 24 19 36 
f 22 6 37 
f 23 17 38 
f 11 23 38 
f 17 34 38 
f 35 11 38 
f 34 35 38 
f 34 8 39 
f 9 15 40 
f 31 2 41 
f 22 37 41 
f 14 31 42 
f 31 27 42 
f 27 39 42 
f 3 18 43 
f 18 12 43 
f 26 7 44 
f 16 26 44 
f 7 33 44 
f 33 16 44 
f 5 28 45 
f 28 17 45 
f 2 3 46 
f 25 22 46 
f 41 2 46 
f 22 41 46 
f 3 43 46 
f 43 25 46 
f 29 1 47 
f 15 29 47 
f 40 15 48 
f 5 45 49 
f 6 21 50 
f 21 34 50 
f 39 27 50 
f 34 39 50 
f 24 9 51 
f 19 24 51 
f 9 40 51 
f 48 19 51 
f 40 48 51 
f 29 5 52 
f 5 49 52 
f 49 23 52 
f 4 16 53 
f 20 4 53 
f 16 25 53 
f 25 20 53 
f 27 13 54 
f 37 6 54 
f 13 37 54 
f 6 50 54 
f 50 27 54 
f 21 11 55 
f 34 21 55 
f 11 35 55 
f 35 34 55 
f 12 25 56 
f 43 12 56 
f 25 43 56 
f 28 8 57 
f 17 28 57 
f 34 17 57 
f 8 34 57 
f 30 9 58 
f 32 30 58 
f 10 26 59 
f 32 10 59 
f 26 32 59 
f 1 19 60 
f 47 1 60 
f 15 47 60 
f 48 15 60 
f 19 48 60 
f 8 14 61 
f 39 8 61 
f 14 42 61 
f 42 39 61 
f 19 1 62 
f 23 19 62 
f 1 29 62 
f 52 23 62 
f 29 52 62 
f 9 24 63 
f 24 10 63 
f 10 32 63 
f 58 9 63 
f 32 58 63 
f 7 22 64 
f 22 25 64 
f 33 7 64 
f 25 33 64 
f 13 31 65 
f 37 13 65 
f 31 41 65 
f 41 37 65 
f 17 23 66 
f 45 17 66 
f 23 49 66 
o convex_1
v -0.001774 -0.009515 0.006273
v 0.003351 -0.005572 0.005879
v 0.003220 -0.005835 0.006142
v 0.003351 -0.009252 0.003908
v -0.002694 -0.005572 0.003776
v -0.002168 -0.005572 0.007193
v -0.003351 -0.009252 0.003908
v 0.001379 -0.008463 0.007193
v 0.000329 -0.005572 0.003119
v 0.003351 -0.009515 0.005353
v -0.003746 -0.008989 0.005484
v 0.002694 -0.005572 0.003776
v 0.001379 -0.005572 0.007456
v -0.001379 -0.008463 0.007193
v -0.003483 -0.005835 0.005747
v -0.000065 -0.009910 0.004696
v 0.000197 -0.008200 0.003382
v 0.002694 -0.008200 0.006799
v -0.000065 -0.009910 0.006010
v 0.003746 -0.008068 0.005484
v -0.002694 -0.008200 0.006799
v -0.002957 -0.009646 0.005353
v -0.001248 -0.007281 0.007456
v 0.002431 -0.009252 0.006404
v -0.000329 -0.005703 0.003119
v 0.000591 -0.009121 0.006930
v 0.002431 -0.005572 0.007062
v 0.001248 -0.007281 0.007456
v 0.003088 -0.007281 0.003776
v -0.003088 -0.007281 0.003776
v -0.002694 -0.006886 0.006930
v -0.002694 -0.009252 0.006273
v 0.003746 -0.008989 0.005484
v 0.003351 -0.005572 0.005353
v -0.001379 -0.005572 0.007456
v -0.003746 -0.008332 0.005222
v -0.003351 -0.005572 0.005353
v 0.002168 -0.009778 0.005615
v 0.003483 -0.006886 0.006010
v 0.000065 -0.007544 0.003250
v -0.000591 -0.009121 0.006930
v 0.000722 -0.009778 0.004433
v -0.003483 -0.007281 0.006010
v 0.003614 -0.008857 0.004565
v 0.002694 -0.007149 0.006930
v 0.000329 -0.007676 0.007456
v 0.003351 -0.009515 0.004828
v -0.002562 -0.005572 0.006930
v -0.003351 -0.009515 0.004828
v -0.002168 -0.009778 0.005615
f 98 88 116 
f 68 71 72 
f 71 68 75 
f 75 68 78 
f 68 72 79 
f 70 73 83 
f 87 80 89 
f 84 74 90 
f 71 75 91 
f 74 80 92 
f 90 74 92 
f 85 90 92 
f 69 68 93 
f 68 79 93 
f 74 84 94 
f 79 89 94 
f 70 75 95 
f 75 78 95 
f 71 91 96 
f 91 73 96 
f 89 72 97 
f 87 89 97 
f 87 77 98 
f 80 87 98 
f 77 88 98 
f 90 76 99 
f 84 90 99 
f 78 68 100 
f 68 86 100 
f 95 78 100 
f 79 72 101 
f 72 89 101 
f 89 79 101 
f 73 77 102 
f 77 81 102 
f 96 73 102 
f 96 102 103 
f 72 71 103 
f 71 96 103 
f 102 81 103 
f 85 82 104 
f 76 90 104 
f 90 85 104 
f 68 69 105 
f 86 68 105 
f 69 93 105 
f 99 86 105 
f 75 70 106 
f 70 83 106 
f 83 73 106 
f 73 91 106 
f 91 75 106 
f 67 85 107 
f 92 80 107 
f 85 92 107 
f 98 67 107 
f 80 98 107 
f 73 70 108 
f 82 73 108 
f 104 82 108 
f 81 77 109 
f 77 87 109 
f 87 97 109 
f 70 95 110 
f 99 70 110 
f 86 99 110 
f 100 86 110 
f 95 100 110 
f 93 79 111 
f 94 84 111 
f 79 94 111 
f 84 99 111 
f 105 93 111 
f 99 105 111 
f 80 74 112 
f 89 80 112 
f 74 94 112 
f 94 89 112 
f 70 99 113 
f 99 76 113 
f 76 104 113 
f 108 70 113 
f 104 108 113 
f 97 72 114 
f 72 103 114 
f 103 81 114 
f 81 109 114 
f 109 97 114 
f 77 73 115 
f 73 82 115 
f 88 77 115 
f 82 88 115 
f 85 67 116 
f 82 85 116 
f 88 82 116 
f 67 98 116 
o convex_2
v 0.002300 -0.005177 0.007193
v -0.002695 -0.003074 0.002724
v -0.002695 -0.005572 0.003776
v -0.001775 -0.002942 0.007324
v 0.002695 -0.002942 0.002724
v 0.002695 -0.005572 0.003776
v -0.002432 -0.005572 0.007061
v 0.000197 -0.002942 0.008114
v 0.000328 -0.005045 0.002724
v 0.003089 -0.003863 0.005747
v -0.003352 -0.004914 0.005747
v 0.003352 -0.005572 0.005879
v 0.001906 -0.002942 0.007193
v 0.001380 -0.005572 0.007456
v -0.002563 -0.002942 0.005879
v -0.000460 -0.005572 0.002988
v -0.001380 -0.005572 0.007456
v -0.003352 -0.005572 0.005484
v -0.002695 -0.002942 0.002724
v -0.001643 -0.004651 0.002724
v 0.001643 -0.004651 0.002724
v 0.002563 -0.002942 0.005879
v -0.003220 -0.004257 0.005879
v -0.000197 -0.003074 0.008114
v 0.003220 -0.004257 0.005879
v 0.003352 -0.005572 0.005484
v -0.002300 -0.004651 0.007193
v 0.000460 -0.005572 0.002988
v 0.002300 -0.004651 0.007193
v -0.003352 -0.005572 0.005879
v 0.003352 -0.004914 0.005615
f 128 142 147 
f 119 122 123 
f 121 120 124 
f 118 121 125 
f 123 122 128 
f 121 124 129 
f 117 124 130 
f 123 128 130 
f 128 117 130 
f 120 121 131 
f 122 119 132 
f 123 130 133 
f 118 119 134 
f 119 123 134 
f 134 127 135 
f 121 118 135 
f 131 121 135 
f 118 134 135 
f 119 118 136 
f 118 125 136 
f 132 119 136 
f 125 132 136 
f 121 122 137 
f 125 121 137 
f 126 121 138 
f 121 129 138 
f 120 131 139 
f 135 127 139 
f 131 135 139 
f 124 120 140 
f 130 124 140 
f 133 130 140 
f 121 126 141 
f 126 138 141 
f 138 129 141 
f 122 121 142 
f 128 122 142 
f 123 133 143 
f 120 139 143 
f 140 120 143 
f 133 140 143 
f 122 132 144 
f 132 125 144 
f 137 122 144 
f 125 137 144 
f 124 117 145 
f 117 128 145 
f 129 124 145 
f 128 141 145 
f 141 129 145 
f 134 123 146 
f 127 134 146 
f 139 127 146 
f 123 143 146 
f 143 139 146 
f 121 141 147 
f 141 128 147 
f 142 121 147 
o convex_3
v -0.001643 -0.002942 0.002724
v 0.000065 0.009151 0.002855
v 0.000328 0.008493 0.003513
v 0.008347 0.003106 0.002724
v 0.002299 -0.002941 0.004564
v -0.008348 0.002054 0.004564
v 0.008084 0.004156 0.004564
v -0.008348 0.003366 0.002724
v -0.005717 0.005207 0.004564
v 0.006638 -0.000312 0.002724
v 0.004272 0.008231 0.002724
v 0.008347 0.001397 0.004564
v -0.002300 -0.002942 0.004564
v -0.006637 -0.000312 0.002724
v 0.000065 0.007310 0.004564
v -0.004272 0.008230 0.002724
v -0.008083 0.004156 0.004564
v 0.002825 -0.002941 0.002724
v -0.008348 0.001396 0.004564
v -0.002826 -0.002942 0.002724
v -0.004009 0.008363 0.002855
v 0.004008 0.008363 0.002855
v -0.008083 0.001660 0.002724
v 0.007558 0.004550 0.002724
v 0.002168 0.006916 0.004433
v 0.008084 0.001660 0.002724
v -0.001643 0.006916 0.004564
v -0.007558 0.004550 0.002724
v 0.006901 0.000214 0.004564
v -0.006900 0.000214 0.004564
v -0.000590 0.008887 0.003119
v 0.004667 0.007968 0.002724
v -0.004666 0.007968 0.002724
v -0.000064 0.009151 0.002724
v -0.007426 0.000476 0.002724
v 0.007427 0.000478 0.002724
v 0.008347 0.003366 0.002855
v 0.002825 -0.002941 0.002855
v -0.002826 -0.002942 0.002855
f 177 161 186 
f 153 152 154 
f 151 148 155 
f 153 154 156 
f 148 151 157 
f 151 155 158 
f 154 152 159 
f 148 152 160 
f 152 153 160 
f 155 148 161 
f 156 154 162 
f 158 155 163 
f 155 153 164 
f 153 156 164 
f 148 157 165 
f 153 155 166 
f 160 153 166 
f 148 160 167 
f 161 148 167 
f 164 156 168 
f 149 150 169 
f 150 162 169 
f 155 161 170 
f 166 155 170 
f 151 158 171 
f 162 154 172 
f 154 169 172 
f 169 162 172 
f 157 151 173 
f 151 159 173 
f 156 162 174 
f 168 156 174 
f 163 155 175 
f 155 164 175 
f 159 152 176 
f 157 159 176 
f 160 166 177 
f 166 161 177 
f 150 149 178 
f 162 150 178 
f 149 168 178 
f 174 162 178 
f 168 174 178 
f 158 169 179 
f 169 154 179 
f 154 171 179 
f 171 158 179 
f 168 163 180 
f 164 168 180 
f 163 175 180 
f 175 164 180 
f 158 163 181 
f 168 149 181 
f 163 168 181 
f 149 169 181 
f 169 158 181 
f 161 166 182 
f 170 161 182 
f 166 170 182 
f 159 157 183 
f 157 173 183 
f 173 159 183 
f 159 151 184 
f 154 159 184 
f 151 171 184 
f 171 154 184 
f 152 148 185 
f 148 165 185 
f 165 157 185 
f 176 152 185 
f 157 176 185 
f 167 160 186 
f 161 167 186 
f 160 177 186 
o convex_4
v -0.008217 0.001264 -0.003192
v -0.013211 0.000476 -0.005427
v -0.013211 0.001264 -0.005427
v -0.008348 -0.000576 -0.001220
v -0.008480 -0.001233 -0.003849
v -0.012948 0.001264 -0.004112
v -0.010583 -0.001102 -0.003192
v -0.010320 0.001264 -0.005032
v -0.010320 -0.000970 -0.005032
v -0.008217 -0.001365 -0.001483
v -0.012817 0.000344 -0.004112
v -0.008217 0.001264 -0.003717
v -0.008217 -0.001365 -0.003192
v -0.009137 0.001264 -0.003192
v -0.008348 -0.000970 -0.001220
v -0.008874 -0.001365 -0.001878
v -0.010583 -0.000970 -0.004769
v -0.013343 0.001133 -0.004901
v -0.012817 0.000870 -0.005427
f 195 188 205 
f 187 189 192 
f 189 187 194 
f 187 190 196 
f 188 193 197 
f 194 187 198 
f 191 195 198 
f 195 194 198 
f 187 196 198 
f 198 196 199 
f 195 191 199 
f 191 198 199 
f 190 187 200 
f 187 192 200 
f 192 190 200 
f 190 192 201 
f 196 190 201 
f 192 197 201 
f 201 197 202 
f 197 193 202 
f 199 196 202 
f 193 199 202 
f 196 201 202 
f 193 188 203 
f 188 195 203 
f 195 199 203 
f 199 193 203 
f 189 188 204 
f 192 189 204 
f 188 197 204 
f 197 192 204 
f 188 189 205 
f 189 194 205 
f 194 195 205 
o convex_5
v -0.002563 -0.003467 -0.002272
v 0.000722 0.009809 -0.001220
v 0.001775 0.009677 -0.001220
v 0.000195 0.005734 -0.008582
v 0.008346 -0.001364 -0.001484
v -0.008215 0.005339 -0.001220
v -0.000197 -0.001756 -0.007004
v -0.008215 -0.001232 -0.003587
v 0.008346 0.003499 -0.004112
v -0.006374 0.006917 -0.004638
v -0.000197 -0.004257 -0.001220
v 0.007821 0.006523 -0.001221
v 0.000722 0.009021 -0.005426
v 0.008346 -0.001232 -0.003586
v -0.004665 0.004024 -0.007135
v -0.008083 -0.001364 -0.001220
v 0.004666 0.004550 -0.007135
v 0.004666 0.008756 -0.003981
v 0.000195 0.000478 -0.008319
v -0.004665 0.009282 -0.001221
v 0.000195 -0.003862 -0.003719
v -0.008215 0.003236 -0.004244
v -0.004665 0.008756 -0.003981
v 0.006506 0.006784 -0.004638
v 0.008346 -0.000969 -0.001220
v 0.004666 0.009284 -0.001221
v -0.008083 0.006258 -0.001484
v -0.000197 0.000478 -0.008319
v -0.000722 0.009021 -0.005426
v 0.000066 -0.002021 -0.006872
v -0.000722 0.005602 -0.008449
v 0.002825 -0.003467 -0.001615
v -0.008083 0.005470 -0.003718
v 0.008346 0.004550 -0.001220
v 0.008084 0.005470 -0.003718
v 0.005981 0.003368 -0.006214
v -0.004797 0.004682 -0.007004
v -0.003615 0.000609 -0.006741
v -0.000197 -0.003862 -0.003719
v 0.003615 0.000609 -0.006741
v -0.000197 0.009809 -0.001746
v -0.005980 0.003368 -0.006214
v 0.004666 0.004024 -0.007135
v -0.008215 -0.001364 -0.001352
v -0.008215 -0.001364 -0.003323
v -0.002825 -0.003467 -0.001221
v -0.000197 -0.002416 -0.006215
v 0.008346 -0.001364 -0.003192
v 0.008084 0.006260 -0.001484
v 0.006243 0.007178 -0.004507
v 0.002694 -0.003336 -0.002929
v 0.004666 0.009284 -0.001484
v 0.000195 0.009151 -0.005294
v -0.004665 0.009282 -0.001483
v 0.000195 -0.004257 -0.001220
v 0.000722 0.005602 -0.008449
v -0.000197 0.006654 -0.007793
v 0.000066 0.001398 -0.008449
v -0.006506 0.007047 -0.004244
v -0.006112 0.007969 -0.002141
v 0.006375 0.007704 -0.002273
v 0.000195 -0.002808 -0.005557
v 0.004930 0.004419 -0.007004
v 0.007952 -0.001495 -0.001221
v -0.000197 0.009151 -0.005294
v -0.000197 0.002055 -0.008449
v 0.008215 0.002841 -0.004244
v -0.001643 -0.003597 -0.003192
v -0.008083 -0.001495 -0.001352
v -0.007821 0.006521 -0.001220
v -0.004403 0.004418 -0.007267
v 0.000195 0.008099 -0.006478
v 0.006112 0.006389 -0.005163
v -0.004930 0.004419 -0.007004
v -0.006112 0.006391 -0.005163
v 0.000195 -0.001756 -0.007004
v 0.004403 0.004418 -0.007267
v 0.000195 0.009809 -0.001746
v -0.007164 0.002842 -0.005163
v -0.000328 0.005471 -0.008582
v 0.006637 0.006917 -0.004244
v -0.001906 0.000478 -0.007530
v 0.002825 -0.003467 -0.001220
v -0.000722 0.009809 -0.001220
v -0.002825 -0.003467 -0.001615
v -0.000197 -0.003731 -0.003981
v 0.001906 0.000478 -0.007530
v 0.000328 0.005471 -0.008582
v 0.008084 -0.001495 -0.001352
v -0.000854 -0.002021 -0.006478
v 0.000195 0.006654 -0.007793
v 0.000195 -0.003993 -0.003193
f 256 260 297 
f 208 207 211 
f 208 211 216 
f 214 210 219 
f 216 211 221 
f 213 211 227 
f 210 214 230 
f 208 216 230 
f 212 233 235 
f 233 224 235 
f 215 228 236 
f 227 211 238 
f 211 232 238 
f 230 214 239 
f 208 230 239 
f 231 208 239 
f 217 231 239 
f 239 214 240 
f 243 213 247 
f 220 243 247 
f 241 219 248 
f 219 245 248 
f 211 213 249 
f 221 211 249 
f 249 213 250 
f 216 221 251 
f 219 210 253 
f 217 239 254 
f 239 240 254 
f 226 219 256 
f 219 253 256 
f 253 237 256 
f 207 208 257 
f 208 231 257 
f 231 217 257 
f 223 218 258 
f 257 223 258 
f 230 216 260 
f 256 237 260 
f 209 223 261 
f 223 255 261 
f 228 234 262 
f 236 228 262 
f 209 236 262 
f 224 233 263 
f 228 215 264 
f 215 238 264 
f 238 232 264 
f 259 228 265 
f 228 264 265 
f 264 232 265 
f 217 254 266 
f 223 257 266 
f 257 217 266 
f 219 226 267 
f 235 219 267 
f 252 235 267 
f 240 214 268 
f 214 241 268 
f 241 248 268 
f 210 230 269 
f 234 228 270 
f 246 258 270 
f 228 259 270 
f 259 246 270 
f 263 233 271 
f 214 219 272 
f 241 214 272 
f 219 241 272 
f 216 206 273 
f 244 216 273 
f 206 250 273 
f 250 244 273 
f 221 249 274 
f 249 250 274 
f 251 221 274 
f 211 207 275 
f 232 211 275 
f 225 259 275 
f 265 232 275 
f 259 265 275 
f 233 220 276 
f 242 236 276 
f 271 233 276 
f 258 218 277 
f 262 234 277 
f 234 270 277 
f 270 258 277 
f 229 240 278 
f 255 229 278 
f 222 261 278 
f 261 255 278 
f 268 222 278 
f 240 268 278 
f 227 238 279 
f 247 227 279 
f 220 247 279 
f 276 220 279 
f 242 276 279 
f 215 236 280 
f 238 215 280 
f 236 242 280 
f 279 238 280 
f 242 279 280 
f 224 219 281 
f 219 235 281 
f 235 224 281 
f 248 224 282 
f 261 222 282 
f 224 263 282 
f 222 268 282 
f 268 248 282 
f 246 207 283 
f 207 257 283 
f 258 246 283 
f 257 258 283 
f 213 227 284 
f 247 213 284 
f 227 247 284 
f 236 209 285 
f 263 271 285 
f 276 236 285 
f 271 276 285 
f 240 229 286 
f 254 240 286 
f 255 223 286 
f 229 255 286 
f 266 254 286 
f 223 266 286 
f 212 213 287 
f 233 212 287 
f 220 233 287 
f 213 243 287 
f 243 220 287 
f 230 260 288 
f 260 237 288 
f 269 230 288 
f 207 246 289 
f 259 225 289 
f 246 259 289 
f 275 207 289 
f 225 275 289 
f 206 216 290 
f 250 206 290 
f 216 251 290 
f 274 250 290 
f 251 274 290 
f 226 244 291 
f 244 250 291 
f 250 213 291 
f 213 252 291 
f 267 226 291 
f 252 267 291 
f 219 224 292 
f 245 219 292 
f 224 248 292 
f 248 245 292 
f 209 261 293 
f 261 282 293 
f 282 263 293 
f 285 209 293 
f 263 285 293 
f 253 210 294 
f 237 253 294 
f 210 269 294 
f 288 237 294 
f 269 288 294 
f 213 212 295 
f 212 235 295 
f 252 213 295 
f 235 252 295 
f 218 223 296 
f 223 209 296 
f 209 262 296 
f 277 218 296 
f 262 277 296 
f 216 244 297 
f 244 226 297 
f 226 256 297 
f 260 216 297 
o convex_6
v -0.013343 0.001264 -0.005295
v -0.012291 0.005208 -0.004112
v -0.010452 0.004945 -0.003192
v -0.008216 0.003499 -0.004112
v -0.008216 0.001264 -0.003192
v -0.013079 0.001396 -0.004112
v -0.012423 0.004814 -0.005558
v -0.010320 0.001264 -0.005032
v -0.013606 0.003368 -0.004112
v -0.010452 0.004551 -0.005032
v -0.008611 0.004025 -0.003192
v -0.010977 0.004156 -0.003192
v -0.013606 0.003368 -0.005163
v -0.009137 0.001264 -0.003192
v -0.008216 0.001264 -0.003718
v -0.012685 0.001264 -0.005426
v -0.012554 0.005077 -0.004112
v -0.008743 0.004025 -0.004112
v -0.013738 0.002579 -0.004901
v -0.008216 0.003499 -0.003192
v -0.012554 0.001264 -0.003981
v -0.012685 0.004682 -0.005558
v -0.012291 0.004288 -0.005558
v -0.010320 0.004419 -0.005032
v -0.010715 0.004945 -0.003192
v -0.008216 0.002843 -0.004112
v -0.010058 0.004814 -0.003455
v -0.013211 0.001264 -0.005426
v -0.013474 0.002448 -0.004112
v -0.013343 0.001264 -0.004769
f 303 326 327 
f 302 298 305 
f 304 299 307 
f 300 302 308 
f 302 300 309 
f 298 302 311 
f 302 309 311 
f 301 302 312 
f 302 305 312 
f 305 298 313 
f 299 304 314 
f 310 306 314 
f 308 301 315 
f 310 298 316 
f 306 310 316 
f 302 301 317 
f 301 308 317 
f 308 302 317 
f 309 303 318 
f 298 311 318 
f 311 309 318 
f 314 304 319 
f 310 314 319 
f 305 313 320 
f 319 304 320 
f 301 305 321 
f 304 307 321 
f 307 315 321 
f 315 301 321 
f 320 304 321 
f 305 320 321 
f 300 299 322 
f 309 300 322 
f 306 309 322 
f 299 314 322 
f 314 306 322 
f 305 301 323 
f 301 312 323 
f 312 305 323 
f 299 300 324 
f 307 299 324 
f 300 308 324 
f 315 307 324 
f 308 315 324 
f 298 310 325 
f 313 298 325 
f 310 319 325 
f 320 313 325 
f 319 320 325 
f 303 309 326 
f 309 306 326 
f 306 316 326 
f 326 316 327 
f 316 298 327 
f 298 318 327 
f 318 303 327 
o convex_7
v -0.008611 0.004025 -0.003192
v -0.010714 0.004025 -0.003192
v -0.010714 0.004025 -0.003060
v -0.008348 0.001396 -0.002929
v -0.008216 0.004551 -0.001220
v -0.008348 0.002448 -0.001220
v -0.010451 0.004814 -0.003192
v -0.008216 0.001396 -0.003192
v -0.008216 0.003499 -0.003192
v -0.008611 0.003236 -0.001220
v -0.010714 0.004419 -0.003060
v -0.010056 0.004814 -0.003192
v -0.008216 0.002448 -0.001220
v -0.008348 0.001527 -0.002534
v -0.008348 0.004551 -0.001220
f 338 337 342 
f 330 329 331 
f 328 329 334 
f 329 328 335 
f 331 329 335 
f 328 332 336 
f 335 328 336 
f 332 335 336 
f 330 333 337 
f 333 332 337 
f 329 330 338 
f 334 329 338 
f 330 337 338 
f 332 328 339 
f 328 334 339 
f 334 332 339 
f 332 333 340 
f 335 332 340 
f 335 340 341 
f 330 331 341 
f 333 330 341 
f 331 335 341 
f 340 333 341 
f 332 334 342 
f 337 332 342 
f 334 338 342 
o convex_8
v 0.008611 -0.000444 -0.001483
v 0.012817 0.000870 -0.005427
v 0.012817 0.001264 -0.005427
v 0.008611 0.001264 -0.003980
v 0.010320 -0.000970 -0.005032
v 0.012948 0.001264 -0.004112
v 0.010583 -0.001102 -0.003192
v 0.008348 -0.001233 -0.003717
v 0.008348 0.001264 -0.003192
v 0.013080 0.000344 -0.005295
v 0.008348 -0.001233 -0.001483
v 0.010320 0.001264 -0.005032
v 0.012817 0.000344 -0.004112
v 0.009006 -0.001365 -0.002009
v 0.009137 0.001264 -0.003192
v 0.008480 -0.000970 -0.001352
v 0.013343 0.001264 -0.004900
v 0.008480 -0.001365 -0.002929
v 0.010583 -0.000970 -0.004769
v 0.013211 0.000476 -0.005427
v 0.008348 -0.000576 -0.001352
f 353 358 363 
f 345 344 347 
f 345 346 348 
f 346 347 350 
f 348 346 351 
f 346 350 351 
f 351 350 353 
f 346 345 354 
f 347 346 354 
f 345 347 354 
f 349 352 355 
f 349 355 356 
f 343 348 357 
f 348 351 357 
f 348 343 358 
f 355 348 358 
f 353 356 358 
f 356 355 358 
f 345 348 359 
f 348 355 359 
f 350 347 360 
f 353 350 360 
f 356 353 360 
f 349 356 360 
f 347 352 361 
f 352 349 361 
f 360 347 361 
f 349 360 361 
f 344 345 362 
f 347 344 362 
f 352 347 362 
f 355 352 362 
f 345 359 362 
f 359 355 362 
f 351 353 363 
f 343 357 363 
f 357 351 363 
f 358 343 363 
o convex_9
v -0.002827 0.002318 0.008377
v -0.008611 0.003236 0.005354
v -0.008611 0.003236 0.005485
v -0.003089 0.007706 0.007325
v -0.002695 -0.002153 0.004564
v -0.002695 0.005997 0.004564
v -0.008084 0.004155 0.004564
v -0.006507 -0.000444 0.005485
v -0.007032 0.004287 0.007325
v -0.002695 -0.000838 0.007456
v -0.002695 0.006391 0.008508
v -0.008216 0.001266 0.004564
v -0.008611 0.004419 0.006143
v -0.004404 0.001397 0.007982
v -0.006243 0.000476 0.006405
v -0.003616 0.006259 0.008377
v -0.003616 0.006917 0.005879
v -0.003616 0.002186 0.008377
v -0.004404 -0.001495 0.005485
v -0.008611 0.004419 0.005748
v -0.002695 0.007574 0.007193
v -0.005456 0.005339 0.004564
v -0.003221 0.007706 0.007456
v -0.006243 -0.000312 0.004564
v -0.007032 0.004024 0.007325
v -0.008611 0.004155 0.006143
v -0.002827 -0.000838 0.007456
v -0.008479 0.002054 0.004959
v -0.002958 -0.002153 0.004696
v -0.003484 0.007311 0.006536
v -0.003353 0.001266 0.008245
v -0.006770 0.004155 0.007456
v -0.002695 0.001396 0.008245
v -0.006507 0.000608 0.006274
v -0.003353 0.007048 0.007982
v -0.002958 -0.001759 0.005748
v -0.008479 0.002317 0.004696
v -0.005850 -0.000838 0.005485
v -0.006507 -0.000444 0.005222
f 401 371 402 
f 369 368 370 
f 368 369 373 
f 373 369 374 
f 370 368 375 
f 365 366 376 
f 376 372 379 
f 364 374 381 
f 374 379 381 
f 365 376 383 
f 374 369 384 
f 369 370 385 
f 380 369 385 
f 370 380 385 
f 383 376 386 
f 384 367 386 
f 374 384 386 
f 375 368 387 
f 372 376 388 
f 378 377 388 
f 376 366 389 
f 388 376 389 
f 378 371 390 
f 377 378 390 
f 366 365 391 
f 375 371 391 
f 389 366 391 
f 387 368 392 
f 369 380 393 
f 380 370 393 
f 370 383 393 
f 367 384 393 
f 384 369 393 
f 386 367 393 
f 383 386 393 
f 364 381 394 
f 381 377 394 
f 390 373 394 
f 377 390 394 
f 379 372 395 
f 377 381 395 
f 381 379 395 
f 372 388 395 
f 388 377 395 
f 374 364 396 
f 373 374 396 
f 364 394 396 
f 394 373 396 
f 371 378 397 
f 378 388 397 
f 388 389 397 
f 391 371 397 
f 389 391 397 
f 379 374 398 
f 376 379 398 
f 374 386 398 
f 386 376 398 
f 368 373 399 
f 373 390 399 
f 390 382 399 
f 392 368 399 
f 382 392 399 
f 370 375 400 
f 365 383 400 
f 383 370 400 
f 391 365 400 
f 375 391 400 
f 390 371 401 
f 382 390 401 
f 392 382 401 
f 392 401 402 
f 371 375 402 
f 375 387 402 
f 387 392 402 
o convex_10
v -0.002695 0.006128 0.004564
v -0.001906 0.006260 0.008640
v -0.002432 0.006785 0.008245
v -0.002563 -0.002942 0.005748
v -0.000066 0.007048 0.004564
v -0.000066 -0.002679 0.008245
v -0.000066 -0.002942 0.004564
v -0.002695 0.001528 0.008245
v -0.000066 0.003762 0.008376
v -0.002695 -0.002284 0.004564
v -0.002695 0.007575 0.007456
v -0.001249 -0.002284 0.008376
v -0.001511 0.007311 0.007719
v -0.002695 -0.000838 0.007456
v -0.001906 -0.002942 0.007193
v -0.002695 0.006128 0.008508
v -0.000066 -0.002153 0.008376
v -0.001643 0.006785 0.004564
v -0.000066 -0.002942 0.008114
v -0.002432 -0.002942 0.004564
v -0.000066 0.007048 0.004696
v -0.000066 0.004550 0.007588
v -0.000723 0.004024 0.008508
v -0.000592 0.007049 0.004564
v -0.002169 0.006128 0.008640
v -0.002695 0.007575 0.007325
f 426 420 428 
f 403 407 409 
f 407 408 409 
f 408 407 411 
f 403 409 412 
f 410 403 412 
f 403 410 413 
f 405 404 415 
f 404 411 415 
f 413 405 415 
f 412 406 416 
f 410 412 416 
f 414 410 416 
f 414 416 417 
f 406 409 417 
f 416 406 417 
f 404 405 418 
f 405 413 418 
f 413 410 418 
f 408 411 419 
f 414 408 419 
f 407 403 420 
f 409 408 421 
f 408 414 421 
f 414 417 421 
f 417 409 421 
f 409 406 422 
f 406 412 422 
f 412 409 422 
f 411 407 423 
f 407 413 423 
f 413 415 423 
f 423 415 424 
f 415 411 424 
f 411 423 424 
f 411 404 425 
f 404 419 425 
f 419 411 425 
f 407 420 426 
f 410 414 427 
f 404 418 427 
f 418 410 427 
f 419 404 427 
f 414 419 427 
f 403 413 428 
f 413 407 428 
f 420 403 428 
f 407 426 428 
o convex_11
v 0.003353 0.007048 0.007982
v 0.002695 -0.002153 0.004564
v 0.002958 -0.002153 0.004564
v 0.002695 0.005997 0.004564
v 0.008610 0.003629 0.005354
v 0.002695 0.001396 0.008245
v 0.008216 0.001266 0.004565
v 0.007033 0.004025 0.007325
v 0.006376 -0.000443 0.005616
v 0.002827 -0.000838 0.007456
v 0.008084 0.004156 0.004565
v 0.002695 0.007574 0.007193
v 0.008610 0.004419 0.006142
v 0.003090 0.006391 0.008508
v 0.004404 0.001396 0.007982
v 0.003353 0.007574 0.007062
v 0.006507 0.000608 0.006273
v 0.003616 0.002186 0.008377
v 0.003484 0.007048 0.006011
v 0.002695 0.006391 0.008508
v 0.004404 -0.001495 0.005485
v 0.005456 0.005340 0.004564
v 0.006770 0.004288 0.007456
v 0.006507 -0.000443 0.005222
v 0.003221 0.007706 0.007456
v 0.008479 0.002053 0.004959
v 0.008610 0.004419 0.005748
v 0.008610 0.004156 0.006142
v 0.006244 -0.000312 0.004565
v 0.003616 0.006259 0.008377
v 0.002695 -0.001759 0.005748
v 0.003353 0.001265 0.008245
v 0.006112 0.000345 0.006405
v 0.008479 0.002317 0.004696
v 0.005325 -0.001102 0.005485
v 0.002695 -0.000838 0.007456
v 0.003484 0.007311 0.006536
f 444 455 465 
f 431 430 432 
f 432 430 434 
f 432 434 440 
f 436 443 445 
f 432 440 447 
f 440 444 447 
f 440 434 448 
f 434 446 448 
f 446 442 448 
f 431 432 450 
f 435 431 450 
f 439 435 450 
f 432 447 450 
f 447 439 450 
f 436 441 451 
f 443 436 451 
f 446 443 451 
f 435 437 452 
f 429 441 453 
f 442 429 453 
f 444 440 453 
f 440 448 453 
f 448 442 453 
f 437 435 454 
f 445 437 454 
f 433 439 455 
f 441 433 455 
f 453 441 455 
f 444 453 455 
f 433 441 456 
f 441 436 456 
f 436 445 456 
f 454 433 456 
f 445 454 456 
f 431 435 457 
f 452 431 457 
f 435 452 457 
f 441 429 458 
f 429 442 458 
f 442 446 458 
f 451 441 458 
f 446 451 458 
f 430 431 459 
f 434 430 459 
f 431 449 459 
f 449 438 459 
f 438 443 460 
f 446 434 460 
f 443 446 460 
f 438 437 461 
f 443 438 461 
f 437 445 461 
f 445 443 461 
f 439 433 462 
f 435 439 462 
f 454 435 462 
f 433 454 462 
f 437 438 463 
f 449 431 463 
f 438 449 463 
f 431 452 463 
f 452 437 463 
f 434 459 464 
f 459 438 464 
f 460 434 464 
f 438 460 464 
f 439 447 465 
f 447 444 465 
f 455 439 465 
o convex_12
v 0.008612 0.001264 -0.003981
v 0.012423 0.005208 -0.004112
v 0.012554 0.005077 -0.004112
v 0.012554 0.003499 -0.005558
v 0.013080 0.001396 -0.004112
v 0.008612 0.004025 -0.003192
v 0.010057 0.004419 -0.004901
v 0.013211 0.001264 -0.005426
v 0.009137 0.001264 -0.003192
v 0.010715 0.004945 -0.003192
v 0.010320 0.001264 -0.005032
v 0.013605 0.003368 -0.004112
v 0.012554 0.004814 -0.005558
v 0.008348 0.003630 -0.004112
v 0.013738 0.002974 -0.005163
v 0.010978 0.004156 -0.003192
v 0.008348 0.001264 -0.003192
v 0.013343 0.001264 -0.004769
v 0.010057 0.004814 -0.003455
v 0.011370 0.004682 -0.005295
v 0.008743 0.004025 -0.004112
v 0.008348 0.003630 -0.003192
v 0.012554 0.001264 -0.003981
v 0.013605 0.003368 -0.005163
v 0.013605 0.002974 -0.004112
v 0.012686 0.001264 -0.005426
v 0.012292 0.004288 -0.005558
v 0.010320 0.004419 -0.005032
f 492 476 493 
f 466 473 474 
f 468 467 475 
f 471 474 475 
f 473 466 476 
f 468 475 477 
f 467 468 478 
f 473 469 478 
f 476 466 479 
f 473 478 480 
f 475 474 481 
f 477 475 481 
f 474 471 482 
f 466 474 482 
f 479 466 482 
f 474 473 483 
f 473 480 483 
f 475 467 484 
f 471 475 484 
f 467 478 485 
f 484 467 485 
f 472 484 485 
f 479 471 486 
f 472 479 486 
f 484 472 486 
f 471 484 486 
f 471 479 487 
f 482 471 487 
f 479 482 487 
f 470 481 488 
f 481 474 488 
f 483 470 488 
f 474 483 488 
f 468 477 489 
f 478 468 489 
f 477 480 489 
f 480 478 489 
f 480 477 490 
f 481 470 490 
f 477 481 490 
f 470 483 490 
f 483 480 490 
f 469 473 491 
f 476 469 491 
f 473 476 491 
f 469 476 492 
f 478 469 492 
f 485 478 492 
f 485 492 493 
f 479 472 493 
f 476 479 493 
f 472 485 493 
o convex_13
v 0.010451 0.004814 -0.003192
v 0.008348 0.001527 -0.003192
v 0.008479 0.001527 -0.003192
v 0.008348 0.003631 -0.001220
v 0.008348 0.003631 -0.003192
v 0.010714 0.004025 -0.003060
v 0.008479 0.002711 -0.001220
v 0.008742 0.004156 -0.002271
v 0.008742 0.001922 -0.002666
v 0.010057 0.004814 -0.003192
v 0.010714 0.004419 -0.003060
v 0.008611 0.003236 -0.001220
f 499 504 505 
f 496 495 494 
f 494 495 498 
f 495 497 498 
f 496 494 499 
f 495 496 500 
f 497 495 500 
f 498 497 501 
f 496 499 502 
f 499 500 502 
f 500 496 502 
f 497 494 503 
f 494 498 503 
f 501 497 503 
f 498 501 503 
f 494 497 504 
f 499 494 504 
f 497 500 505 
f 500 499 505 
f 504 497 505 
o convex_14
v 0.000066 0.006391 0.005353
v -0.000066 -0.002942 0.004564
v 0.002432 -0.002942 0.004564
v -0.000066 -0.002942 0.005879
v 0.002695 0.005208 0.005879
v 0.002695 0.006129 0.004564
v 0.002695 -0.001627 0.005879
v -0.000066 0.007049 0.004564
v -0.000066 0.005602 0.005879
v 0.002432 -0.002942 0.005879
v 0.002695 -0.002284 0.004564
v 0.001643 0.006786 0.004696
f 511 513 517 
f 507 508 509 
f 508 507 511 
f 510 509 512 
f 511 510 512 
f 507 509 513 
f 511 507 513 
f 510 506 514 
f 509 510 514 
f 513 509 514 
f 506 513 514 
f 509 508 515 
f 512 509 515 
f 512 515 516 
f 508 511 516 
f 511 512 516 
f 515 508 516 
f 506 510 517 
f 510 511 517 
f 513 506 517 
o convex_15
v 0.002695 0.006917 0.008114
v -0.000066 -0.002942 0.005879
v 0.002432 -0.002942 0.005879
v 0.000855 -0.002416 0.008377
v -0.000066 0.004945 0.005879
v -0.000066 0.003762 0.008245
v 0.002695 0.006523 0.005879
v 0.002695 0.001528 0.008245
v 0.001906 0.006260 0.008639
v -0.000066 -0.002942 0.008114
v 0.001512 0.007311 0.007719
v 0.002695 -0.000838 0.007456
v -0.000066 -0.002284 0.008377
v 0.002695 -0.001628 0.005879
v 0.001249 -0.002284 0.008377
v 0.002037 0.006785 0.006011
v 0.002695 0.007575 0.007325
v 0.001906 -0.002942 0.007194
v 0.002695 0.006128 0.008508
v 0.000066 0.003762 0.008377
v -0.000066 0.004419 0.007588
v 0.001512 0.007179 0.007194
v 0.002169 0.006128 0.008639
v 0.000723 0.004288 0.008508
f 537 530 541 
f 520 519 522 
f 522 519 523 
f 520 522 524 
f 524 518 525 
f 519 520 527 
f 523 519 527 
f 526 518 528 
f 524 525 529 
f 527 521 530 
f 523 527 530 
f 520 524 531 
f 529 520 531 
f 524 529 531 
f 521 527 532 
f 529 525 532 
f 524 522 533 
f 518 524 534 
f 528 518 534 
f 524 533 534 
f 527 520 535 
f 520 529 535 
f 532 527 535 
f 529 532 535 
f 525 518 536 
f 518 526 536 
f 528 523 537 
f 526 528 537 
f 523 530 537 
f 522 523 538 
f 528 522 538 
f 523 528 538 
f 522 528 539 
f 533 522 539 
f 528 534 539 
f 534 533 539 
f 526 530 540 
f 530 521 540 
f 521 532 540 
f 532 525 540 
f 525 536 540 
f 536 526 540 
f 530 526 541 
f 526 537 541 
