o convex_0
v -0.061302 -0.033634 -0.014245
v -0.061006 -0.033831 -0.016521
v -0.061055 -0.033930 -0.016472
v -0.063826 -0.033831 -0.014146
v -0.062490 -0.034772 -0.014096
v -0.058729 -0.032990 -0.016472
v -0.059273 -0.034277 -0.016472
v -0.059768 -0.032792 -0.016521
v -0.062292 -0.033238 -0.014096
v -0.061649 -0.034574 -0.015630
v -0.061401 -0.034128 -0.014096
v -0.063579 -0.033485 -0.014146
v -0.063678 -0.034425 -0.014146
v -0.060758 -0.033237 -0.016521
v -0.058580 -0.033535 -0.016472
v -0.060610 -0.034425 -0.014987
v -0.059966 -0.034474 -0.016472
v -0.060956 -0.034673 -0.015086
v -0.063183 -0.033287 -0.014096
v -0.062094 -0.034772 -0.014789
v -0.060610 -0.034376 -0.016521
v -0.059125 -0.032792 -0.016521
v -0.061797 -0.033386 -0.014096
v -0.061698 -0.034524 -0.014096
v -0.061896 -0.034277 -0.015729
v -0.063430 -0.034623 -0.014096
v -0.058729 -0.033831 -0.016521
v -0.060263 -0.032940 -0.016521
v -0.061302 -0.034722 -0.015432
v -0.059916 -0.034277 -0.015531
v -0.058580 -0.033287 -0.016472
v -0.061203 -0.033683 -0.016373
v -0.063381 -0.034029 -0.014542
v -0.059125 -0.032842 -0.016373
v -0.059916 -0.034474 -0.015927
v -0.062737 -0.034623 -0.014740
v -0.059867 -0.033930 -0.015383
v -0.062886 -0.033238 -0.014096
f 8 19 38 
f 9 5 11 
f 8 2 14 
f 4 12 14 
f 5 9 19 
f 12 4 19 
f 18 5 20 
f 3 2 21 
f 2 8 21 
f 7 17 21 
f 8 9 22 
f 21 8 22 
f 1 6 23 
f 11 1 23 
f 9 11 23 
f 11 5 24 
f 16 11 24 
f 5 18 24 
f 18 16 24 
f 3 21 25 
f 21 10 25 
f 4 13 26 
f 5 19 26 
f 19 4 26 
f 20 5 26 
f 7 21 27 
f 21 22 27 
f 8 14 28 
f 14 12 28 
f 19 8 28 
f 12 19 28 
f 17 18 29 
f 20 10 29 
f 18 20 29 
f 10 21 29 
f 21 17 29 
f 11 16 30 
f 27 15 30 
f 7 27 30 
f 6 1 31 
f 1 11 31 
f 22 6 31 
f 15 27 31 
f 27 22 31 
f 2 3 32 
f 14 2 32 
f 4 14 32 
f 13 4 33 
f 3 25 33 
f 25 13 33 
f 32 3 33 
f 4 32 33 
f 6 22 34 
f 22 9 34 
f 23 6 34 
f 9 23 34 
f 17 7 35 
f 16 18 35 
f 18 17 35 
f 30 16 35 
f 7 30 35 
f 10 20 36 
f 13 25 36 
f 25 10 36 
f 26 13 36 
f 20 26 36 
f 11 30 37 
f 30 15 37 
f 31 11 37 
f 15 31 37 
f 9 8 38 
f 19 9 38 
o convex_1
v -0.065461 -0.034029 -0.010730
v -0.063929 -0.033930 -0.014096
v -0.063929 -0.033881 -0.014096
v -0.093968 -0.034128 0.010403
v -0.093326 -0.033237 0.011197
v -0.093030 -0.034722 0.011146
v -0.062988 -0.034772 -0.014096
v -0.062394 -0.033237 -0.014046
v -0.093723 -0.033386 0.010552
v -0.092979 -0.033683 0.011592
v -0.061799 -0.034524 -0.013995
v -0.093821 -0.034623 0.010602
v -0.063334 -0.033287 -0.014046
v -0.092979 -0.034376 0.011542
v -0.061799 -0.033435 -0.014046
v -0.064027 -0.034326 -0.013945
v -0.080358 -0.033534 -0.000584
v -0.062540 -0.034722 -0.013698
v -0.093573 -0.034772 0.010998
v -0.093128 -0.033237 0.010504
v -0.093821 -0.033881 0.010254
v -0.092830 -0.033386 0.011197
v -0.061551 -0.033634 -0.014046
v -0.063681 -0.034623 -0.013945
v -0.080307 -0.034326 -0.000733
v -0.066154 -0.034524 -0.010383
v -0.092830 -0.034128 0.011542
v -0.063681 -0.033485 -0.014096
v -0.066055 -0.033386 -0.010582
v -0.064571 -0.034178 -0.011471
v -0.066649 -0.034772 -0.010629
v -0.080507 -0.033881 -0.000635
v -0.066748 -0.033683 -0.009740
v -0.079665 -0.033287 -0.000783
v -0.062937 -0.033237 -0.014096
v -0.093078 -0.034772 0.010403
v -0.092979 -0.034524 0.011444
v -0.077834 -0.034623 -0.002464
v -0.093621 -0.033485 0.010305
v -0.093621 -0.034326 0.010156
v -0.066106 -0.033336 -0.010629
v -0.061500 -0.034178 -0.014096
v -0.093326 -0.034772 0.011096
v -0.093723 -0.033287 0.010751
v -0.066500 -0.034722 -0.010433
v -0.079763 -0.034673 -0.000783
v -0.080011 -0.033485 -0.000831
v -0.065610 -0.034475 -0.010778
v -0.092830 -0.033634 0.011444
v -0.077094 -0.033832 -0.003404
v -0.066846 -0.033237 -0.010332
v -0.061701 -0.034128 -0.013847
v -0.092928 -0.033881 0.011592
v -0.076846 -0.034326 -0.003552
v -0.093128 -0.033336 0.011345
v -0.093128 -0.033584 0.011542
v -0.093475 -0.033782 0.010007
v -0.062540 -0.034772 -0.014096
v -0.093968 -0.033782 0.010504
v -0.080259 -0.033980 -0.000831
v -0.063681 -0.034475 -0.014096
v -0.076995 -0.033237 -0.002711
v -0.067094 -0.033634 -0.009491
v -0.079814 -0.034772 -0.000436
v -0.063433 -0.034673 -0.014046
v -0.092483 -0.034178 0.011245
v -0.062095 -0.033336 -0.013948
v -0.093128 -0.034425 0.011542
v -0.080259 -0.034376 -0.000733
v -0.065213 -0.034128 -0.010927
v -0.076798 -0.033980 -0.003651
v -0.063976 -0.033832 -0.014046
v -0.077144 -0.033534 -0.003205
v -0.081101 -0.033832 -0.000138
v -0.061847 -0.034475 -0.013897
v -0.092585 -0.033534 0.009413
v -0.091644 -0.033287 0.009017
f 100 72 115 
f 40 41 45 
f 43 46 58 
f 56 49 64 
f 45 41 66 
f 61 53 67 
f 57 45 69 
f 39 61 71 
f 51 66 72 
f 46 53 73 
f 58 46 73 
f 45 66 73 
f 66 51 73 
f 57 50 74 
f 45 57 74 
f 50 42 78 
f 42 63 78 
f 60 67 79 
f 53 61 80 
f 73 53 80 
f 45 73 80 
f 57 69 81 
f 44 75 81 
f 43 58 82 
f 56 64 83 
f 69 56 83 
f 75 44 83 
f 64 75 83 
f 44 81 83 
f 81 69 83 
f 74 50 84 
f 50 76 84 
f 47 72 85 
f 72 66 85 
f 77 47 85 
f 52 75 86 
f 75 64 86 
f 60 48 87 
f 67 60 87 
f 48 71 87 
f 41 70 88 
f 46 43 89 
f 61 39 90 
f 80 61 90 
f 65 39 91 
f 52 65 91 
f 39 71 91 
f 71 48 91 
f 40 54 92 
f 48 60 93 
f 60 79 93 
f 89 43 93 
f 79 89 93 
f 43 82 94 
f 93 43 94 
f 48 93 94 
f 59 77 95 
f 49 56 96 
f 56 69 96 
f 69 45 96 
f 45 80 96 
f 80 49 96 
f 42 50 97 
f 50 57 97 
f 59 42 97 
f 47 77 97 
f 77 59 97 
f 82 47 97 
f 57 94 97 
f 94 82 97 
f 42 59 98 
f 63 42 98 
f 59 70 98 
f 40 45 99 
f 54 40 99 
f 62 76 99 
f 92 54 99 
f 76 92 99 
f 51 72 100 
f 58 73 100 
f 73 51 100 
f 61 67 101 
f 71 61 101 
f 67 87 101 
f 87 71 101 
f 45 74 102 
f 74 84 102 
f 102 84 103 
f 76 62 103 
f 84 76 103 
f 99 45 103 
f 62 99 103 
f 45 102 103 
f 65 52 104 
f 86 68 104 
f 52 86 104 
f 53 46 105 
f 67 53 105 
f 79 67 105 
f 46 89 105 
f 89 79 105 
f 75 52 106 
f 57 81 106 
f 81 75 106 
f 91 48 106 
f 52 91 106 
f 48 94 106 
f 94 57 106 
f 76 50 107 
f 50 78 107 
f 78 63 107 
f 63 92 107 
f 92 76 107 
f 39 65 108 
f 90 39 108 
f 68 90 108 
f 65 104 108 
f 104 68 108 
f 41 40 109 
f 70 41 109 
f 40 92 109 
f 92 63 109 
f 63 98 109 
f 98 70 109 
f 66 41 110 
f 41 88 110 
f 110 88 111 
f 55 85 111 
f 85 66 111 
f 66 110 111 
f 70 59 112 
f 88 70 112 
f 59 95 112 
f 111 88 112 
f 55 111 112 
f 64 49 113 
f 49 80 113 
f 86 64 113 
f 68 86 113 
f 90 68 113 
f 80 90 113 
f 85 55 114 
f 77 85 114 
f 95 77 114 
f 112 95 114 
f 55 112 114 
f 72 47 115 
f 47 82 115 
f 82 58 115 
f 58 100 115 
o convex_2
v -0.059619 -0.034375 -0.016522
v -0.055710 -0.031208 -0.020580
v -0.055710 -0.031159 -0.020580
v -0.055412 -0.031159 -0.019095
v -0.060708 -0.033237 -0.016522
v -0.058580 -0.033039 -0.016522
v -0.056996 -0.031159 -0.018700
v -0.056897 -0.033039 -0.018452
v -0.058728 -0.033336 -0.018353
v -0.056798 -0.031208 -0.020036
v -0.060906 -0.034029 -0.016572
v -0.058629 -0.033831 -0.016572
v -0.057194 -0.033138 -0.018798
v -0.055214 -0.031456 -0.019937
v -0.059471 -0.032743 -0.016522
v -0.055957 -0.031159 -0.018700
v -0.059372 -0.034029 -0.017512
v -0.056452 -0.032544 -0.018403
v -0.057095 -0.031159 -0.019541
v -0.056650 -0.032248 -0.019788
v -0.057887 -0.033683 -0.017661
v -0.060906 -0.033633 -0.016621
v -0.060262 -0.032940 -0.016522
v -0.056848 -0.031901 -0.019937
v -0.057788 -0.033138 -0.017116
v -0.056254 -0.032347 -0.019590
v -0.058827 -0.034078 -0.017413
v -0.058382 -0.033534 -0.018353
v -0.060461 -0.034375 -0.016621
v -0.055066 -0.031208 -0.019689
v -0.058827 -0.032940 -0.018353
v -0.058926 -0.032792 -0.016522
v -0.055214 -0.031208 -0.020432
v -0.056402 -0.031159 -0.018601
v -0.057541 -0.033336 -0.017512
v -0.056007 -0.032297 -0.019244
v -0.057145 -0.031159 -0.018947
v -0.058827 -0.034128 -0.016868
v -0.059767 -0.033781 -0.017512
v -0.057541 -0.032990 -0.019046
v -0.060757 -0.033287 -0.016572
v -0.058035 -0.033682 -0.018106
v -0.056254 -0.031159 -0.020432
v -0.055957 -0.032149 -0.018848
v -0.058382 -0.033336 -0.016621
v -0.056007 -0.031852 -0.018601
v -0.060262 -0.034425 -0.016522
v -0.059619 -0.032743 -0.016522
v -0.055066 -0.031159 -0.020134
v -0.057689 -0.032594 -0.019244
f 155 124 165 
f 120 116 121 
f 121 116 127 
f 120 121 130 
f 128 123 136 
f 126 120 137 
f 120 130 138 
f 134 120 138 
f 117 135 139 
f 135 117 141 
f 128 135 141 
f 132 124 143 
f 137 125 146 
f 130 121 147 
f 121 131 147 
f 117 118 148 
f 141 117 148 
f 129 141 148 
f 119 122 149 
f 131 119 149 
f 130 147 149 
f 147 131 149 
f 123 133 150 
f 136 123 150 
f 140 127 150 
f 133 140 150 
f 123 128 151 
f 128 141 151 
f 141 129 151 
f 119 118 152 
f 122 119 152 
f 118 134 152 
f 138 122 152 
f 134 138 152 
f 127 116 153 
f 116 142 153 
f 142 136 153 
f 150 127 153 
f 136 150 153 
f 124 132 154 
f 126 137 154 
f 144 126 154 
f 132 144 154 
f 146 124 154 
f 137 146 154 
f 135 128 155 
f 143 124 155 
f 128 143 155 
f 120 134 156 
f 134 125 156 
f 137 120 156 
f 125 137 156 
f 128 136 157 
f 142 132 157 
f 136 142 157 
f 132 143 157 
f 143 128 157 
f 118 117 158 
f 134 118 158 
f 125 134 158 
f 117 139 158 
f 139 125 158 
f 133 123 159 
f 145 119 159 
f 129 145 159 
f 123 151 159 
f 151 129 159 
f 121 127 160 
f 119 131 160 
f 131 121 160 
f 140 119 160 
f 127 140 160 
f 119 140 161 
f 140 133 161 
f 159 119 161 
f 133 159 161 
f 116 120 162 
f 120 126 162 
f 142 116 162 
f 132 142 162 
f 126 144 162 
f 144 132 162 
f 138 130 163 
f 122 138 163 
f 149 122 163 
f 130 149 163 
f 118 119 164 
f 119 145 164 
f 145 129 164 
f 148 118 164 
f 129 148 164 
f 125 139 165 
f 139 135 165 
f 124 146 165 
f 146 125 165 
f 135 155 165 
o convex_3
v -0.055561 -0.031059 -0.020679
v -0.056402 -0.031059 -0.018650
v -0.056451 -0.031059 -0.018650
v -0.054769 -0.027842 -0.021075
v -0.054719 -0.030366 -0.019690
v -0.057045 -0.031108 -0.019591
v -0.054769 -0.029179 -0.021669
v -0.055016 -0.031158 -0.020184
v -0.054719 -0.028882 -0.020086
v -0.054719 -0.028139 -0.021669
v -0.056946 -0.031108 -0.018749
v -0.056550 -0.031158 -0.020234
v -0.055907 -0.031158 -0.018749
v -0.054719 -0.030465 -0.020927
v -0.054769 -0.028238 -0.020531
v -0.055115 -0.031158 -0.019492
v -0.054818 -0.027991 -0.021521
v -0.057095 -0.031108 -0.019046
v -0.054917 -0.028634 -0.021619
v -0.054719 -0.029525 -0.019789
v -0.056204 -0.031158 -0.020481
v -0.054719 -0.030811 -0.020234
v -0.056798 -0.031108 -0.019987
v -0.054719 -0.029970 -0.021323
v -0.057095 -0.031158 -0.019046
v -0.055214 -0.031158 -0.020481
v -0.055363 -0.030119 -0.021174
v -0.057095 -0.031108 -0.019343
v -0.055412 -0.031158 -0.019096
f 185 178 194 
f 168 167 174 
f 169 174 175 
f 174 170 175 
f 167 168 178 
f 168 176 178 
f 177 173 178 
f 175 170 179 
f 168 174 180 
f 174 169 180 
f 176 168 180 
f 169 176 180 
f 178 173 181 
f 169 175 182 
f 176 169 183 
f 175 172 184 
f 182 175 184 
f 174 167 185 
f 170 174 185 
f 167 178 185 
f 173 177 186 
f 179 170 187 
f 173 179 187 
f 170 181 187 
f 181 173 187 
f 177 171 188 
f 171 182 188 
f 184 177 188 
f 182 184 188 
f 172 175 189 
f 179 166 189 
f 175 179 189 
f 171 177 190 
f 178 176 190 
f 177 178 190 
f 176 183 190 
f 166 179 191 
f 179 173 191 
f 186 166 191 
f 173 186 191 
f 184 172 192 
f 177 184 192 
f 166 186 192 
f 186 177 192 
f 189 166 192 
f 172 189 192 
f 169 182 193 
f 182 171 193 
f 183 169 193 
f 171 190 193 
f 190 183 193 
f 181 170 194 
f 178 181 194 
f 170 185 194 
o convex_4
v -0.054026 -0.027100 -0.022362
v -0.054669 -0.029920 -0.019739
v -0.054669 -0.029574 -0.019789
v -0.052046 -0.024922 -0.022164
v -0.053580 -0.024922 -0.022016
v -0.054026 -0.029475 -0.021422
v -0.052541 -0.024972 -0.023154
v -0.054719 -0.028188 -0.021768
v -0.052541 -0.024922 -0.021620
v -0.052838 -0.027446 -0.021917
v -0.054669 -0.030663 -0.019937
v -0.054719 -0.028138 -0.020581
v -0.053432 -0.024922 -0.022907
v -0.054719 -0.029673 -0.021471
v -0.053086 -0.027545 -0.021076
v -0.053284 -0.027248 -0.022510
v -0.053036 -0.024922 -0.021570
v -0.052541 -0.026160 -0.022709
v -0.054719 -0.027793 -0.021570
v -0.053779 -0.029326 -0.020680
v -0.054719 -0.030713 -0.020482
v -0.053333 -0.025961 -0.022907
v -0.052096 -0.025269 -0.022609
v -0.052591 -0.026803 -0.021669
v -0.053927 -0.029623 -0.021026
v -0.054372 -0.028386 -0.022016
v -0.053630 -0.024972 -0.022560
v -0.052492 -0.025863 -0.021570
v -0.054719 -0.028782 -0.020135
v -0.054719 -0.027744 -0.021125
v -0.053432 -0.028287 -0.021966
v -0.054570 -0.030118 -0.019789
v -0.053432 -0.025021 -0.021719
v -0.053877 -0.028436 -0.022065
v -0.052244 -0.024922 -0.023006
v -0.054620 -0.030415 -0.020927
v -0.053284 -0.028435 -0.021570
v -0.053036 -0.024922 -0.023154
v -0.052838 -0.025912 -0.022956
v -0.052294 -0.026011 -0.022411
v -0.053333 -0.028485 -0.021026
v -0.052294 -0.024922 -0.021768
v -0.052195 -0.025665 -0.022016
v -0.054719 -0.030316 -0.019739
v -0.052987 -0.027347 -0.022312
v -0.054471 -0.029524 -0.021570
v -0.053679 -0.027199 -0.022510
v -0.054570 -0.030613 -0.020482
v -0.053877 -0.029079 -0.020383
f 214 235 243 
f 197 196 203 
f 195 202 207 
f 199 203 207 
f 206 202 208 
f 197 203 211 
f 203 199 211 
f 202 206 213 
f 206 208 215 
f 195 207 216 
f 202 195 220 
f 208 202 220 
f 195 216 220 
f 207 202 221 
f 199 207 221 
f 202 213 221 
f 209 218 222 
f 197 211 223 
f 206 215 223 
f 206 199 224 
f 213 206 224 
f 199 221 224 
f 221 213 224 
f 205 214 226 
f 199 206 227 
f 211 199 227 
f 223 211 227 
f 206 223 227 
f 225 200 228 
f 210 225 228 
f 207 203 229 
f 212 201 229 
f 198 217 229 
f 217 212 229 
f 215 208 230 
f 200 219 230 
f 219 200 231 
f 214 219 231 
f 200 225 231 
f 216 207 232 
f 229 201 232 
f 207 229 232 
f 201 212 233 
f 212 210 233 
f 232 201 233 
f 216 232 233 
f 212 217 234 
f 218 204 234 
f 218 209 235 
f 204 218 235 
f 231 204 235 
f 214 231 235 
f 203 196 236 
f 196 226 236 
f 226 222 236 
f 198 229 236 
f 229 203 236 
f 217 198 237 
f 222 218 237 
f 234 217 237 
f 218 234 237 
f 198 236 237 
f 236 222 237 
f 196 197 238 
f 215 205 238 
f 197 223 238 
f 223 215 238 
f 226 196 238 
f 205 226 238 
f 210 212 239 
f 225 210 239 
f 204 231 239 
f 231 225 239 
f 234 204 239 
f 212 234 239 
f 208 220 240 
f 228 200 240 
f 220 228 240 
f 200 230 240 
f 230 208 240 
f 220 216 241 
f 210 228 241 
f 228 220 241 
f 233 210 241 
f 216 233 241 
f 214 205 242 
f 205 215 242 
f 219 214 242 
f 215 230 242 
f 230 219 242 
f 209 222 243 
f 226 214 243 
f 222 226 243 
f 235 209 243 
o convex_5
v -0.052541 -0.024129 -0.023352
v -0.052789 -0.024723 -0.021620
v -0.052986 -0.024723 -0.021620
v -0.052145 -0.019428 -0.022610
v -0.051155 -0.019824 -0.023104
v -0.052541 -0.019577 -0.023847
v -0.053580 -0.024772 -0.022560
v -0.052046 -0.024921 -0.022709
v -0.051403 -0.019824 -0.023946
v -0.052640 -0.019428 -0.023055
v -0.052244 -0.024921 -0.021818
v -0.051601 -0.019478 -0.022610
v -0.053085 -0.024921 -0.023154
v -0.053432 -0.024871 -0.021818
v -0.052195 -0.019626 -0.024095
v -0.051155 -0.019676 -0.023600
v -0.051848 -0.024130 -0.022363
v -0.052096 -0.024278 -0.023154
v -0.053432 -0.024921 -0.022907
v -0.051749 -0.019923 -0.024095
v -0.052690 -0.019527 -0.023550
v -0.052442 -0.019379 -0.022759
v -0.051304 -0.019577 -0.022808
v -0.053580 -0.024921 -0.022066
v -0.051601 -0.022595 -0.023154
v -0.052541 -0.024921 -0.021620
v -0.052541 -0.024822 -0.023204
v -0.051601 -0.021557 -0.022462
v -0.053333 -0.024871 -0.021719
v -0.052244 -0.020071 -0.024045
v -0.052096 -0.019527 -0.022561
v -0.052145 -0.022743 -0.023600
v -0.051502 -0.020665 -0.023798
v -0.052046 -0.024871 -0.022115
v -0.052690 -0.019577 -0.023104
v -0.052690 -0.020864 -0.023699
v -0.051353 -0.021210 -0.022907
v -0.052541 -0.019428 -0.023303
v -0.051848 -0.024080 -0.022857
f 280 260 282 
f 251 254 256 
f 252 258 259 
f 256 254 262 
f 258 252 263 
f 249 262 264 
f 262 250 264 
f 247 255 265 
f 253 257 265 
f 248 259 266 
f 259 255 266 
f 257 253 267 
f 250 262 267 
f 262 254 267 
f 245 246 269 
f 255 245 269 
f 267 254 269 
f 256 244 270 
f 251 256 270 
f 261 251 270 
f 266 255 271 
f 248 266 271 
f 255 269 271 
f 269 254 271 
f 265 257 272 
f 257 267 272 
f 269 246 272 
f 267 269 272 
f 244 256 273 
f 249 258 273 
f 263 244 273 
f 258 263 273 
f 246 245 274 
f 245 255 274 
f 255 247 274 
f 247 265 274 
f 272 246 274 
f 265 272 274 
f 244 263 275 
f 270 244 275 
f 261 270 275 
f 252 259 276 
f 263 252 276 
f 259 268 276 
f 268 261 276 
f 261 275 276 
f 275 263 276 
f 254 251 277 
f 251 260 277 
f 260 271 277 
f 271 254 277 
f 253 264 278 
f 264 250 278 
f 267 253 278 
f 250 267 278 
f 262 249 279 
f 256 262 279 
f 273 256 279 
f 249 273 279 
f 259 248 280 
f 268 259 280 
f 248 271 280 
f 271 260 280 
f 258 249 281 
f 255 259 281 
f 259 258 281 
f 249 264 281 
f 264 253 281 
f 265 255 281 
f 253 265 281 
f 260 251 282 
f 251 261 282 
f 261 268 282 
f 268 280 282 
