%YAML 1.1
%TAG !u! tag:unity3d.com,2011:
--- !u!114 &11400000
MonoBehaviour:
  m_ObjectHideFlags: 0
  m_CorrespondingSourceObject: {fileID: 0}
  m_PrefabInternal: {fileID: 0}
  m_GameObject: {fileID: 0}
  m_Enabled: 1
  m_EditorHideFlags: 0
  m_Script: {fileID: 11500000, guid: 73ddb46eae05247468e1934e36b76b22, type: 3}
  m_Name: ButtonClickFX
  m_EditorClassIdentifier: 
  audioClips:
  - clip: {fileID: 8300000, guid: 49e04a566800caa499f62912c7904242, type: 3}
    volume:
      minValue: 0.49642855
      maxValue: 0.49642855
    pitch:
      minValue: 1
      maxValue: 1
