%YAML 1.1
%TAG !u! tag:unity3d.com,2011:
--- !u!114 &11400000
MonoBehaviour:
  m_ObjectHideFlags: 0
  m_CorrespondingSourceObject: {fileID: 0}
  m_PrefabInternal: {fileID: 0}
  m_GameObject: {fileID: 0}
  m_Enabled: 1
  m_EditorHideFlags: 0
  m_Script: {fileID: 11500000, guid: 73ddb46eae05247468e1934e36b76b22, type: 3}
  m_Name: StageEndedFX
  m_EditorClassIdentifier: 
  audioClips:
  - clip: {fileID: 8300000, guid: 5c8d5e2bfe2f4be4396a5983234d7a07, type: 3}
    volume:
      minValue: 0.12139328
      maxValue: 0.12139328
    pitch:
      minValue: 0.9999999
      maxValue: 0.9999999
