-------------------------------------------------------------------------------
Test set: Fibonaci.Fibonaci.FibonacciTest
-------------------------------------------------------------------------------
Tests run: 1, Failures: 0, Errors: 0, Skipped: 0, Time elapsed: 0.167 sec
