{
  "countries": [
    {
      "name": "Australia",
      "flag": null,
      "abbr": "AU"
    },
    {
      "name": "Brazil",
      "flag": null,
      "abbr": "BR"
    },
    {
      "name": "Canada",
      "flag": null,
      "abbr": "CA"
    },
    {
      "name": "China",
      "flag": null,
      "abbr": "CN"
    },
    {
      "name": "Germany",
      "flag": null,
      "abbr": "DE"
    },
    {
      "name": "Hong Kong",
      "flag": null,
      "abbr": "HK"
    },
    {
      "name": "Indonesia",
      "flag": null,
      "abbr": "ID"
    },
    {
      "name": "India",
      "flag": null,
      "abbr": "IN"
    },
    {
      "name": "Japan",
      "flag": null,
      "abbr": "JP"
    },
    {
      "name": "Korea",
      "flag": null,
      "abbr": "KR"
    },
    {
      "name": "Malaysia",
      "flag": null,
      "abbr": "MY"
    },
    {
      "name": "Netherlands",
      "flag": null,
      "abbr": "NL"
    },
    {
      "name": "Philippines",
      "flag": null,
      "abbr": "PH"
    },
    {
      "name": "Russia",
      "flag": null,
      "abbr": "RU"
    },
    {
      "name": "Singapore",
      "flag": null,
      "abbr": "SG"
    },
    {
      "name": "Thailand",
      "flag": null,
      "abbr": "TH"
    },
    {
      "name": "Turkey",
      "flag": null,
      "abbr": "TR"
    },
    {
      "name": "Taiwan",
      "flag": null,
      "abbr": "TW"
    },
    {
      "name": "United Kingdom",
      "flag": null,
      "abbr": "UK"
    },
    {
      "name": "USA",
      "flag": null,
      "abbr": "US"
    },
    {
      "name": "Vietnam",
      "flag": null,
      "abbr": "VN"
    }
  ],
  "servers": [
    {
      "sort": 100,
      "name": "Thailand 1",
      "domain": "th1.vpn4games.com",
      "ip": "122.155.168.207",
      "country": "TH",
      "user_type": "trial"
    },
    {
      "sort": 100,
      "name": "Thailand 2",
      "domain": "th2.vpn4games.com",
      "ip": "122.155.168.97",
      "country": "TH",
      "user_type": "trial"
    },
    {
      "sort": 100,
      "name": "Thailand 3",
      "domain": "th3.vpn4games.com",
      "ip": "122.155.168.1",
      "country": "TH",
      "user_type": "trial"
    },
    {
      "sort": 100,
      "name": "Thailand 4",
      "domain": "th4.vpn4games.com",
      "ip": "122.155.168.13",
      "country": "TH",
      "user_type": "pay"
    },
    {
      "sort": 100,
      "name": "Thailand 5",
      "domain": "th5.vpn4games.com",
      "ip": "122.155.168.94",
      "country": "TH",
      "user_type": "pay"
    },
    {
      "sort": 100,
      "name": "Thailand 6",
      "domain": "th6.vpn4games.com",
      "ip": "122.155.168.38",
      "country": "TH",
      "user_type": "pay"
    },
    {
      "sort": 100,
      "name": "Thailand 7",
      "domain": "th7.vpn4games.com",
      "ip": "122.155.168.208",
      "country": "TH",
      "user_type": "pay"
    },
    {
      "sort": 100,
      "name": "Thailand 9",
      "domain": "th9.vpn4games.com",
      "ip": "122.155.168.159",
      "country": "TH",
      "user_type": "trial"
    },
    {
      "sort": 100,
      "name": "Thailand 10",
      "domain": "th10.vpn4games.com",
      "ip": "122.155.168.73",
      "country": "TH",
      "user_type": "pay"
    },
    {
      "sort": 100,
      "name": "Thailand 11",
      "domain": "th11.vpn4games.com",
      "ip": "122.155.168.100",
      "country": "TH",
      "user_type": "pay"
    },
    {
      "sort": 100,
      "name": "Thailand 12",
      "domain": "th12.vpn4games.com",
      "ip": "122.155.168.158",
      "country": "TH",
      "user_type": "pay"
    },
    {
      "sort": 100,
      "name": "Thailand 13",
      "domain": "th13.vpn4games.com",
      "ip": "122.155.165.205",
      "country": "TH",
      "user_type": "pay"
    },
    {
      "sort": 100,
      "name": "Thailand 14",
      "domain": "th14.vpn4games.com",
      "ip": "122.155.165.24",
      "country": "TH",
      "user_type": "pay"
    },
    {
      "sort": 100,
      "name": "Thailand 150",
      "domain": "th15.vpn4games.com",
      "ip": "103.212.181.175",
      "country": "TH",
      "user_type": "trial"
    },
    {
      "sort": 100,
      "name": "Thailand 15",
      "domain": "th15.vpn4games.com",
      "ip": "103.212.181.175",
      "country": "TH",
      "user_type": "trial"
    },
    {
      "sort": 100,
      "name": "Thailand 17",
      "domain": "th17.vpn4games.com",
      "ip": "103.212.181.151",
      "country": "TH",
      "user_type": "pay"
    },
    {
      "sort": 100,
      "name": "Thailand 188",
      "domain": "th18.vpn4games.com",
      "ip": "27.254.61.15",
      "country": "TH",
      "user_type": "pay"
    },
    {
      "sort": 100,
      "name": "Thailand 166",
      "domain": "th16.vpn4games.com",
      "ip": "103.212.181.103",
      "country": "TH",
      "user_type": "pay"
    },
    {
      "sort": 100,
      "name": "Thailand 199",
      "domain": "th19.vpn4games.com",
      "ip": "103.13.229.219",
      "country": "TH",
      "user_type": "pay"
    },
    {
      "sort": 200,
      "name": "Singapore 1",
      "domain": "sg1.vpn4games.com",
      "ip": "178.128.49.253",
      "country": "SG",
      "user_type": "trial"
    },
    {
      "sort": 200,
      "name": "Singapore 2",
      "domain": "sg2.vpn4games.com",
      "ip": "104.248.154.86",
      "country": "SG",
      "user_type": "pay"
    },
    {
      "sort": 200,
      "name": "Singapore 3",
      "domain": "sg3.vpn4games.com",
      "ip": "172.104.168.135",
      "country": "SG",
      "user_type": "pay"
    },
    {
      "sort": 200,
      "name": "Singapore 4",
      "domain": "sg4.vpn4games.com",
      "ip": "45.76.154.218",
      "country": "SG",
      "user_type": "pay"
    },
    {
      "sort": 300,
      "name": "Malaysia 1",
      "domain": "my1.vpn4games.com",
      "ip": "103.91.64.100",
      "country": "MY",
      "user_type": "trial"
    },
    {
      "sort": 400,
      "name": "Vietnam 1",
      "domain": "vn1.vpn4games.com",
      "ip": "103.9.77.43",
      "country": "VN",
      "user_type": "pay"
    },
    {
      "sort": 500,
      "name": "Philippines 1",
      "domain": "ph1.vpn4games.com",
      "ip": "116.93.119.103",
      "country": "PH",
      "user_type": "pay"
    },
    {
      "sort": 600,
      "name": "Indonesia 1",
      "domain": "id1.vpn4games.com",
      "ip": "103.227.253.249",
      "country": "ID",
      "user_type": "pay"
    },
    {
      "sort": 700,
      "name": "Hong Kong 1",
      "domain": "hk1.vpn4games.com",
      "ip": "27.122.57.193",
      "country": "HK",
      "user_type": "trial"
    },
    {
      "sort": 700,
      "name": "Hong Kong 2",
      "domain": "hk2.vpn4games.com",
      "ip": "223.223.218.29",
      "country": "HK",
      "user_type": "pay"
    },
    {
      "sort": 751,
      "name": "China 1",
      "domain": "cn1.vpn4games.com",
      "ip": "47.95.241.127",
      "country": "CN",
      "user_type": "pay"
    },
    {
      "sort": 800,
      "name": "Taiwan 1",
      "domain": "tw1.vpn4games.com",
      "ip": "2.58.242.206",
      "country": "TW",
      "user_type": "pay"
    },
    {
      "sort": 900,
      "name": "Korea 1",
      "domain": "kr1.vpn4games.com",
      "ip": "202.168.153.238",
      "country": "KR",
      "user_type": "trial"
    },
    {
      "sort": 900,
      "name": "Korea 2",
      "domain": "kr2.vpn4games.com",
      "ip": "92.38.135.249",
      "country": "KR",
      "user_type": "pay"
    },
    {
      "sort": 1000,
      "name": "Japan 2 (Netflix)",
      "domain": "jp2.vpn4games.com",
      "ip": "198.13.32.14",
      "country": "JP",
      "user_type": "pay"
    },
    {
      "sort": 1001,
      "name": "Japan 3",
      "domain": "jp3.vpn4games.com",
      "ip": "43.224.35.112",
      "country": "JP",
      "user_type": "pay"
    },
    {
      "sort": 1001,
      "name": "Japan 4",
      "domain": "jp4.vpn4games.com",
      "ip": "163.44.173.12",
      "country": "JP",
      "user_type": "pay"
    },
    {
      "sort": 1001,
      "name": "Japan 1",
      "domain": "jp1.vpn4games.com",
      "ip": "45.124.137.50",
      "country": "JP",
      "user_type": "trial"
    },
    {
      "sort": 1100,
      "name": "India 1",
      "domain": "in1.vpn4games.com",
      "ip": "139.59.17.77",
      "country": "IN",
      "user_type": "trial"
    },
    {
      "sort": 1200,
      "name": "USA 1",
      "domain": "us1.vpn4games.com",
      "ip": "138.68.236.158",
      "country": "US",
      "user_type": "trial"
    },
    {
      "sort": 1201,
      "name": "USA 2  (Netflix)",
      "domain": "us2.vpn4games.com",
      "ip": "198.199.117.163",
      "country": "US",
      "user_type": "pay"
    },
    {
      "sort": 1202,
      "name": "USA 3",
      "domain": "us3.vpn4games.com",
      "ip": "107.191.55.207",
      "country": "US",
      "user_type": "pay"
    },
    {
      "sort": 1203,
      "name": "USA 4",
      "domain": "us4.vpn4games.com",
      "ip": "45.76.172.174",
      "country": "US",
      "user_type": "pay"
    },
    {
      "sort": 1210,
      "name": "Canada 1",
      "domain": "ca1.vpn4games.com",
      "ip": "167.99.178.146",
      "country": "CA",
      "user_type": "pay"
    },
    {
      "sort": 1250,
      "name": "Turkey 1",
      "domain": "tr1.vpn4games.com",
      "ip": "185.65.206.203",
      "country": "TR",
      "user_type": "trial"
    },
    {
      "sort": 1300,
      "name": "Germany 1",
      "domain": "de1.vpn4games.com",
      "ip": "165.227.173.143",
      "country": "DE",
      "user_type": "trial"
    },
    {
      "sort": 1305,
      "name": "Netherlands 1",
      "domain": "nl1.vpn4games.com",
      "ip": "134.209.204.83",
      "country": "NL",
      "user_type": "pay"
    },
    {
      "sort": 1310,
      "name": "United Kingdom 1",
      "domain": "uk1.vpn4games.com",
      "ip": "68.183.38.22",
      "country": "UK",
      "user_type": "pay"
    },
    {
      "sort": 1350,
      "name": "Russia 1",
      "domain": "ru1.vpn4games.com",
      "ip": "94.242.59.185",
      "country": "RU",
      "user_type": "pay"
    },
    {
      "sort": 1400,
      "name": "Australia 1",
      "domain": "au1.vpn4games.com",
      "ip": "146.185.214.26",
      "country": "AU",
      "user_type": "pay"
    },
    {
      "sort": 1500,
      "name": "Brazil 1",
      "domain": "br1.vpn4games.com",
      "ip": "5.188.238.8",
      "country": "BR",
      "user_type": "trial"
    },
    {
      "sort": 2000,
      "name": "BitTorrent & Download & Web 1",
      "domain": "sg-bit1.vpn4games.com",
      "ip": "103.25.202.193",
      "country": "SG",
      "user_type": "pay"
    }
  ],
  "ports": {
    "tcp": {
      "443": [
        "122.155.168.207",
        "122.155.168.97",
        "122.155.168.101",
        "122.155.168.13",
        "122.155.168.94",
        "122.155.168.38",
        "122.155.168.208",
        "122.155.168.159",
        "122.155.168.73",
        "122.155.168.100",
        "122.155.168.158",
        "122.155.165.205",
        "122.155.165.24",
        "103.212.181.175",
        "103.212.181.151",
        "27.254.61.15",
        "103.212.181.103",
        "103.13.229.219",
        "178.128.49.253",
        "104.248.154.86",
        "172.104.168.135",
        "45.76.154.218",
        "103.91.64.100",
        "103.9.77.43",
        "116.93.119.103",
        "103.227.253.249",
        "27.122.57.193",
        "223.223.218.29",
        "47.95.241.127",
        "2.58.242.206",
        "202.168.153.238",
        "92.38.135.249",
        "198.13.32.14",
        "43.224.35.112",
        "163.44.173.12",
        "45.124.137.50",
        "139.59.17.77",
        "138.68.236.158",
        "198.199.117.163",
        "107.191.55.207",
        "45.76.172.174",
        "167.99.178.146",
        "185.65.206.203",
        "165.227.173.143",
        "134.209.204.83",
        "68.183.38.22",
        "94.242.59.185",
        "146.185.214.26",
        "5.188.238.8",
        "103.25.202.193"
      ]
    },
    "udp": {
      "53": [
        "122.155.168.207",
        "122.155.168.97",
        "122.155.168.101",
        "122.155.168.13",
        "122.155.168.94",
        "122.155.168.38",
        "122.155.168.208",
        "122.155.168.159",
        "122.155.168.73",
        "122.155.168.100",
        "122.155.168.158",
        "122.155.165.205",
        "122.155.165.24",
        "103.212.181.175",
        "103.212.181.151",
        "27.254.61.15",
        "103.212.181.103",
        "103.13.229.219",
        "178.128.49.253",
        "104.248.154.86",
        "172.104.168.135",
        "45.76.154.218",
        "103.91.64.100",
        "103.9.77.43",
        "116.93.119.103",
        "103.227.253.249",
        "27.122.57.193",
        "223.223.218.29",
        "47.95.241.127",
        "2.58.242.206",
        "202.168.153.238",
        "92.38.135.249",
        "198.13.32.14",
        "43.224.35.112",
        "163.44.173.12",
        "45.124.137.50",
        "139.59.17.77",
        "138.68.236.158",
        "198.199.117.163",
        "107.191.55.207",
        "45.76.172.174",
        "167.99.178.146",
        "185.65.206.203",
        "165.227.173.143",
        "134.209.204.83",
        "68.183.38.22",
        "94.242.59.185",
        "146.185.214.26",
        "5.188.238.8",
        "103.25.202.193"
      ],
      "1194": [
        "122.155.168.207",
        "122.155.168.97",
        "122.155.168.101",
        "122.155.168.13",
        "122.155.168.94",
        "122.155.168.38",
        "122.155.168.208",
        "122.155.168.159",
        "122.155.168.73",
        "122.155.168.100",
        "122.155.168.158",
        "122.155.165.205",
        "122.155.165.24",
        "103.212.181.175",
        "103.212.181.151",
        "27.254.61.15",
        "103.212.181.103",
        "103.13.229.219",
        "178.128.49.253",
        "104.248.154.86",
        "172.104.168.135",
        "45.76.154.218",
        "103.91.64.100",
        "103.9.77.43",
        "116.93.119.103",
        "103.227.253.249",
        "27.122.57.193",
        "223.223.218.29",
        "47.95.241.127",
        "2.58.242.206",
        "202.168.153.238",
        "92.38.135.249",
        "198.13.32.14",
        "43.224.35.112",
        "163.44.173.12",
        "45.124.137.50",
        "139.59.17.77",
        "138.68.236.158",
        "198.199.117.163",
        "107.191.55.207",
        "45.76.172.174",
        "167.99.178.146",
        "185.65.206.203",
        "165.227.173.143",
        "134.209.204.83",
        "68.183.38.22",
        "94.242.59.185",
        "146.185.214.26",
        "5.188.238.8",
        "103.25.202.193"
      ]
    }
  },
  "config": "client\r\ndev tun\r\nnobind\r\ncomp-lzo\r\nreneg-sec 0\r\nauth-user-pass\r\nscript-security 3\r\ncipher AES-256-CBC\r\nauth-retry interact\r\nmute-replay-warnings\r\nresolv-retry infinite\r\nremote-cert-tls server\r\n#register-dns\r\ntls-timeout 15\r\nhand-window 15\r\ntun-mtu 1500\r\ntun-mtu-extra 32\r\n#mssfix 1450\r\nping-restart 60\r\n\r\n<ca>\r\n-----BEGIN CERTIFICATE-----\r\nMIIDLzCCAhegAwIBAgIJAJHKnNs8hq7uMA0GCSqGSIb3DQEBCwUAMBQxEjAQBgNV\r\nBAMTCXZwbjRnYW1lczAeFw0xNDA1MTUxMTAyMTNaFw0yNDA1MTIxMTAyMTNaMBQx\r\nEjAQBgNVBAMTCXZwbjRnYW1lczCCASIwDQYJKoZIhvcNAQEBBQADggEPADCCAQoC\r\nggEBAK3VhGG3MZKKhe9rgMQFBvW4N8hUspl+IByla8+S/QptNRWxMAsjJmHR9dgl\r\nGnAK8rX/frT0jXeDjPEjmkQrt1Eqk2W/qmB11S2xEiXc9rlDlzRurImjn0NkKzDE\r\nyENAhDfdaoUXymjDQazHyZdt+0CZViK04XylmQHPCKki1qX2bOfcQT9h+RhB+OsS\r\nuUSAbqN8i9N7N/c/nDi52G9qhsUWowy5DqehendQEDYd6qHb2Vg1EYIP03bxlj02\r\nt8Qy5WlFwjGDAFwCuImuZhvZOgBdLuSGFjAYgEOgKSasPvP0edVqbe+n2TQv6ih2\r\nlgH9aTDa6zLD2FY8y3vEhDmsHl8CAwEAAaOBgzCBgDAdBgNVHQ4EFgQU+jLUTy6M\r\nt8OqyzWP2cNjT0759NowRAYDVR0jBD0wO4AU+jLUTy6Mt8OqyzWP2cNjT0759Nqh\r\nGKQWMBQxEjAQBgNVBAMTCXZwbjRnYW1lc4IJAJHKnNs8hq7uMAwGA1UdEwQFMAMB\r\nAf8wCwYDVR0PBAQDAgEGMA0GCSqGSIb3DQEBCwUAA4IBAQBUrQpzVsFCVhQ2WYJC\r\n6xt91M/wHyRjfx5zxCy41NIqCN9sMT+Zy9/OZsnaOMwflWBYdOqP7Dz5h5CwMTbl\r\ndPCs1suyNCS6CY1423IHSKmraZ3e0YNIt/rHRXxAxunl/Lb0zM7FDYOWjrrSuYsv\r\nnwLFz/K/a55bMymPmTAQ7NZILgQZHeU5I0Qx7eDhDUOU8OX94OkeEfbfOa4IBanh\r\nIpfuNzCWYRPIFa36/jJEC+du3jhOzzyhVokdrCzRyoto0ZxtKzATAxBzGTzFOZIk\r\nhpCfNYXxG13bwemWc88v5vkXXnS+JD4/jV+7hpyyJoKuqZXnW6uJillXTLnhCYtv\r\n5hXx\r\n-----END CERTIFICATE-----\r\n</ca>",
  "private": [],
  "proxy": [
    {
      "name": "Proxys Thailand 1",
      "ip_address": "122.155.168.230",
      "proxy_port": 80,
      "user": "vpn4games",
      "pass": "v4gv4g**"
    },
    {
      "name": "Proxys Hong Kong 1",
      "ip_address": "223.223.219.124",
      "proxy_port": 8080,
      "user": "vpn4games",
      "pass": "v4gv4g**"
    },
    {
      "name": "Proxys Singapore 1",
      "ip_address": "178.128.49.166",
      "proxy_port": 80,
      "user": "vpn4games",
      "pass": "v4gv4g**"
    },
    {
      "name": "Proxys Thailand 2",
      "ip_address": "103.86.50.50",
      "proxy_port": 80,
      "user": "vpn4games",
      "pass": "v4gv4g**"
    },
    {
      "name": "Proxys Thailand 3\t",
      "ip_address": "122.155.168.84",
      "proxy_port": 8080,
      "user": "vpn4games",
      "pass": "v4gv4g**"
    },
    {
      "name": "Proxys USA 1",
      "ip_address": "192.241.198.249",
      "proxy_port": 8080,
      "user": "vpn4games",
      "pass": "v4gv4g**"
    }
  ],
  "premium": true
}