/Users/jbjares/workspaces/PHTWorkspace/central_workspace_15112019/phtkafkamstrain4fairintegration/src/main/java/eu/pht/services/mock/model/IntegrationOutputResult.java
/Users/jbjares/workspaces/PHTWorkspace/central_workspace_15112019/phtkafkamstrain4fairintegration/src/main/java/eu/pht/services/mock/model/IntegrationInput.java
/Users/jbjares/workspaces/PHTWorkspace/central_workspace_15112019/phtkafkamstrain4fairintegration/src/main/java/eu/pht/services/mock/model/IntegrationOutputWagon.java
/Users/jbjares/workspaces/PHTWorkspace/central_workspace_15112019/phtkafkamstrain4fairintegration/src/main/java/eu/pht/services/mock/model/PhtUser.java
/Users/jbjares/workspaces/PHTWorkspace/central_workspace_15112019/phtkafkamstrain4fairintegration/src/main/java/eu/pht/services/mock/boot/Application.java
/Users/jbjares/workspaces/PHTWorkspace/central_workspace_15112019/phtkafkamstrain4fairintegration/src/main/java/eu/pht/services/mock/model/IntegrationInputWagon.java
/Users/jbjares/workspaces/PHTWorkspace/central_workspace_15112019/phtkafkamstrain4fairintegration/src/main/java/eu/pht/services/mock/util/TrainUtil.java
/Users/jbjares/workspaces/PHTWorkspace/central_workspace_15112019/phtkafkamstrain4fairintegration/src/main/java/eu/pht/services/mock/listener/KafkaTransactions.java
/Users/jbjares/workspaces/PHTWorkspace/central_workspace_15112019/phtkafkamstrain4fairintegration/src/main/java/eu/pht/services/mock/model/IntegrationWagon.java
/Users/jbjares/workspaces/PHTWorkspace/central_workspace_15112019/phtkafkamstrain4fairintegration/src/main/java/eu/pht/services/mock/model/IntegrationOutput.java
/Users/jbjares/workspaces/PHTWorkspace/central_workspace_15112019/phtkafkamstrain4fairintegration/src/main/java/eu/pht/services/mock/model/IntegrationInputProperties.java
/Users/jbjares/workspaces/PHTWorkspace/central_workspace_15112019/phtkafkamstrain4fairintegration/src/main/java/eu/pht/services/mock/service/MockServices.java
/Users/jbjares/workspaces/PHTWorkspace/central_workspace_15112019/phtkafkamstrain4fairintegration/src/main/java/eu/pht/services/mock/config/KafkaProducerConfig.java
/Users/jbjares/workspaces/PHTWorkspace/central_workspace_15112019/phtkafkamstrain4fairintegration/src/main/java/eu/pht/services/mock/config/KafkaConsumerConfig.java
