ts,training_segmentation_training_samples,training_patch_count_per_image,training_learning_rate,training_batch_k,training_batch_p,training_flip_augment,training_standardize,training_general_first_hit_percentage,training_general_AUC,training_among_other_donors_first_hit_percentage,training_among_other_donors_AUC,training_within_donor_first_hit_percentage,training_within_donor_AUC
1584753511,0,0,1e-05,10,20,False,1,3.2803607859980675,0.5086435346532818,1.9811016858155264,0.4925487159625879,11.800708686781915,0.6343426299055145
1583770480,0,0,1e-05,10,20,False,0,8.080103081713734,0.5125978701950488,4.144743906367443,0.4930558598140119,24.86846343820466,0.6691977884213729
1585521837,0,0,1e-06,10,20,False,1,2.695157306990229,0.5060806997147603,1.685815526683131,0.490824055744625,9.663910662514764,0.6221657932694067
1584025762,0,0,1e-06,10,20,False,0,7.806292279609148,0.5115928252745617,3.1300332868033935,0.4920998990559528,24.208096209599482,0.666547909627645
1586831151,0,0,1e-05,10,20,False,1,2.9421239128100503,0.5081599577127289,1.7717169547943734,0.4907681019488464,11.070546547836358,0.6410824206805776
1586740776,0,0,1e-05,10,20,False,0,4.993020508965962,0.5073479816080473,2.931386234296145,0.4898509262200572,16.36959089444862,0.6438501291923693
1587686591,0,0,1e-05,10,20,False,1,4.923225598625577,0.5107461125192833,2.652206592934608,0.4923072246015334,14.426071083431767,0.6540652230559723
1587462051,0,0,1e-05,10,20,False,0,12.546977343498336,0.5129132776514875,4.84806184902824,0.4921018487829826,33.093525179856115,0.6793876955709119
1589259198,0,0,1e-05,10,20,False,0,7.774914089347079,0.5110353196862106,3.946520618556701,0.4914170061146703,25.44029209621993,0.6676124109089204
1589258734,0,0,1e-05,10,20,True,0,10.867697594501722,0.5112911424632735,4.494201030927835,0.4901709612994012,31.121134020618552,0.6781533014079476
1589222258,0,0,1e-05,10,20,False,0,11.420747422680412,0.5116427240890997,4.64991408934708,0.4909564147158157,32.05004295532646,0.6766872359438033
1591130418,40,50,5e-05,60,5,False,0,23.31937285223368,0.5196385937612383,8.097079037800688,0.4970986584397102,46.50451030927835,0.7039240598312199
1591130635,40,20,5e-05,60,5,False,0,12.591280068728526,0.5102738206877414,4.9022766323024065,0.4903534915190603,36.082474226804116,0.6672257390503787
1591132845,40,50,5e-05,60,5,True,0,29.95060137457045,0.5189418774532086,9.428694158075599,0.496537400949277,53.61898625429553,0.7045372488712783
1591188766,40,50,5e-05,30,10,True,0,24.468427835051546,0.5179981089271051,8.446091065292096,0.49482984560871796,48.609321305841924,0.7058986740845709
1591234815,40,50,5e-05,30,10,True,0,14.52426975945017,0.505417669556265,4.977448453608247,0.48910338002196296,33.34407216494845,0.6322150945097393
1591250445,40,50,5e-05,30,10,True,0,31.87285223367697,0.5162760377301366,9.809922680412368,0.4932805500208641,53.710266323024065,0.7022763784166832
1591297149,40,50,5e-05,15,20,True,0,10.427405498281788,0.5057557241994798,3.9841065292096216,0.4889007067781602,28.119630584192443,0.6358374906836983
1591329662,40,50,5e-05,15,20,True,0,34.33741408934708,0.5119214279899906,10.717353951890033,0.489764947688363,55.015034364261176,0.6891707728489945
1591342075,40,50,5e-05,15,20,True,0,28.624355670103093,0.5122547887265567,9.38573883161512,0.4902678264000363,49.801331615120276,0.6859883482980799
1591395395,40,50,5e-05,7,40,True,0,26.927620274914087,0.5150423466236014,8.983032646048109,0.4931387570060913,49.355670103092784,0.6907140354818394
1591423439,40,50,5e-05,7,40,True,0,13.820876288659795,0.5086148148906459,4.655283505154639,0.4895193796119727,34.28908934707904,0.6570832210224403
1591434031,40,50,5e-05,7,40,True,0,10.024699312714775,0.5038183608709336,3.2699742268041234,0.4870570951498964,27.324957044673532,0.6316764139305575
1591490025,40,50,5e-05,6,50,True,0,0.3006872852233677,0.4989165392120114,0.3006872852233677,0.4984684970068871,0.9450171821305842,0.5017053179736146
1591509560,40,50,5e-05,6,50,True,0,1.068513745704467,0.4946994937542337,0.5262027491408935,0.4929738284472688,2.2068298969072164,0.5032467423146707
1591521386,40,50,5e-05,6,50,True,0,7.135953608247423,0.5095435368963103,2.5182560137457046,0.4923192067493629,23.260309278350515,0.6419850256681217
1591588276,40,50,5e-05,5,60,True,0,9.922680412371133,0.5078615110574586,3.4417955326460485,0.4926120150747532,27.953178694158076,0.6253148707818282
1591600820,40,50,5e-05,5,60,True,0,0.3597508591065292,0.4987542059696273,0.28994845360824745,0.4982684697171931,1.5088058419243986,0.5014682305494697
1591615341,40,50,5e-05,5,60,True,0,0.6765463917525774,0.49810023868181497,0.6711769759450171,0.4975804487927205,0.934278350515464,0.5008460668642595
1591684726,40,50,0.001,60,5,True,0,0.09664948453608248,0.498307043841485,0.10738831615120276,0.4980400517036216,0.7517182130584192,0.4996474134927844
1591695239,40,50,0.001,60,5,True,0,0.2684707903780069,0.4998426477629532,0.26310137457044674,0.4998119182409074,0.7893041237113402,0.5001920125078887
