ts,training_number of embeddings,training_duration,training_segmentation_training_samples,training_patch_count_per_image,training_learning_rate,training_batch_k,training_batch_p,training_flip_augment,training_standardize,training_general_first_hit_percentage,training_general_AUC,training_among_other_donors_first_hit_percentage,training_among_other_donors_AUC,training_within_donor_first_hit_percentage,training_within_donor_AUC,ts,validation_number of embeddings,validation_duration,validation_general_first_hit_percentage,validation_general_AUC,validation_among_other_donors_first_hit_percentage,validation_among_other_donors_AUC,validation_within_donor_first_hit_percentage,validation_within_donor_AUC,ts,number of embeddings,duration,general_first_hit_percentage,general_AUC,among_other_donors_first_hit_percentage,among_other_donors_AUC,within_donor_first_hit_percentage,within_donor_AUC
1593023060,18624,109505,40.0,50.0,5e-05,60.0,5.0,False,False,11.254295532646045,0.5029648132762913,4.821735395189004,0.4888542427671861,28.903565292096214,0.6118296742402507,1593023060,2115,109505,20.8983451536643,0.5085774441207861,11.15839243498818,0.4846128012874807,45.059101654846344,0.630141191158997,1593023060,20739,109505,10.54534934181976,0.5059991279270902,4.373402767732292,0.4909889696498961,27.199961425333914,0.618369333282505
1593023112,18624,111088,40.0,50.0,5e-05,15.0,20.0,False,False,4.67676116838488,0.4980994977346978,2.0994415807560136,0.4863192408646401,8.854166666666668,0.5834552942047184,1593023112,2115,111088,6.4775413711583925,0.5074785203395075,4.539007092198582,0.4912329287609537,18.2033096926714,0.5927188225910228,1593023112,20739,111088,4.30589710207821,0.5096040149621479,1.8178311393991995,0.4991754669439576,8.216403876753944,0.5903044429277067
1593023149,18624,109411,40.0,50.0,5e-05,6.0,50.0,False,False,0.9718642611683848,0.4954603074457464,0.4725085910652921,0.4938430600419052,2.228307560137457,0.5037373775235717,1593023149,2115,109411,3.0732860520094563,0.5021773029731714,2.458628841607565,0.5016991324547815,5.7683215130023635,0.5060648902266173,1593023149,20739,109411,0.8341771541540094,0.4940217256108618,0.3616374945754376,0.4922590472448513,2.039635469405468,0.5021974656026493
1593132703,18624,111572,40.0,50.0,5e-05,6.0,50.0,True,False,0.3382731958762887,0.5044671615675703,0.3167955326460481,0.504823076064993,0.8215206185567011,0.5054068073944816,1593132703,2115,111572,1.7966903073286054,0.5021573461117775,1.6075650118203308,0.5021325902760457,5.106382978723404,0.5106064839929133,1593132703,20739,111572,0.2796663291383384,0.4990529980821667,0.25073532957230343,0.4985179599884241,0.7329186556728868,0.5026791729297783
1593133440,18624,109068,40.0,50.0,5e-05,30.0,10.0,False,False,35.27169243986255,0.5141237426835682,10.631443298969073,0.4907832202139167,56.22315292096219,0.7019635222071433,1593133440,2115,109068,46.241134751773046,0.5182207996233003,23.26241134751773,0.4818649614612536,67.94326241134752,0.7113364010716074,1593133440,20739,109068,33.34779883311635,0.5166601013230429,9.61955735570664,0.4918800771295718,54.37581368436279,0.7105303163803847
1593134313,18624,110897,40.0,50.0,5e-05,15.0,20.0,True,False,10.266323024054982,0.5051648210349426,3.731743986254296,0.4883816436465282,27.330326460481096,0.6339783932869484,1593134313,2115,110897,20.61465721040189,0.5127027501303469,10.212765957446807,0.4854659078323266,43.356973995271865,0.6531352345811207,1593134313,20739,110897,9.537586190269543,0.5115272000255128,3.26438111770095,0.494551491033896,25.82091711268624,0.6428468180826112
1593242622,18624,113123,40.0,50.0,5e-05,30.0,10.0,True,False,4.762671821305842,0.4917811322136669,2.029639175257732,0.4859292225242713,9.208548109965637,0.531267347806359,1593242622,2115,113123,7.612293144208037,0.5008509197108217,5.390070921985815,0.4963545387889087,12.15130023640662,0.5221424807864706,1593242622,20739,113123,4.426442933603356,0.4960269112015824,1.8226529726602052,0.4905356866636195,8.968609865470851,0.531461596599917
1593244389,18624,108803,40.0,50.0,5e-05,5.0,60.0,False,False,0.8698453608247423,0.4945279665280387,0.5798969072164949,0.4928413000613657,2.158505154639175,0.5025305111284849,1593244389,2115,108803,2.6477541371158386,0.5013708534039081,2.2222222222222223,0.5009406305350125,5.7683215130023635,0.5037024305537179,1593244389,20739,108803,0.7666714884999277,0.4972274134104663,0.5014706591446069,0.495983361807673,1.9239114711413283,0.505093061952145
1593245325,18624,103789,40.0,50.0,5e-05,7.0,40.0,False,False,9.938788659793811,0.5051323281654841,3.1518470790378004,0.4889759660409925,27.598797250859107,0.6308219992132515,1593245325,2115,103789,21.040189125295512,0.5123648925637213,9.314420803782506,0.485866401077217,43.829787234042556,0.6450812363401329,1593245325,20739,103789,9.093977530257005,0.5106798619877865,2.864168957037465,0.494072479535889,25.96557211051641,0.6387626436649321
1593349242,18624,109164,40.0,50.0,5e-05,7.0,40.0,True,False,1.6537800687285225,0.4944163481369287,0.6550687285223368,0.4925117409186112,2.937070446735395,0.50424128224396,1593349242,2115,109164,3.498817966903073,0.5017517844402465,2.789598108747045,0.5012808633442924,6.193853427895981,0.5031363957969324,1593349242,20739,109164,1.5285211437388495,0.4973074525520538,0.5641544915376826,0.4958827198983648,2.7098702926852787,0.5067244773211729
1593353302,18624,117161,40.0,50.0,5e-05,5.0,60.0,True,False,0.2684707903780069,0.5031733668945814,0.26310137457044674,0.5037562241449742,0.902061855670103,0.5013199973423036,1593353302,2115,117161,0.5673758865248227,0.5043148080630954,0.4728132387706856,0.5050938021937662,5.390070921985815,0.5019772006318939,1593353302,20739,117161,0.2169824967452625,0.5030353160565931,0.2169824967452625,0.5033279261773522,0.6847003230628285,0.4997363333665612
1593355864,18624,106678,40.0,50.0,0.0001,60.0,5.0,False,False,14.153780068728526,0.5049197619325146,5.4714347079037795,0.4885872438012329,35.368341924398635,0.6328982696730799,1593355864,2115,106678,26.004728132387704,0.5134148891081148,11.631205673758865,0.4853016586172509,52.95508274231678,0.662163503822412,1593355864,20739,106678,13.178070302328944,0.5079285810199103,4.9038044264429335,0.4904921903907981,33.84926949226096,0.6403062045152397
1593458519,18624,111851,40.0,50.0,0.0001,15.0,20.0,False,False,11.275773195876287,0.5082158338088099,4.091494845360825,0.4928315749548038,28.994845360824748,0.6267558904891054,1593458519,2115,111851,22.364066193853425,0.5123530198321189,10.874704491725767,0.4856222781090986,45.53191489361702,0.6442559377381887,1593458519,20739,111851,10.458556343121657,0.5120565810732194,3.61155311249337,0.4961210017810952,27.61463908578041,0.6366746159729019
1593462661,18624,122490,40.0,50.0,0.0001,60.0,5.0,True,False,12.48926116838488,0.5078344400495455,4.832474226804124,0.4926312299864525,34.4286941580756,0.6259496123554578,1593462661,2115,122490,25.579196217494093,0.5120290138703938,13.286052009456265,0.4850682746924985,54.46808510638298,0.6536194265850717,1593462661,20739,122490,11.615796325763053,0.5105852322786593,4.301075268817205,0.4945814068219732,33.179034668981146,0.6352048878584383
1593470584,18624,111015,40.0,50.0,0.0001,6.0,50.0,False,False,0.8322594501718213,0.4986077653271933,0.4510309278350515,0.4976683509370894,2.2121993127147768,0.5031537084431661,1593470584,2115,111015,2.8841607565011818,0.5010356625968968,2.5059101654846336,0.5005598698019761,5.7683215130023635,0.5059985237907315,1593470584,20739,111015,0.7907806548049571,0.49605340109220797,0.4002121606634842,0.4944605949690827,2.0010608033174213,0.5050944435807186
1593570490,18624,113341,40.0,50.0,0.0001,15.0,20.0,True,False,37.575171821305844,0.5180167289140863,12.768470790378005,0.4963951626628919,58.956185567010316,0.691729284609215,1593570490,2115,113341,49.83451536643025,0.5176566856552121,24.917257683215126,0.4820639269743228,68.98345153664303,0.7068217995591053,1593570490,20739,113341,35.483870967741936,0.516337915740896,11.56275615989199,0.4926328518446642,57.003712811610974,0.7016216236622771
1593581711,18624,114449,40.0,50.0,0.0001,6.0,50.0,True,False,0.7839347079037801,0.4970090870127848,0.4993556701030927,0.4958238674786378,2.179982817869416,0.5027305030141989,1593581711,2115,114449,2.8841607565011818,0.4989778019324264,2.5059101654846336,0.4978091891587379,5.721040189125294,0.5022089058298588,1593581711,20739,114449,0.7232749891508752,0.4949457613922825,0.4146776604465018,0.4932683172423031,1.8419403057042287,0.5041555432358303
1593585268,18624,110346,40.0,50.0,0.0001,30.0,10.0,False,False,23.528780068728523,0.5241243342530605,8.268900343642613,0.5021617322472798,47.90592783505154,0.7044872675692241,1593585268,2115,110346,36.35933806146572,0.5190380310904855,19.810874704491727,0.4828456398507737,60.7565011820331,0.7160494764534957,1593585268,20739,110346,22.040599836057673,0.5212855782819762,7.5172380539080965,0.4970556718266845,46.00028930999567,0.7144741862628492
1593683948,18624,114700,40.0,50.0,0.0001,7.0,40.0,False,False,1.5947164948453607,0.4961375344561602,0.9235395189003436,0.4941169766420541,3.5330756013745703,0.5067297737250279,1593683948,2115,114700,3.92434988179669,0.5022449310132882,2.9787234042553195,0.5010028296504389,7.092198581560284,0.5082545955389106,1593683948,20739,114700,1.4561936448237618,0.4993834922879438,0.8197116543709918,0.4979460720522542,3.2788466174839668,0.5109058019853694
1593695731,18624,117325,40.0,50.0,0.0001,30.0,10.0,True,False,32.339991408934715,0.5101885804973341,9.203178694158076,0.4933065864845325,53.125,0.6428417915066083,1593695731,2115,117325,45.200945626477534,0.513165221730687,20.803782505910164,0.4829014739840741,67.04491725768321,0.6712576693274619,1593695731,20739,117325,30.584888374560013,0.5100511367548891,8.332127875018081,0.4915091891613011,51.06321423405179,0.6520617119583977
1593696278,18624,108208,40.0,50.0,0.0001,5.0,60.0,False,False,1.6591494845360826,0.5058307663748214,1.0792525773195876,0.4936418702647962,9.428694158075599,0.599391504745044,1593696278,2115,108208,7.375886524822695,0.5067787310545949,4.633569739952718,0.4884588156165064,27.32860520094563,0.608550917695079,1593696278,20739,108208,1.514055643955832,0.5068346013300846,0.9547229856791551,0.4940681023013761,8.963788032209846,0.6037882481061473
1593798768,18624,130597,40.0,50.0,0.0001,7.0,40.0,True,False,2.2873711340206184,0.4945124537994705,1.0362972508591064,0.4919144768890991,4.274054982817868,0.5082765039689011,1593798768,2115,130597,4.302600472813238,0.5009350165580913,3.0732860520094563,0.4994258366797482,7.044917257683216,0.5089828265584883,1593798768,20739,130597,2.0010608033174213,0.4959787414593289,0.8438208206760209,0.4937014081640702,3.7562081103235454,0.5102485778556489
1593804603,18624,138656,40.0,50.0,0.0001,5.0,60.0,True,False,0.5315721649484536,0.4959667861524876,0.4778780068728522,0.4942970027991925,1.814862542955327,0.504151017581793,1593804603,2115,138656,2.6004728132387704,0.5014357415870742,2.127659574468085,0.5006882126949174,5.673758865248227,0.5030241252535048,1593804603,20739,138656,0.4773614928395776,0.4981576718881181,0.3953903274024785,0.4967829666530499,1.6249578089589662,0.5069970277011698
1593813177,18624,116208,40.0,50.0,1e-05,60.0,5.0,False,False,13.171176975945018,0.5174802860453019,4.2633161512027495,0.4966270993753807,33.027276632302396,0.6820121063562268,1593813177,2115,116208,26.57210401891253,0.5219799111646918,13.04964539007092,0.4926488870878874,50.73286052009457,0.6859435853804372,1593813177,20739,116208,12.199238150344764,0.5249874910776261,3.6838806114084575,0.5046056170336429,31.8240995226385,0.6922057334406916
1593929477,18624,89909,40.0,50.0,1e-05,15.0,20.0,False,False,14.239690721649485,0.5172325132432544,4.617697594501719,0.495997437565208,34.589776632302396,0.6857029958236837,1593929477,2115,89909,27.848699763593377,0.5201386812302919,12.576832151300234,0.4871245140964087,53.286052009456256,0.6949078827834209,1593929477,20739,89909,13.120208303196875,0.5228395868453231,4.15642027098703,0.5013311752265728,32.63898934374849,0.6978816213981625
1593929501,18624,103984,40.0,50.0,1e-05,60.0,5.0,True,False,12.827534364261167,0.5140017492265603,4.166666666666666,0.4932801287739351,32.35609965635739,0.6757403382496728,1593929501,2115,103984,25.342789598108745,0.5181266364787965,12.15130023640662,0.4890718648576096,48.085106382978715,0.6691476811526189,1593929501,20739,103984,11.856887988813348,0.5217624339693672,3.6838806114084575,0.5013849971514871,30.941704035874444,0.6879324648283746
1594019525,18624,93816,40.0,50.0,1e-05,15.0,20.0,True,False,20.613187285223372,0.5184109844464121,6.180197594501719,0.4973427158842017,42.46670962199313,0.6858764456353921,1594019525,2115,93816,33.56973995271868,0.5197548307199235,15.366430260047279,0.4863963424565466,56.73758865248227,0.6971574617825507,1594019525,20739,93816,19.41270070880949,0.5216961133319823,5.390809585804523,0.4998111226128984,40.39249722744587,0.6979916543868356
1594033616,18624,84335,40.0,50.0,1e-05,30.0,10.0,False,False,16.602233676975946,0.5195980221419891,4.955970790378006,0.4975156725609841,37.983247422680414,0.6956972585664614,1594033616,2115,84335,32.29314420803783,0.519797577207238,13.900709219858156,0.4854483180770977,55.93380614657211,0.7008455444324251,1594033616,20739,84335,15.51183760065577,0.5249036546183367,4.310718935339216,0.5023938723466634,36.00945079319157,0.7079445769918996
1594113452,18624,79078,40.0,50.0,1e-05,7.0,40.0,False,False,2.1316580756013748,0.4985695080423052,0.939647766323024,0.4969480054154788,3.4579037800687287,0.5064565291522316,1594113452,2115,79078,3.687943262411348,0.5021566638155246,2.8841607565011818,0.5020004582846977,6.950354609929079,0.5027905568618078,1594113452,20739,79078,1.9190896378803217,0.4972144186609427,0.7907806548049571,0.495282108083079,3.129369786392786,0.5093234326134393
1594118066,18624,92060,40.0,50.0,1e-05,30.0,10.0,True,False,13.224871134020619,0.5189558763876665,4.64991408934708,0.497804516141819,33.40313573883161,0.6853338765270387,1594118066,2115,92060,25.626477541371155,0.5217856650350536,11.300236406619383,0.4906309422334247,51.01654846335697,0.6877900628530473,1594118066,20739,92060,12.339071314913928,0.5225186364305444,4.059983605766913,0.500996204308827,31.674622691547327,0.6968865497651863
1594132422,18624,-1,40.0,50.0,0.0001,6.0,50.0,False,False,0.23625429553264604,0.5013693968372563,0.2255154639175257,0.4995476373614554,1.0577749140893469,0.5165742252342227,1594132422,2115,-1,1.6548463356973997,0.5073333364068517,1.5130023640661938,0.5043521609234309,6.57210401891253,0.5442147419124599,1594132422,20739,-1,0.24591349631129755,0.4945300564673857,0.22662616326727425,0.4916246224047173,1.0222286513332368,0.5101034653414686
1594165757,18624,-1,40.0,50.0,0.0001,5.0,60.0,False,False,0.467139175257732,0.5002661209840876,0.4080756013745705,0.4998242946908781,1.5410223367697595,0.5022100378938398,1594165757,2115,-1,2.789598108747045,0.5021259021151703,2.364066193853428,0.5021095964128025,5.342789598108747,0.5049561587453306,1594165757,20739,-1,0.4146776604465018,0.4939733098634565,0.35199382805342594,0.4921514456808016,1.3886879791696802,0.5032761026752969
1594192645,18624,59528,40.0,50.0,1e-05,7.0,40.0,True,False,17.719072164948454,0.51783809953242,5.696950171821307,0.4971382759321524,39.71219931271477,0.6824004377163722,1594192645,2115,59528,32.104018912529554,0.5192900570208451,15.319148936170214,0.485889720181641,56.973995271867615,0.6937741031554148,1594192645,20739,59528,16.60157191764309,0.5201771883996671,4.932735426008969,0.4983530417494084,37.64887410193356,0.6946417039553832
1594199191,18624,-1,40.0,50.0,1e-05,6.0,50.0,False,False,1.9007731958762888,0.5011060018447138,0.7624570446735395,0.5001747873305193,3.173324742268041,0.5110926396094475,1594199191,2115,-1,2.9787234042553195,0.5005285507573609,2.364066193853428,0.4981091394900134,6.4302600472813225,0.5035825060454294,1594199191,20739,-1,1.7358599739621,0.5050100003752516,0.641303823713776,0.5047451345021848,2.8545252905154537,0.5119427597334499
1594232848,18624,-1,40.0,50.0,1e-05,5.0,60.0,False,False,1.5410223367697595,0.4998663285436514,0.6926546391752577,0.4987750908339432,2.7867268041237114,0.5052347304895752,1594232848,2115,-1,2.9787234042553195,0.5041242849790724,2.458628841607565,0.5050526292112437,5.7683215130023635,0.5019773099742489,1594232848,20739,-1,1.4320844785187328,0.5018633649834386,0.6171946574087468,0.5012393909098429,2.381985630936882,0.50867403749006
1594694428,18624,49197,40.0,50.0,5e-05,60.0,5.0,True,False,23.824097938144327,0.5233609312655133,7.8715635738831615,0.5010966484893418,47.717998281786954,0.7051338852276068,1594694428,2115,49197,39.05437352245863,0.5203017967517036,19.33806146572104,0.4846648842376714,61.56028368794326,0.7137708823670013,1594694428,20739,49197,22.416702830416128,0.5251961672008509,7.170066059115675,0.5017470121806263,45.802594146294425,0.7145965090126797
1594694844,18624,48869,40.0,50.0,1e-05,6.0,50.0,True,False,1.336984536082474,0.4958221886628062,0.7463487972508591,0.4940222141497339,2.566580756013745,0.504819552769108,1594694844,2115,48869,1.8912529550827424,0.4989103037886806,1.2293144208037825,0.4974920335864563,6.288416075650117,0.5049467684238697,1594694844,20739,48869,1.190992815468441,0.4924813688870819,0.5352234919716476,0.4897546241458477,2.3385891315878298,0.5063173257410035
1594695178,18624,48579,40.0,50.0,1e-05,5.0,60.0,True,False,2.2068298969072164,0.4971282770970115,0.8805841924398625,0.4948895002437694,3.51159793814433,0.507256606519369,1594695178,2115,48579,3.356973995271868,0.5022083528521732,2.6477541371158386,0.5012835368776677,6.8557919621749415,0.5047530028362971,1594695178,20739,48579,2.0107044698394327,0.4991199027945004,0.7522059887169101,0.4973864968067922,3.1245479531317804,0.5103246914639719
random,18624,0,,,,,,,,0.20403780068728525,0.4981426027552621,0.18256013745704466,0.4978344866069673,0.7839347079037801,0.4993136429657448,random,2115,0,0.6619385342789598,0.4995787467397461,0.6619385342789598,0.5005141837894871,4.3498817966903065,0.4908010626502392,random,20739,0,0.16394233087419838,0.4982995169609842,0.14947683109118087,0.4982163464082924,0.6895221563238343,0.4975434433589389
