ts,training_number of embeddings,training_duration,training_finish_time,training_segmentation_training_samples,training_patch_count_per_image,training_learning_rate,training_batch_k,training_batch_p,training_flip_augment,training_standardize,training_general_first_hit_percentage,training_general_AUC,training_among_other_donors_first_hit_percentage,training_among_other_donors_AUC,training_within_donor_first_hit_percentage,training_within_donor_AUC,margin,metric,ts,validation_number of embeddings,validation_duration,validation_general_first_hit_percentage,validation_general_AUC,validation_among_other_donors_first_hit_percentage,validation_among_other_donors_AUC,validation_within_donor_first_hit_percentage,validation_within_donor_AUC,margin,metric,ts,number of embeddings,duration,general_first_hit_percentage,general_AUC,among_other_donors_first_hit_percentage,among_other_donors_AUC,within_donor_first_hit_percentage,within_donor_AUC
1594957148,18624,34424,1594991572.0,40,50,5e-05,25,12,False,False,24.114046391752574,0.523106345735384,8.360180412371134,0.50075683917688,48.179768041237104,0.7046627179206721,,,1594957148,2115,34424,38.534278959810884,0.5217827452978551,20.756501182033094,0.4862323818266264,62.127659574468076,0.7136630489363459,,,1594957148,20739,34424,22.561357828246297,0.5233325086026333,7.555812719996142,0.4995301571606177,46.72356429914654,0.7143242755472625
1596949246,18624,40519,1596989765.0,40,50,7e-05,17,17,True,False,5.46069587628866,0.4977443670554613,2.636383161512028,0.4944221957662746,8.075601374570446,0.5200297903780541,1.0,cityblock,1596949246,2115,40519,6.5248226950354615,0.5037590414478068,4.680851063829787,0.5025799070920717,8.983451536643026,0.5073913485791858,1.0,cityblock,1596949246,20739,40519,5.03399392449009,0.4992841674907681,2.333767298326824,0.4962367822312898,7.739042383914366,0.521877624365823
1596414379,18624,39510,1596453889.0,40,50,0.0001,17,17,True,False,22.030713058419245,0.522243367084532,7.780283505154638,0.4998235589633009,47.5622852233677,0.7045527195162061,1.0,euclidean,1596414379,2115,39510,36.87943262411347,0.5210268556450721,18.77068557919622,0.4852241383306376,60.709219858156025,0.7138169067511337,1.0,euclidean,1596414379,20739,39510,20.700130189498047,0.5219594395210859,7.044698394329523,0.497781646590982,45.91831814455856,0.714159867670663
1596630544,18624,41437,1596671981.0,40,50,7e-05,16,18,True,False,38.68127147766322,0.5172768696639635,11.84493127147766,0.4958035426881982,59.702534364261176,0.6903090351197767,soft,euclidean,1596630544,2115,41437,51.536643026004725,0.5180482440641537,25.815602836879428,0.48268068247620294,69.31442080378251,0.7040215418435479,soft,euclidean,1596630544,20739,41437,36.915955446260675,0.5165609050073429,10.723757172476978,0.4932048102394723,57.461786971406525,0.6994882498290123
1595143205,18624,36173,1595179378.0,40,50,8e-05,25,12,False,False,23.73818728522337,0.5107480280370318,7.925257731958762,0.4923176690367354,45.75279209621993,0.6548934928109489,,,1595143205,2115,36173,36.406619385342786,0.5113601766383773,18.061465721040193,0.4805162762540456,61.74940898345154,0.6703706447791847,,,1595143205,20739,36173,22.296156998890982,0.5127641659223475,7.054342060851536,0.4934212177885532,43.96065384059019,0.6642304610128209
1596835093,18624,34619,1596869712.0,40,50,7e-05,17,17,False,False,5.138530927835052,0.5000865835677141,2.4914089347079043,0.4921302474241678,8.714561855670103,0.5561536064512076,0.1,cityblock,1596835093,2115,34619,5.957446808510639,0.5086783611778339,4.58628841607565,0.4991305514760077,11.867612293144207,0.5582432392419042,0.1,cityblock,1596835093,20739,34619,4.682000096436665,0.5062678481737211,2.1408939678865906,0.4990738583361769,8.037996046096726,0.563526526982519
1598169861,18624,19355,1598189216.0,40,50,7e-05,17,17,True,False,18.132517182130588,0.5216850029452037,6.0728092783505145,0.4996432077073088,40.64110824742268,0.6993539425635751,soft,euclidean,1598169861,2115,19355,32.34042553191489,0.5198233373074407,16.78486997635934,0.4849599047450128,56.87943262411348,0.7038765932438582,soft,euclidean,1598169861,20739,19355,17.07411157722166,0.5239258210887631,5.4486715849365925,0.5009144149852763,39.22561357828246,0.7106260604082473
1595327354,18624,34111,1595361465.0,40,50,9e-05,30,10,False,False,14.261168384879724,0.509136150459779,4.929123711340206,0.4933107056177444,36.678479381443296,0.6323730988776566,,,1595327354,2115,34111,30.118203309692674,0.5137647173322715,13.522458628841608,0.4853928421255284,56.92671394799055,0.6604170702310758,,,1595327354,20739,34111,13.303437967115096,0.5106212153780378,4.407155600559333,0.4936870992426847,35.15116447273253,0.6416702412484968
1596223288,18624,34702,1596257990.0,40,50,0.0001,16,18,False,False,4.794888316151203,0.4944770824245057,2.0403780068728516,0.4902023737944412,8.290378006872851,0.5215244285554184,soft,euclidean,1596223288,2115,34702,6.193853427895981,0.5025197383115205,4.58628841607565,0.5003788201580791,9.361702127659576,0.5134454926391383,soft,euclidean,1596223288,20739,34702,4.407155600559333,0.496492221012758,1.7889001398331648,0.4927014426222355,7.792082549785428,0.52108345481536
1594019525,18624,93816,,40,50,1e-05,15,20,True,False,20.613187285223372,0.5184109844464121,6.180197594501719,0.4973427158842017,42.46670962199313,0.6858764456353921,,,1594019525,2115,93816,33.56973995271868,0.5197548307199235,15.366430260047279,0.4863963424565466,56.73758865248227,0.6971574617825507,,,1594019525,20739,93816,19.41270070880949,0.5216961133319823,5.390809585804523,0.4998111226128984,40.39249722744587,0.6979916543868356
1596489082,18624,40168,1596529250.0,40,50,7e-05,17,17,True,False,4.623067010309279,0.5020526684182883,2.3840206185567014,0.494173615019237,11.737542955326461,0.5603102813458546,0.5,sqeuclidean,1596489082,2115,40168,9.692671394799056,0.5053018611855308,6.761229314420804,0.4943124938946024,22.884160756501178,0.5625580329082875,0.5,sqeuclidean,1596489082,20739,40168,4.281787935773181,0.5009449552813869,2.160181300930613,0.4921600183655472,10.825015670958097,0.5629441135661778
1596221527,18624,34695,1596256222.0,40,50,7e-05,17,17,False,False,4.778780068728522,0.5035078341136789,2.1155498281786937,0.4906669796615165,8.510524054982817,0.5996230995079873,soft,euclidean,1596221527,2115,34695,6.004728132387707,0.5094662182513401,4.539007092198582,0.4901577624097674,17.777777777777782,0.6080134300403774,soft,euclidean,1596221527,20739,34695,4.426442933603356,0.5097493905638525,1.8371184724432228,0.4974584416670802,7.825835382612469,0.6078665034973593
1595175053,18624,33921,1595208974.0,40,50,0.0001,21,14,False,False,13.2409793814433,0.50822639543848,4.440506872852233,0.4916330529804742,30.81507731958763,0.6373497853868895,,,1595175053,2115,33921,24.9645390070922,0.5144089669526173,11.016548463356974,0.4868694275231322,48.93617021276596,0.6556967039009459,,,1595175053,20739,33921,12.276387482520855,0.5125005708768534,3.8863976083707024,0.4953923527721216,29.23959689473938,0.6470469217098654
1598176969,18624,13322,1598190291.0,40,50,8e-05,25,12,True,False,18.019759450171822,0.5085447724667642,5.46069587628866,0.4923721036863046,35.604596219931274,0.6329651743164443,soft,euclidean,1598176969,2115,13322,28.463356973995275,0.5142604307788471,12.38770685579196,0.4875450577007888,52.056737588652474,0.6533522026164575,soft,euclidean,1598176969,20739,13322,16.963209412218525,0.5110448290310574,4.956844592313998,0.4941109628668483,34.23501615314142,0.6432040700213048
1595503244,18624,32970,1595536214.0,40,50,9e-05,21,14,True,False,6.459407216494847,0.4989874455427831,2.9692869415807563,0.4949663010714823,10.137457044673539,0.5286565382375794,,,1595503244,2115,32970,7.659574468085107,0.5025766614441313,5.059101654846336,0.4988491903377074,11.867612293144207,0.5227344493630525,,,1595503244,20739,32970,5.9935387434302525,0.4964870276793413,2.594146294421139,0.4915434718159143,9.61955735570664,0.5297768481198999
1596762700,18624,34797,1596797497.0,40,50,0.0001,17,17,False,False,14.79274054982818,0.5022102744343704,6.185567010309278,0.4892768469244671,27.271262886597928,0.5972200474408532,1.0,sqeuclidean,1596762700,2115,34797,18.534278959810873,0.5024958000183599,11.82033096926714,0.4842066970399908,34.46808510638298,0.5944388172008821,1.0,sqeuclidean,1596762700,20739,34797,13.819374126042721,0.5026689042855671,5.516177250590673,0.4893087896845845,25.656974781812053,0.6021723323876719
1596672248,18624,37307,1596709555.0,40,50,7e-05,18,16,True,False,6.846005154639176,0.509890622334922,2.8296821305841924,0.4946803800395762,23.609321305841927,0.6290557537635881,soft,euclidean,1596672248,2115,37307,17.06855791962175,0.5150998978295365,8.463356973995271,0.4889386373248956,44.917257683215134,0.6535613767287191,soft,euclidean,1596672248,20739,37307,6.2683832393075845,0.5127240865234234,2.5169969622450457,0.4967683502965018,22.339553498240033,0.6373099375764056
1595431794,18624,37788,1595469582.0,40,50,5.9999999999999995e-05,16,18,True,False,3.2484965635738834,0.4968705021222466,1.4980670103092784,0.493304283720302,6.368127147766322,0.5212142357310692,,,1595431794,2115,37788,4.539007092198582,0.499919868948655,3.309692671394799,0.4968572356149686,8.699763593380617,0.5112838642568021,,,1595431794,20739,37788,2.946140122474565,0.499552805872217,1.2729639809055404,0.4964254288577716,6.075509908867352,0.5227502836049777
1596784123,18624,34697,1596818820.0,40,50,5e-05,18,16,False,False,13.928264604810993,0.5098671916964713,4.461984536082475,0.4932545180857257,32.32388316151203,0.6396589670810432,soft,euclidean,1596784123,2115,34697,25.8628841607565,0.5151121908322539,11.678486997635936,0.4871815263842799,49.88179669030733,0.6624496440184681,soft,euclidean,1596784123,20739,34697,13.01412797145475,0.5142813649910288,3.881575775109697,0.4972113513047426,31.076715367182604,0.6496932532381616
1596374295,18624,35170,1596409465.0,40,50,8e-05,15,20,True,False,41.532431271477655,0.5177206720267162,12.967139175257733,0.4962476384125257,61.02341065292096,0.6914527933773793,soft,euclidean,1596374295,2115,35170,53.56973995271868,0.5172852514737929,27.32860520094563,0.4820172457008794,71.48936170212768,0.7042241576013472,soft,euclidean,1596374295,20739,35170,39.490814407637785,0.5164536113024704,11.885818988379382,0.4929443818075861,59.19764694536863,0.7012984675107888
1596760102,18624,34802,1596794904.0,40,50,0.0001,17,17,False,False,10.035438144329897,0.506395018138078,4.800257731958762,0.4949435313460525,24.667096219931274,0.5944750227144057,0.2,sqeuclidean,1596760102,2115,34802,18.581560283687946,0.5064201088352186,11.914893617021278,0.4868990293705182,40.7565011820331,0.613748611516103,0.2,sqeuclidean,1596760102,20739,34802,9.224167028304162,0.5039432156133314,4.276966102512176,0.4908917719712742,23.009788321519842,0.5997715192835652
1593353302,18624,117161,,40,50,5e-05,5,60,True,False,0.2684707903780069,0.5031733668945814,0.26310137457044674,0.5037562241449742,0.902061855670103,0.5013199973423036,,,1593353302,2115,117161,0.5673758865248227,0.5043148080630954,0.4728132387706856,0.5050938021937662,5.390070921985815,0.5019772006318939,,,1593353302,20739,117161,0.2169824967452625,0.5030353160565931,0.2169824967452625,0.5033279261773522,0.6847003230628285,0.4997363333665612
1596795103,18624,39720,1596834823.0,40,50,7e-05,17,17,True,False,36.27577319587629,0.5184228540845585,12.193943298969073,0.4968470662387986,56.352018900343644,0.6926581775215028,soft,cityblock,1596795103,2115,39720,44.72813238770685,0.5171342250629883,23.971631205673763,0.4815840143490167,66.09929078014184,0.7028205691514513,soft,cityblock,1596795103,20739,39720,34.40860215053764,0.5164667311158826,10.955205169005255,0.4927633800731256,54.747094845460246,0.7028248129061916
1596525946,18624,34895,1596560841.0,40,50,7e-05,17,17,False,False,5.659364261168385,0.5048829740956029,2.5343642611683848,0.4941381788608369,13.514819587628866,0.5888470097556665,soft,sqeuclidean,1596525946,2115,34895,9.645390070921986,0.5066265214197961,5.390070921985815,0.4892550030720482,22.836879432624112,0.5875714524955359,soft,sqeuclidean,1596525946,20739,34895,5.217223588408314,0.5048492682618311,2.1987559670186605,0.4932470078101605,12.488548146005114,0.5932248753171964
1596304056,18624,35022,1596339078.0,40,50,0.0001,17,17,False,False,5.407001718213059,0.4974977807568619,2.459192439862543,0.493561407451265,8.660867697594501,0.5245730311615354,0.5,euclidean,1596304056,2115,35022,6.1465721040189125,0.5036746049315994,4.25531914893617,0.5018714292508125,9.881796690307329,0.5141899522510681,0.5,euclidean,1596304056,20739,35022,4.971310092097014,0.4973073314026914,2.1360721346255844,0.4932557390195797,8.341771541540094,0.5251473662121295
1596595541,18624,34745,1596630286.0,40,50,0.0001,16,18,False,False,4.585481099656357,0.5067759302798919,1.804123711340206,0.49386027554296796,10.314647766323024,0.6068581682432941,soft,euclidean,1596595541,2115,34745,7.754137115839244,0.5116876154252448,5.4846335697399535,0.4916476572983929,19.905437352245862,0.6187412731132791,soft,euclidean,1596595541,20739,34745,4.219104103380105,0.5113221533309861,1.6683543083080188,0.4980503114570021,9.35435652635132,0.6126224790880073
1593683948,18624,114700,,40,50,0.0001,7,40,False,False,1.5947164948453607,0.4961375344561602,0.9235395189003436,0.4941169766420541,3.5330756013745703,0.5067297737250279,,,1593683948,2115,114700,3.92434988179669,0.5022449310132882,2.9787234042553195,0.5010028296504389,7.092198581560284,0.5082545955389106,,,1593683948,20739,114700,1.4561936448237618,0.4993834922879438,0.8197116543709918,0.4979460720522542,3.2788466174839668,0.5109058019853694
1595904365,18624,37373,1595941738.0,40,50,7e-05,15,20,True,False,4.005584192439863,0.4933851912869156,1.761168384879725,0.4899073147083287,6.303694158075602,0.5143616666830779,,,1595904365,2115,37373,3.877068557919622,0.5017887473537954,3.026004728132388,0.5004032383697271,8.085106382978722,0.5041726398572915,,,1595904365,20739,37373,3.6838806114084575,0.4960912007371975,1.4803028111287913,0.4931301889682896,5.882636578427117,0.5157526247899663
1595132851,18624,38048,1595170899.0,40,50,0.0001,16,18,True,False,15.64110824742268,0.5107522149525402,5.0311426116838485,0.4942353226254512,34.423324742268036,0.6390067056002042,,,1595132851,2115,38048,28.841607565011827,0.5149016049751043,13.191489361702127,0.4862793435685342,53.00236406619385,0.660183160691231,,,1595132851,20739,38048,14.547470948454606,0.5139473392676949,4.4360866001253685,0.4966792872664023,33.376729832682386,0.6497578569139758
1596987783,18624,32968,1597020751.0,40,50,7e-05,17,17,False,False,5.417740549828179,0.5043992977077657,2.31958762886598,0.4914331853492449,12.140249140893472,0.6019732358221542,0.2,cityblock,1596987783,2115,32968,8.274231678486997,0.5098481810990032,5.57919621749409,0.4906017395377355,24.728132387706854,0.6017186715673618,0.2,cityblock,1596987783,20739,32968,4.932735426008969,0.5078767273849291,2.0058826365784275,0.4950194145795105,11.283089830753653,0.6067665269916457
1595175523,18624,33931,1595209454.0,40,50,7e-05,25,12,False,False,19.936640893470788,0.5118099944194915,6.604381443298969,0.494912559152656,42.944587628865975,0.645126150250281,,,1595175523,2115,33931,34.2789598108747,0.5143019599573011,16.64302600472813,0.4847483761398824,58.817966903073284,0.6691867032523271,,,1595175523,20739,33931,18.747287718790684,0.512619394092029,5.969429577125223,0.494527285177509,41.06755388398669,0.6537108277539757
1596721616,18624,40827,1596762443.0,40,50,0.0001,17,17,True,False,8.682345360824742,0.5136485386127461,3.962628865979381,0.4941656534558598,30.535867697594504,0.6623458199476226,1.0,sqeuclidean,1596721616,2115,40827,21.749408983451534,0.5137520954051533,11.725768321513007,0.4842038329077528,48.79432624113475,0.6708021403284915,1.0,sqeuclidean,1596721616,20739,40827,7.984955880225662,0.5162400460993429,3.4861854477072187,0.4966927287619159,28.55971840493756,0.6716603549338537
1594694428,18624,49197,,40,50,5e-05,60,5,True,False,23.824097938144327,0.5233609312655133,7.8715635738831615,0.5010966484893418,47.717998281786954,0.7051338852276068,,,1594694428,2115,49197,39.05437352245863,0.5203017967517036,19.33806146572104,0.4846648842376714,61.56028368794326,0.7137708823670013,,,1594694428,20739,49197,22.416702830416128,0.5251961672008509,7.170066059115675,0.5017470121806263,45.802594146294425,0.7145965090126797
1595603756,18624,32689,1595636445.0,40,50,7e-05,18,16,False,False,27.341065292096214,0.5210493461770982,8.95081615120275,0.4983478313275676,51.530283505154635,0.7031946480776212,,,1595603756,2115,32689,40.14184397163121,0.5181788711909165,20.28368794326241,0.4819631177434641,63.877068557919635,0.7160464979677412,,,1595603756,20739,32689,25.66179661507305,0.5202731284313318,7.980134046964656,0.4959821759002764,49.828824919234286,0.7130288255799944
1596819094,18624,35134,1596854228.0,40,50,5.9999999999999995e-05,21,14,False,False,34.93878865979381,0.5200763470058177,11.173754295532646,0.4979521891726714,55.8204467353952,0.6981658938964325,soft,euclidean,1596819094,2115,35134,46.241134751773046,0.5185392412034461,22.411347517730494,0.482278816213811,66.6193853427896,0.7089192089894111,soft,euclidean,1596819094,20739,35134,33.19350016876416,0.517688541480367,10.116206181590242,0.4935173157393347,54.26008968609865,0.7069700131679951
1597023204,18624,37711,1597060915.0,40,50,0.0001,17,17,True,False,8.913230240549828,0.50776877800503,3.5062285223367704,0.4920165152905503,24.103307560137463,0.6275413924120704,1.0,cityblock,1597023204,2115,37711,19.196217494089836,0.5122410953235436,8.888888888888891,0.4865925729812922,43.78250591016549,0.6394700993926381,1.0,cityblock,1597023204,20739,37711,8.279087709147017,0.511189433729254,2.9798929553016067,0.4949318047029746,22.812093157818605,0.6365622480429443
1596709811,18624,36047,1596745858.0,40,50,7e-05,15,20,False,False,5.197594501718213,0.4964395252790142,2.405498281786942,0.4931592315424795,7.640678694158076,0.5190898283366676,soft,euclidean,1596709811,2115,36047,5.91016548463357,0.5043357008789345,4.539007092198582,0.5031375093199166,8.936170212765957,0.50793583195777,soft,euclidean,1596709811,20739,36047,4.788080428178794,0.4990566514721989,2.0155263031004385,0.4959728275112074,7.16524422585467,0.521962216984375
1596300554,18624,35001,1596335555.0,40,50,0.0001,17,17,False,False,5.160008591065292,0.5058271596549392,2.244415807560137,0.4959967096862485,10.835481099656358,0.5836327132540479,0.1,euclidean,1596300554,2115,35001,8.321513002364068,0.5085312795729929,6.0992907801418434,0.4937047205028296,19.38534278959811,0.5837665528471065,0.1,euclidean,1596300554,20739,35001,4.826655094266839,0.5078101934503658,1.9769516370123923,0.4971755238683486,9.952263850716042,0.5869722006323609
1593458519,18624,111851,,40,50,0.0001,15,20,False,False,11.275773195876287,0.5082158338088099,4.091494845360825,0.4928315749548038,28.994845360824748,0.6267558904891054,,,1593458519,2115,111851,22.364066193853425,0.5123530198321189,10.874704491725767,0.4856222781090986,45.53191489361702,0.6442559377381887,,,1593458519,20739,111851,10.458556343121657,0.5120565810732194,3.61155311249337,0.4961210017810952,27.61463908578041,0.6366746159729019
1595287279,18624,38735,1595326014.0,40,50,5.9999999999999995e-05,21,14,True,False,11.469072164948454,0.5063349607139535,4.247207903780069,0.4919580578882712,27.52362542955327,0.6163551464127229,,,1595287279,2115,38735,20.141843971631207,0.5118333666131938,10.78014184397163,0.4879080899966345,43.735224586288425,0.6347771736199584,,,1595287279,20739,38735,10.796084671392062,0.5085751677335372,3.7417426105405283,0.493496299899362,25.787164279859205,0.6249974428018057
1593133440,18624,109068,,40,50,5e-05,30,10,False,False,35.27169243986255,0.5141237426835682,10.631443298969073,0.4907832202139167,56.22315292096219,0.7019635222071433,,,1593133440,2115,109068,46.241134751773046,0.5182207996233003,23.26241134751773,0.4818649614612536,67.94326241134752,0.7113364010716074,,,1593133440,20739,109068,33.34779883311635,0.5166601013230429,9.61955735570664,0.4918800771295718,54.37581368436279,0.7105303163803847
1598149994,18624,26504,1598176498.0,40,50,8e-05,15,20,True,False,10.502577319587632,0.5094716379550916,3.6565721649484537,0.4927263164061012,27.518256013745702,0.6387920468912986,soft,euclidean,1598149994,2115,26504,21.27659574468085,0.5150656991840905,9.83451536643026,0.4878645187999024,44.4917257683215,0.6517618530502602,soft,euclidean,1598149994,20739,26504,9.691884854621726,0.5147018176345654,3.1534789526978155,0.4977659941053186,25.970393943777427,0.6480591253194338
1596719042,18624,40802,1596759844.0,40,50,0.0001,17,17,True,False,15.834407216494846,0.5008381150994827,6.4325601374570445,0.4888446375949905,29.12908075601375,0.5884283364412135,0.2,sqeuclidean,1596719042,2115,40802,20.520094562647753,0.5010731372825469,12.104018912529549,0.4842179765727068,32.009456264775416,0.5850203029071901,0.2,sqeuclidean,1596719042,20739,40802,14.774097111721876,0.5009819425740792,5.660832248420848,0.4884411110489874,27.6001735859974,0.5936032997260029
1595326978,18624,34094,1595361072.0,40,50,8e-05,21,14,False,False,25.46713917525773,0.5210025662902485,9.3481529209622,0.4984558736386573,47.739475945017176,0.7014133244213899,,,1595326978,2115,34094,36.17021276595745,0.5187519689350553,20.094562647754138,0.4836270858364511,58.53427895981087,0.7039745202571365,,,1595326978,20739,34094,23.93558030763296,0.52057551409311,8.370702541106127,0.4964400405306443,46.25584647282897,0.7122439640627156
1593929501,18624,103984,,40,50,1e-05,60,5,True,False,12.827534364261167,0.5140017492265603,4.166666666666666,0.4932801287739351,32.35609965635739,0.6757403382496728,,,1593929501,2115,103984,25.342789598108745,0.5181266364787965,12.15130023640662,0.4890718648576096,48.085106382978715,0.6691476811526189,,,1593929501,20739,103984,11.856887988813348,0.5217624339693672,3.6838806114084575,0.5013849971514871,30.941704035874444,0.6879324648283746
1596946785,18624,41035,1596987820.0,40,50,7e-05,17,17,True,False,36.554982817869416,0.5180736330467387,12.070446735395189,0.4968233147202141,56.47551546391753,0.6888568807370925,none,cityblock,1596946785,2115,41035,46.28841607565012,0.5181110734887515,23.87706855791962,0.4834776299707366,65.20094562647755,0.6992103470058367,none,cityblock,1596946785,20739,41035,34.480929649452726,0.5162486372080605,10.858768503785141,0.4929844378289808,54.737451178938244,0.6982605230135015
1596639464,18624,43930,1596683394.0,40,50,7e-05,17,17,True,False,15.764604810996563,0.5015579854235359,5.815077319587629,0.4901939653099442,28.463273195876287,0.5860208611879514,none,sqeuclidean,1596639464,2115,43930,18.486997635933804,0.5018282961979122,11.82033096926714,0.4841936053530855,34.37352245862884,0.5874948166256537,none,sqeuclidean,1596639464,20739,43930,14.706591446067796,0.5003017488853788,5.043637591012104,0.4877986215815371,26.73706543227735,0.5909319320946294
1596604622,18624,34771,1596639393.0,40,50,0.0001,17,17,False,False,8.489046391752577,0.5038897659224787,3.839132302405498,0.4937053393125759,17.9284793814433,0.5812665120300083,0.1,sqeuclidean,1596604622,2115,34771,13.286052009456265,0.5099823558649985,8.085106382978722,0.4944635050355651,29.598108747044915,0.5825736058838783,0.1,sqeuclidean,1596604622,20739,34771,7.888519215005544,0.5109780494009517,3.3318867833550314,0.5013446473958906,16.62568108394812,0.5860363691927538
1593245325,18624,103789,,40,50,5e-05,7,40,False,False,9.938788659793811,0.5051323281654841,3.1518470790378004,0.4889759660409925,27.598797250859107,0.6308219992132515,,,1593245325,2115,103789,21.040189125295512,0.5123648925637213,9.314420803782506,0.485866401077217,43.829787234042556,0.6450812363401329,,,1593245325,20739,103789,9.093977530257005,0.5106798619877865,2.864168957037465,0.494072479535889,25.96557211051641,0.6387626436649321
1593349242,18624,109164,,40,50,5e-05,7,40,True,False,1.6537800687285225,0.4944163481369287,0.6550687285223368,0.4925117409186112,2.937070446735395,0.50424128224396,,,1593349242,2115,109164,3.498817966903073,0.5017517844402465,2.789598108747045,0.5012808633442924,6.193853427895981,0.5031363957969324,,,1593349242,20739,109164,1.5285211437388495,0.4973074525520538,0.5641544915376826,0.4958827198983648,2.7098702926852787,0.5067244773211729
1594921222,18624,36412,1594957634.0,40,50,5.9999999999999995e-05,30,10,True,False,22.261597938144327,0.5130663837221539,7.1466924398625435,0.4941102476245845,43.916451890034374,0.6621237658414239,,,1594921222,2115,36412,35.886524822695044,0.5144108384531432,16.40661938534279,0.48271922446628795,60.66193853427897,0.6820859958379051,,,1594921222,20739,36412,20.989440185158397,0.5130493478649729,6.4612565697478175,0.4927285208222241,42.21997203336709,0.6705815983066497
1596024687,18624,33585,1596058272.0,40,50,8e-05,15,20,True,False,34.07431271477663,0.518381877570697,11.640893470790378,0.4971491904568841,55.278135738831615,0.6895821811637958,,,1596024687,2115,33585,44.86997635933806,0.5184800760289774,22.836879432624112,0.4836231988265597,66.09929078014184,0.7013196091474414,,,1596024687,20739,33585,32.12787501808187,0.516613633343598,10.4971310092097,0.4932213216734203,53.194464535416365,0.6994211297628339
1595360634,18624,37717,1595398351.0,40,50,5.9999999999999995e-05,18,16,True,False,30.900987972508588,0.5197960830390141,10.733462199312713,0.4977986980480456,52.958548109965626,0.6960339749801419,,,1595360634,2115,37717,42.080378250591025,0.5175542538816067,22.364066193853425,0.4815907153447063,64.86997635933807,0.7075005619103631,,,1595360634,20739,37717,28.988861565167078,0.5177301257012921,9.518298857225515,0.4935780321378228,51.75273639037562,0.7062805101559179
1595101976,18624,34010,1595135986.0,40,50,0.0001,25,12,False,False,16.639819587628864,0.5116861846245021,5.46069587628866,0.4948681528810644,36.657001718213046,0.6453812677530041,,,1595101976,2115,34010,31.016548463356976,0.5170813650442206,14.420803782505914,0.4880285403985173,53.995271867612296,0.6722896162332634,,,1595101976,20739,34010,15.670958098268962,0.5150598592335368,4.759149428612759,0.4973444469435385,35.15598630599354,0.6558865999313708
1595029898,18624,34158,1595064056.0,40,50,5.9999999999999995e-05,25,12,False,False,25.57452749140893,0.5236456514053327,9.584407216494846,0.5014109683905876,49.6778350515464,0.7056089611616937,,,1595029898,2115,34158,37.54137115839244,0.5216775075121681,21.418439716312054,0.4862243468259193,61.040189125295505,0.7121278560277837,,,1595029898,20739,34158,23.858430975456873,0.5238645424572126,8.69376536959352,0.4999472782088991,47.480592121124445,0.7155067252410573
1595432150,18624,37798,1595469948.0,40,50,8e-05,16,18,True,False,4.440506872852233,0.4939842303928994,1.9920532646048108,0.4901007380346432,7.533290378006872,0.5184376550376941,,,1595432150,2115,37798,5.626477541371158,0.5014167605819244,3.92434988179669,0.4994121737573168,8.463356973995271,0.5094601256203702,,,1595432150,20739,37798,4.059983605766913,0.4958672313344719,1.6972853078740535,0.4922181042083797,6.822894064323255,0.5198870399792676
1596183933,18624,37347,1596221280.0,40,50,7e-05,17,17,True,False,40.36726804123711,0.5179278434281523,13.208762886597938,0.4962665735131509,60.132087628865975,0.6927442281371488,soft,euclidean,1596183933,2115,37347,50.59101654846335,0.5169740792626522,26.52482269503546,0.4817472363974346,68.22695035460993,0.7057662215835073,soft,euclidean,1596183933,20739,37347,38.41072375717248,0.5152916667830781,12.035295819470562,0.4913208964338789,58.059694295771244,0.7026441652856156
1596337331,18624,36711,1596374042.0,40,50,7e-05,15,20,False,False,5.025773195876289,0.4932717341038538,2.1262886597938144,0.489147247222593,7.82323883161512,0.5186291293152336,soft,euclidean,1596337331,2115,36711,5.342789598108747,0.5025461882581913,4.160756501182034,0.5012644890729332,8.699763593380617,0.5070587684980475,soft,euclidean,1596337331,20739,36711,4.580741597955543,0.4960769718007984,1.8274748059212111,0.4926793277794029,7.261680891074787,0.5190679944694159
1594990440,18624,37081,1595027521.0,40,50,5e-05,16,18,True,False,3.726374570446736,0.4943092829590174,1.4765893470790377,0.491338996410071,5.589561855670104,0.5117779792353804,,,1594990440,2115,37081,3.735224586288416,0.5012987720798712,2.8368794326241136,0.4997991489583514,7.186761229314421,0.5083246358779296,,,1594990440,20739,37081,3.4186797820531365,0.495982877596054,1.3163604802545927,0.493333928016213,5.246154587974347,0.5132577144280239
1596604431,18624,34770,1596639201.0,40,50,0.0001,17,17,False,False,6.405713058419242,0.5066339658667779,3.087414089347079,0.4971093851853442,14.9108676975945,0.5796107574462839,soft,sqeuclidean,1596604431,2115,34770,10.543735224586287,0.5152783571669567,6.8557919621749415,0.5005950025448319,27.659574468085108,0.5891269174767441,soft,sqeuclidean,1596604431,20739,34770,5.935676744298183,0.5092673779217627,2.6809392931192444,0.4996129361269234,13.549351463426394,0.5837430319439099
1595883396,18624,35594,1595918990.0,40,50,5.9999999999999995e-05,15,20,True,False,4.483462199312715,0.4947847793819124,1.8094931271477663,0.4915843665640494,6.7064003436426125,0.514474785932733,,,1595883396,2115,35594,5.011820330969267,0.5032335372567408,3.9716312056737593,0.5020697337959023,7.9432624113475185,0.510427040067019,,,1595883396,20739,35594,4.117845604898982,0.4980121146615922,1.5767394763489078,0.4952541463243536,6.215343073436522,0.5182851538081991
1596797763,18624,39647,1596837410.0,40,50,7e-05,17,17,True,False,31.244630584192443,0.5169000963848295,10.59385738831615,0.4961500909107828,53.37199312714777,0.6832456303111965,0.5,cityblock,1596797763,2115,39647,42.080378250591025,0.5178362843491497,22.174940898345152,0.4840900691633183,63.97163120567376,0.6959489488416424,0.5,cityblock,1596797763,20739,39647,29.591590722792805,0.5160084711279419,9.585804522879599,0.4935327739524304,51.64183422537248,0.6923943775086691
1594132422,18624,-1,,40,50,0.0001,6,50,False,False,0.23625429553264604,0.5013693968372563,0.2255154639175257,0.4995476373614554,1.0577749140893469,0.5165742252342227,,,1594132422,2115,-1,1.6548463356973997,0.5073333364068517,1.5130023640661938,0.5043521609234309,6.57210401891253,0.5442147419124599,,,1594132422,20739,-1,0.24591349631129755,0.4945300564673857,0.22662616326727425,0.4916246224047173,1.0222286513332368,0.5101034653414686
1595171169,18624,33056,1595204225.0,40,50,0.0001,16,18,False,False,41.62908075601375,0.5196611478915708,13.616838487972508,0.4973100979545844,61.06636597938146,0.7005771551949672,,,1595171169,2115,33056,52.48226950354611,0.5195145011074834,27.28132387706856,0.4834521298452858,69.88179669030733,0.7114531218488901,,,1595171169,20739,33056,39.7511934037321,0.5174117667557385,12.271565649259848,0.4928186489148098,59.115675779931536,0.7102928321093326
1596375453,18624,35057,1596410510.0,40,50,7e-05,17,17,False,False,31.72787800687285,0.5192838005085822,10.835481099656358,0.4973847215224754,53.323668384879724,0.6957447088844286,none,euclidean,1596375453,2115,35057,42.45862884160756,0.518829796208828,22.5531914893617,0.4835808592722718,63.54609929078014,0.7043293974313383,none,euclidean,1596375453,20739,35057,29.871257051931142,0.5167333213674117,9.711172187665749,0.4925461692283406,51.598437726023434,0.7059873970455175
1595027778,18624,33864,1595061642.0,40,50,5e-05,16,18,False,False,5.643256013745703,0.4950726744241326,2.5236254295532645,0.4914051598913415,7.952104810996563,0.5179907940719107,,,1595027778,2115,33864,5.57919621749409,0.5021535707500676,4.208037825059101,0.5006487964336971,8.652482269503546,0.5062881038972809,,,1595027778,20739,33864,5.178648922320266,0.4968924886926574,2.1698249674526253,0.4935150326275961,7.430445055209991,0.5201516719134239
1594199191,18624,-1,,40,50,1e-05,6,50,False,False,1.9007731958762888,0.5011060018447138,0.7624570446735395,0.5001747873305193,3.173324742268041,0.5110926396094475,,,1594199191,2115,-1,2.9787234042553195,0.5005285507573609,2.364066193853428,0.4981091394900134,6.4302600472813225,0.5035825060454294,,,1594199191,20739,-1,1.7358599739621,0.5050100003752516,0.641303823713776,0.5047451345021848,2.8545252905154537,0.5119427597334499
1598176752,18624,25458,1598202210.0,40,50,7e-05,17,17,True,False,19.995704467353953,0.5116104400162571,5.847293814432991,0.4938218984023117,40.689432989690715,0.651290383426099,soft,euclidean,1598176752,2115,25458,34.1371158392435,0.5170860041069943,15.7919621749409,0.4867681065168098,57.730496453900706,0.6765423952894963,soft,euclidean,1598176752,20739,25458,18.872655383576838,0.5156568210885429,5.178648922320266,0.4970550728936662,38.98452191523217,0.6624557411585065
1596642538,18624,43609,1596686147.0,40,50,7e-05,17,17,True,False,6.427190721649484,0.5028003629577974,2.7437714776632296,0.4937527887451809,12.784579037800686,0.5717720698922112,1.0,sqeuclidean,1596642538,2115,43609,9.314420803782506,0.5062194510029117,5.7683215130023635,0.4926091356359938,23.92434988179669,0.5626784319623974,1.0,sqeuclidean,1596642538,20739,43609,5.92603307777617,0.5091757334070085,2.4157384637639234,0.5007810407380999,11.789382323159266,0.5746679816490302
1595602850,18624,32644,1595635494.0,40,50,9e-05,18,16,False,False,23.668384879725085,0.5095694320955846,7.656786941580758,0.4930034225944358,45.135309278350526,0.6395582759757404,,,1595602850,2115,32644,35.555555555555564,0.512668528643685,17.210401891252953,0.4831982278974907,60.094562647754145,0.6658697591717133,,,1595602850,20739,32644,22.334731664979024,0.5099877640112839,6.977192728675443,0.4920071451877551,42.91913785621293,0.6481685160905266
1593804603,18624,138656,,40,50,0.0001,5,60,True,False,0.5315721649484536,0.4959667861524876,0.4778780068728522,0.4942970027991925,1.814862542955327,0.504151017581793,,,1593804603,2115,138656,2.6004728132387704,0.5014357415870742,2.127659574468085,0.5006882126949174,5.673758865248227,0.5030241252535048,,,1593804603,20739,138656,0.4773614928395776,0.4981576718881181,0.3953903274024785,0.4967829666530499,1.6249578089589662,0.5069970277011698
1594113452,18624,79078,,40,50,1e-05,7,40,False,False,2.1316580756013748,0.4985695080423052,0.939647766323024,0.4969480054154788,3.4579037800687287,0.5064565291522316,,,1594113452,2115,79078,3.687943262411348,0.5021566638155246,2.8841607565011818,0.5020004582846977,6.950354609929079,0.5027905568618078,,,1594113452,20739,79078,1.9190896378803217,0.4972144186609427,0.7907806548049571,0.495282108083079,3.129369786392786,0.5093234326134393
1595536980,18624,33722,1595570702.0,40,50,7e-05,21,14,False,False,6.088917525773196,0.5015903976782395,2.6256443298969074,0.4928423406358303,9.428694158075599,0.5620987508553177,,,1595536980,2115,33722,6.052009456264774,0.5124486859322677,4.539007092198582,0.5025716330292468,14.515366430260045,0.5531891994070846,,,1595536980,20739,33722,5.631901248854816,0.5057572751614671,2.2855489657167656,0.4977264107149392,8.650368870244467,0.5677203818022284
1596872548,18624,41260,1596913808.0,40,50,0.0001,17,17,True,False,3.1088917525773194,0.4956293742766375,1.369201030927835,0.4927616852764776,5.439218213058419,0.5131095228274866,0.5,cityblock,1596872548,2115,41260,4.491725768321513,0.5025118802979706,3.309692671394799,0.5010945372650674,7.706855791962175,0.5090750677692983,0.5,cityblock,1596872548,20739,41260,2.7821977916003657,0.4977495311805736,1.1379526495973769,0.4952127553715278,5.043637591012104,0.5151066715103311
1595941978,18624,34191,1595976169.0,40,50,7e-05,15,20,False,False,35.115979381443296,0.517979002840874,11.780498281786942,0.4965352635338711,55.84192439862543,0.6909252977461875,,,1595941978,2115,34191,45.95744680851064,0.5175014700909736,24.01891252955083,0.4820312670544027,66.4775413711584,0.7019710140414391,,,1595941978,20739,34191,33.24171850137422,0.5165264628206067,10.646607840300883,0.4929988386145773,54.047929022614404,0.7009933641663816
1595288363,18624,38747,1595327110.0,40,50,9e-05,30,10,True,False,25.99871134020619,0.5095998517401955,7.796391752577318,0.4925875610721493,46.99312714776632,0.642066844360133,,,1595288363,2115,38747,38.959810874704495,0.512977294895254,18.865248226950353,0.4829730930496196,62.127659574468076,0.6683197014761262,,,1595288363,20739,38747,24.451516466560587,0.5103165959306029,7.179709725637688,0.4919605702950001,45.54703698346111,0.6512846198779292
1596485699,18624,40229,1596525928.0,40,50,7e-05,17,17,True,False,1.9598367697594499,0.5251148644440888,0.8054123711340205,0.5122265986800555,9.4823883161512,0.636605684425372,0.1,sqeuclidean,1596485699,2115,40229,10.070921985815604,0.5226355839521415,5.531914893617022,0.497049785637899,31.252955082742318,0.6635265918639578,0.1,sqeuclidean,1596485699,20739,40229,1.8708713052702641,0.5254368745869493,0.7136313226288634,0.5119706033058414,8.795023868074642,0.6435825144960491
1594957337,18624,32860,1594990197.0,40,50,5e-05,18,16,False,False,33.795103092783506,0.5196182642733723,10.765678694158078,0.4974933145105321,54.19351374570447,0.6982105975388488,,,1594957337,2115,32860,45.29550827423168,0.5188476197260535,22.93144208037825,0.4830806450939597,65.72104018912529,0.7092383312134766,,,1594957337,20739,32860,32.05554751916679,0.5191796442002721,9.783499686580836,0.4952245793704,52.398862047350406,0.7088322807389293
1596929673,18624,39432,1596969105.0,40,50,5.9999999999999995e-05,18,16,True,False,38.240979381443296,0.5189463167026627,12.12951030927835,0.4965185960131222,58.91323024054983,0.6999762632671673,soft,euclidean,1596929673,2115,39432,49.73995271867612,0.5196701650564989,25.768321513002363,0.4837361809747687,69.64539007092199,0.7135563133029365,soft,euclidean,1596929673,20739,39432,36.30840445537393,0.5186543899475371,11.09021650031342,0.4942612303382428,56.67100631660157,0.7104296787014194
1596485467,18624,40228,1596525695.0,40,50,7e-05,17,17,True,False,5.621778350515464,0.5047998795077729,2.459192439862543,0.4952519220117693,14.535008591065294,0.576511000298035,soft,sqeuclidean,1596485467,2115,40228,11.016548463356974,0.5006171947852777,7.328605200945627,0.4862058915022439,21.22931442080378,0.5715234040531987,soft,sqeuclidean,1596485467,20739,40228,5.130430589710208,0.5048399057605278,2.16500313419162,0.4945518381531226,13.361299966247168,0.5809146851722868
1595904737,18624,37373,1595942110.0,40,50,8e-05,15,20,True,False,4.950601374570447,0.4951915580480417,2.2873711340206184,0.4914019942153016,7.81786941580756,0.5196628837762054,,,1595904737,2115,37373,5.862884160756503,0.5017974942327682,3.8297872340425534,0.4999960909092173,9.267139479905437,0.5106793891016375,,,1595904737,20739,37373,4.566276098172525,0.4971482130528376,1.93355513766334,0.4938070945776651,7.353295723033898,0.5198617164428746
1594165757,18624,-1,,40,50,0.0001,5,60,False,False,0.467139175257732,0.5002661209840876,0.4080756013745705,0.4998242946908781,1.5410223367697595,0.5022100378938398,,,1594165757,2115,-1,2.789598108747045,0.5021259021151703,2.364066193853428,0.5021095964128025,5.342789598108747,0.5049561587453306,,,1594165757,20739,-1,0.4146776604465018,0.4939733098634565,0.35199382805342594,0.4921514456808016,1.3886879791696802,0.5032761026752969
1594118066,18624,92060,,40,50,1e-05,30,10,True,False,13.224871134020619,0.5189558763876665,4.64991408934708,0.497804516141819,33.40313573883161,0.6853338765270387,,,1594118066,2115,92060,25.626477541371155,0.5217856650350536,11.300236406619383,0.4906309422334247,51.01654846335697,0.6877900628530473,,,1594118066,20739,92060,12.339071314913928,0.5225186364305444,4.059983605766913,0.500996204308827,31.674622691547327,0.6968865497651863
1598163229,18624,13488,1598176717.0,40,50,7e-05,17,17,True,False,26.175902061855673,0.5180828934746714,6.888960481099657,0.4970730823015926,45.82796391752578,0.6848929259996328,soft,euclidean,1598163229,2115,13488,37.068557919621746,0.5166799040742628,16.6903073286052,0.4831074921911854,59.85815602836879,0.691668423069365,soft,euclidean,1598163229,20739,13488,24.56241863156372,0.5192646327153951,6.143015574521433,0.4971144175310176,43.912435507980135,0.6965199970576056
1594694844,18624,48869,,40,50,1e-05,6,50,True,False,1.336984536082474,0.4958221886628062,0.7463487972508591,0.4940222141497339,2.566580756013745,0.504819552769108,,,1594694844,2115,48869,1.8912529550827424,0.4989103037886806,1.2293144208037825,0.4974920335864563,6.288416075650117,0.5049467684238697,,,1594694844,20739,48869,1.190992815468441,0.4924813688870819,0.5352234919716476,0.4897546241458477,2.3385891315878298,0.5063173257410035
1594695178,18624,48579,,40,50,1e-05,5,60,True,False,2.2068298969072164,0.4971282770970115,0.8805841924398625,0.4948895002437694,3.51159793814433,0.507256606519369,,,1594695178,2115,48579,3.356973995271868,0.5022083528521732,2.6477541371158386,0.5012835368776677,6.8557919621749415,0.5047530028362971,,,1594695178,20739,48579,2.0107044698394327,0.4991199027945004,0.7522059887169101,0.4973864968067922,3.1245479531317804,0.5103246914639719
1593581711,18624,114449,,40,50,0.0001,6,50,True,False,0.7839347079037801,0.4970090870127848,0.4993556701030927,0.4958238674786378,2.179982817869416,0.5027305030141989,,,1593581711,2115,114449,2.8841607565011818,0.4989778019324264,2.5059101654846336,0.4978091891587379,5.721040189125294,0.5022089058298588,,,1593581711,20739,114449,0.7232749891508752,0.4949457613922825,0.4146776604465018,0.4932683172423031,1.8419403057042287,0.5041555432358303
1596683840,18624,34945,1596718785.0,40,50,7e-05,17,17,False,False,9.278350515463918,0.5212681971915002,3.5062285223367704,0.5003536073265821,30.482173539518904,0.6907440916116367,0.2,sqeuclidean,1596683840,2115,34945,20.99290780141844,0.5199517379192904,9.456264775413713,0.4866308400262527,51.58392434988179,0.6986408307884628,0.2,sqeuclidean,1596683840,20739,34945,8.505713872414294,0.5275907973579557,3.057042287477699,0.5068084984960579,28.81045373450986,0.7025236825734945
1596302071,18624,35001,1596337072.0,40,50,7e-05,18,16,True,False,18.75536941580756,0.5100919800867716,5.739905498281788,0.49407427676773796,38.96585051546392,0.6356789814376342,soft,euclidean,1596302071,2115,35001,30.8274231678487,0.5142340045082717,14.231678486997636,0.4861423676081463,56.406619385342786,0.6610192317020052,soft,euclidean,1596302071,20739,35001,17.541829403539225,0.5112589575136297,5.096677756883167,0.494002653656802,37.022035778002795,0.6451443964475433
1595061900,18624,36875,1595098775.0,40,50,0.0001,18,16,True,False,6.384235395189003,0.5038301524245251,2.8618986254295535,0.4912000009405802,11.227448453608249,0.5962890860442208,,,1595061900,2115,36875,7.470449172576831,0.5114735098882531,5.106382978723404,0.4933541252472036,20.803782505910164,0.6031011000846879,,,1595061900,20739,36875,5.863349245383095,0.5082143920170896,2.463956796373981,0.4957806692423829,10.636964173778873,0.6033250551082382
1596450802,18624,34647,1596485449.0,40,50,0.0001,17,17,False,False,2.8243127147766325,0.4924067033774677,1.1490549828178696,0.4887499801433177,5.729166666666666,0.5130096522765264,0.2,euclidean,1596450802,2115,34647,4.0661938534278965,0.5030019392322727,2.789598108747045,0.5018179094343092,7.754137115839244,0.5069819773620212,0.2,euclidean,1596450802,20739,34647,2.5411061285500747,0.4982720150716106,0.9740103187231786,0.4959195446576699,5.284729254062395,0.5159088166941853
1595071590,18624,35885,1595107475.0,40,50,8e-05,30,10,False,False,24.61877147766323,0.5185881824432591,8.102448453608249,0.4962091223306335,49.61877147766323,0.6976101214867518,,,1595071590,2115,35885,39.290780141843975,0.5187495044613155,19.196217494089836,0.4825412025352581,63.92434988179669,0.7146933906963738,,,1595071590,20739,35885,23.08693765369593,0.5183322871685501,7.319542890206858,0.4943854917100116,47.28289695742321,0.7074119743451304
1596256485,18624,43541,1596300026.0,40,50,0.0001,17,17,True,False,9.772336769759448,0.5054828480853382,3.763960481099656,0.4912494834470641,24.634879725085913,0.6148679939780399,soft,euclidean,1596256485,2115,43541,17.872340425531913,0.5097914442715832,8.936170212765957,0.4856167345461044,41.6548463356974,0.6344235648170766,soft,euclidean,1596256485,20739,43541,9.084333863734992,0.5086564781066809,3.327064950094026,0.4937310835066674,23.651092145233623,0.6231566656744009
1596300288,18624,35012,1596335300.0,40,50,0.0001,17,17,False,False,8.548109965635739,0.5083638566226274,3.4364261168384886,0.4923586739712278,24.693943298969074,0.6315908158107972,soft,euclidean,1596300288,2115,35012,19.38534278959811,0.5125678462150202,10.16548463356974,0.4864746579544805,42.97872340425533,0.6458702704565661,soft,euclidean,1596300288,20739,35012,7.970490380442644,0.5134098317274289,3.0184676213896524,0.4971210232927327,23.077293987173924,0.6404436097305466
1596869949,18624,41185,1596911134.0,40,50,0.0001,17,17,True,False,4.338487972508592,0.5012929523786761,2.083333333333333,0.4934103763542913,8.22057560137457,0.5630662871626606,0.1,cityblock,1596869949,2115,41185,6.0992907801418434,0.518981531786303,4.113475177304964,0.5115591576804386,15.035460992907801,0.5529764388655739,0.1,cityblock,1596869949,20739,41185,3.9056849414147257,0.5071061193791717,1.7647909735281353,0.4999348609843094,7.912628381310574,0.5695882089532133
1594920854,18624,36249,1594957103.0,40,50,5e-05,18,16,True,False,2.4323453608247423,0.4946006100322513,1.095360824742268,0.4914566420544914,5.127792096219932,0.5135078922682508,,,1594920854,2115,36249,4.208037825059101,0.5019127386580993,2.9314420803782517,0.5006743901442243,7.706855791962175,0.5051098481728915,,,1594920854,20739,36249,2.2180433000626842,0.4990529617228772,0.9691884854621728,0.4967724987515128,4.6434254303486195,0.5156989629737969
1596911583,18624,34940,1596946523.0,40,50,0.0001,17,17,False,False,16.03307560137457,0.5080002324285157,5.970790378006872,0.4920363744894832,34.664948453608254,0.6315654172567093,soft,cityblock,1596911583,2115,34940,27.23404255319149,0.5120898940962171,13.664302600472816,0.4849448420985472,50.30732860520094,0.6502645494546069,soft,cityblock,1596911583,20739,34940,15.010366941511164,0.5083356029783883,5.178648922320266,0.4910795858214953,33.352620666377355,0.6400989776887125
1595668008,18624,32967,1595700975.0,40,50,9e-05,16,18,False,False,3.2860824742268044,0.4986654036306586,1.3208762886597938,0.4962219239918307,5.219072164948454,0.5135139657663579,,,1595668008,2115,32967,4.3971631205673765,0.5038177150960041,3.120567375886525,0.5032891988342367,7.612293144208037,0.5117988842443658,,,1595668008,20739,32967,2.9943584550846234,0.496112676394613,1.1620618159024059,0.4933490794704972,4.6482472636096235,0.5140123195178284
1596890418,18624,39003,1596929421.0,40,50,8e-05,25,12,True,False,39.76589347079037,0.519340951873825,12.006013745704466,0.4969211854159102,60.68513745704467,0.7005574304697344,soft,euclidean,1596890418,2115,39003,52.24586288416076,0.5197768281812549,25.815602836879428,0.4834855114649877,70.16548463356975,0.7145946458022792,soft,euclidean,1596890418,20739,39003,37.80317276628574,0.5182140294046719,10.969670668788273,0.4937983115765511,59.130141279714536,0.7094653395876755
1593585268,18624,110346,,40,50,0.0001,30,10,False,False,23.528780068728523,0.5241243342530605,8.268900343642613,0.5021617322472798,47.90592783505154,0.7044872675692241,,,1593585268,2115,110346,36.35933806146572,0.5190380310904855,19.810874704491727,0.4828456398507737,60.7565011820331,0.7160494764534957,,,1593585268,20739,110346,22.040599836057673,0.5212855782819762,7.5172380539080965,0.4970556718266845,46.00028930999567,0.7144741862628492
1596379176,18624,34938,1596414114.0,40,50,7e-05,17,17,False,False,3.5545532646048112,0.4964988670016735,1.5625,0.49347597293625706,6.3573883161512015,0.5154968143624655,1.0,euclidean,1596379176,2115,34938,4.775413711583925,0.5020372288664686,3.8297872340425534,0.5006160222941015,7.990543735224588,0.5057084079066418,1.0,euclidean,1596379176,20739,34938,3.254737451178938,0.4981659737621818,1.345291479820628,0.4953800480596405,5.858527412122089,0.5177265392983366
1595361718,18624,37764,1595399482.0,40,50,9e-05,25,12,True,False,11.109321305841922,0.5124528700486516,4.0270618556701026,0.4952993117477038,30.573453608247426,0.6457372436978777,,,1595361718,2115,37764,23.451536643026014,0.517250367228875,10.591016548463354,0.4887256878998145,51.725768321513,0.6685063313816014,,,1595361718,20739,37764,10.342832344857515,0.5177366617348939,3.5922657794493467,0.5004237954951359,28.94546506581802,0.6570322248691056
1595942353,18624,34188,1595976541.0,40,50,8e-05,15,20,False,False,11.146907216494846,0.5098552945455446,3.3666237113402064,0.4932019684728395,29.601589347079038,0.6392118796077246,,,1595942353,2115,34188,23.26241134751773,0.5138732473929402,9.456264775413713,0.4870324483873252,46.4775413711584,0.6496535662424635,,,1595942353,20739,34188,10.31390134529148,0.5163065633559143,2.9606056222575825,0.4996532378927181,27.96181108057284,0.6499109959549072
1596746123,18624,37739,1596783862.0,40,50,8e-05,15,20,True,False,7.7856529209622005,0.5017082159039248,3.565292096219931,0.4906993101346746,19.056056701030926,0.5823890224821889,soft,euclidean,1596746123,2115,37739,13.238770685579196,0.5057872740694801,8.84160756501182,0.4863760060927848,31.77304964539007,0.6000663226989437,soft,euclidean,1596746123,20739,37739,7.1363132262886335,0.5034882976165612,3.20651911856888,0.4916835045037273,17.82631756593857,0.5911387894385189
1597020996,18624,37806,1597058802.0,40,50,0.0001,17,17,True,False,2.9209621993127146,0.4970720937880061,1.3530927835051547,0.4944593874389081,5.594931271477663,0.5124228856070512,0.2,cityblock,1597020996,2115,37806,4.491725768321513,0.5029098539396699,3.309692671394799,0.5023470357906094,7.5650118203309695,0.512332039754956,0.2,cityblock,1597020996,20739,37806,2.647186460292203,0.4995414315830665,1.1813491489464294,0.4973219350156131,4.971310092097014,0.5157845696605091
1593242622,18624,113123,,40,50,5e-05,30,10,True,False,4.762671821305842,0.4917811322136669,2.029639175257732,0.4859292225242713,9.208548109965637,0.531267347806359,,,1593242622,2115,113123,7.612293144208037,0.5008509197108217,5.390070921985815,0.4963545387889087,12.15130023640662,0.5221424807864706,,,1593242622,20739,113123,4.426442933603356,0.4960269112015824,1.8226529726602052,0.4905356866636195,8.968609865470851,0.531461596599917
1593470584,18624,111015,,40,50,0.0001,6,50,False,False,0.8322594501718213,0.4986077653271933,0.4510309278350515,0.4976683509370894,2.2121993127147768,0.5031537084431661,,,1593470584,2115,111015,2.8841607565011818,0.5010356625968968,2.5059101654846336,0.5005598698019761,5.7683215130023635,0.5059985237907315,,,1593470584,20739,111015,0.7907806548049571,0.49605340109220797,0.4002121606634842,0.4944605949690827,2.0010608033174213,0.5050944435807186
1596989989,18624,32974,1597022963.0,40,50,7e-05,17,17,False,False,4.644544673539519,0.4952589308514484,1.9813144329896903,0.4921107969101367,7.050042955326459,0.5150299483154931,1.0,cityblock,1596989989,2115,32974,5.4373522458628845,0.5017431677843369,4.0661938534278965,0.4999615385908301,8.368794326241135,0.5092765004428146,1.0,cityblock,1596989989,20739,32974,4.272144269251169,0.4986002091154833,1.6972853078740535,0.4959903599763634,6.538405901923912,0.5180304568113284
1595102546,18624,33986,1595136532.0,40,50,7e-05,30,10,False,False,7.001718213058419,0.4976863376697734,2.770618556701031,0.4932176522933878,11.05025773195876,0.5298256713237448,,,1595102546,2115,33986,8.274231678486997,0.5017931903650669,5.673758865248227,0.4981864891515573,11.205673758865249,0.5175335955479641,,,1595102546,20739,33986,6.562515068228941,0.4957428868734951,2.449491296590964,0.4907114097225148,10.386228844206569,0.528756733536296
1596260525,18624,43272,1596303797.0,40,50,0.0001,17,17,True,False,20.77963917525773,0.5155036041714312,7.463487972508592,0.4947708778222484,45.38230240549829,0.6787120351685769,0.5,euclidean,1596260525,2115,43272,33.56973995271868,0.5155344575455568,17.257683215130022,0.483047007555356,61.087470449172585,0.687652860065797,0.5,euclidean,1596260525,20739,43272,19.513959207290608,0.5178386922102416,6.726457399103139,0.4963042755406201,43.54597618014369,0.6882541562397327
1595287977,18624,38738,1595326715.0,40,50,8e-05,21,14,True,False,28.0713058419244,0.5222612485514869,9.149484536082475,0.5000800644517939,52.43234536082474,0.7036761078089285,,,1595287977,2115,38738,42.174940898345156,0.5194055873470544,20.94562647754137,0.4837833484267983,63.97163120567376,0.7157771921206849,,,1595287977,20739,38738,26.41882443705097,0.5200900088579097,8.279087709147017,0.4958079761417524,50.71122040599836,0.7136597493083103
1596683659,18624,34960,1596718619.0,40,50,7e-05,17,17,False,False,6.5506872852233675,0.5020768797707764,2.808204467353952,0.4933451968990849,14.7766323024055,0.5662621798224818,none,sqeuclidean,1596683659,2115,34960,11.15839243498818,0.5074896895308018,6.4775413711583925,0.4960469104915979,23.971631205673763,0.5656641211912176,none,sqeuclidean,1596683659,20739,34960,6.094797241911374,0.5030804921952186,2.430203963546941,0.4939877249539002,13.78562129321568,0.5696773170800917
1596339342,18624,39579,1596378921.0,40,50,7e-05,17,17,True,False,30.299613402061855,0.5176002749478607,10.620704467353953,0.4960322876002698,52.74377147766322,0.689551711218801,1.0,euclidean,1596339342,2115,39579,43.07328605200946,0.5160766084457221,22.127659574468087,0.4810943797977655,64.9645390070922,0.6998144460232995,1.0,euclidean,1596339342,20739,39579,28.69955156950673,0.5164763090273481,9.580982689618594,0.4929514563424597,50.87998457013357,0.7000309476814349
1596854477,18624,35681,1596890158.0,40,50,9e-05,15,20,False,False,5.589561855670104,0.4963605043859412,2.33569587628866,0.4919811820626716,9.2676116838488,0.5266312878143535,soft,euclidean,1596854477,2115,35681,7.139479905437352,0.5038192285239428,4.633569739952718,0.5011553576526316,10.44917257683215,0.5190630436091864,soft,euclidean,1596854477,20739,35681,5.106321423405179,0.4975236365275011,2.0299918028834565,0.4934284989585158,8.799845701335649,0.5266405330558418
1596335814,18624,39624,1596375438.0,40,50,7e-05,17,17,True,False,35.66365979381443,0.5183484505292817,11.694587628865982,0.4963332470618499,56.051331615120276,0.6953218709647775,0.2,euclidean,1596335814,2115,39624,47.18676122931442,0.5178031515000718,24.208037825059098,0.4821080315286885,66.71394799054373,0.707524372301622,0.2,euclidean,1596335814,20739,39624,33.75283282704084,0.5171662167043924,10.56945850812479,0.493145031952824,54.44814118327789,0.7050007832249455
1596639649,18624,43929,1596683578.0,40,50,7e-05,17,17,True,False,7.527920962199312,0.5012630434923099,3.2753436426116838,0.4912647947383041,14.07860824742268,0.5737297451669516,0.2,sqeuclidean,1596639649,2115,43929,10.591016548463354,0.5101800684962801,7.186761229314421,0.4964307160561143,21.56028368794326,0.5757324374199806,0.2,sqeuclidean,1596639649,20739,43929,7.083273060417571,0.5068879935961456,2.936496455952553,0.4973992726479001,13.34683446646415,0.5788792832761822
1593132703,18624,111572,,40,50,5e-05,6,50,True,False,0.3382731958762887,0.5044671615675703,0.3167955326460481,0.504823076064993,0.8215206185567011,0.5054068073944816,,,1593132703,2115,111572,1.7966903073286054,0.5021573461117775,1.6075650118203308,0.5021325902760457,5.106382978723404,0.5106064839929133,,,1593132703,20739,111572,0.2796663291383384,0.4990529980821667,0.25073532957230343,0.4985179599884241,0.7329186556728868,0.5026791729297783
1595570961,18624,32567,1595603528.0,40,50,7e-05,18,16,True,False,40.18470790378007,0.5185964554652414,12.929553264604811,0.4968095963481802,59.49312714776632,0.694539910708851,,,1595570961,2115,32567,50.0709219858156,0.5191301981649868,25.72104018912529,0.48375164208718896,70.0709219858156,0.7073750193918666,,,1595570961,20739,32567,38.16481026086118,0.5177040390233403,11.659192825112108,0.4938779461615794,57.32677564009837,0.7047574740023412
1596914043,18624,34942,1596948985.0,40,50,0.0001,17,17,False,False,3.731743986254296,0.498828053662709,1.761168384879725,0.4907655713411766,7.978951890034363,0.5580649664453571,0.5,cityblock,1596914043,2115,34942,5.957446808510639,0.5017751520296982,3.9716312056737593,0.48869827351943,16.832151300236404,0.5597571978650949,0.5,cityblock,1596914043,20739,34942,3.3656396161820723,0.504419920710747,1.4803028111287913,0.4965041432191596,7.560634553257147,0.5629921280920478
1598208605,18624,16618,1598225223.0,40,50,7e-05,16,18,True,False,4.821735395189004,0.4940188470218063,1.986683848797251,0.4904852360242513,7.082259450171821,0.5152161989367112,soft,euclidean,1598208605,2115,16618,5.153664302600473,0.5018288402671479,4.4444444444444455,0.5003345701017362,7.754137115839244,0.5048518352042759,soft,euclidean,1598208605,20739,16618,4.455373933169391,0.4970882804521505,1.7358599739621,0.4940774937577722,6.5576932349679335,0.5177190919457438
1596187834,18624,37453,1596225287.0,40,50,7e-05,17,17,True,False,3.849871134020619,0.4923395344713766,1.6376718213058419,0.4887953086272435,6.217783505154638,0.5125516953439748,0.5,euclidean,1596187834,2115,37453,4.869976359338062,0.5017871577975449,3.498817966903073,0.5004944864499619,8.037825059101655,0.5079119494005568,0.5,euclidean,1596187834,20739,37453,3.491007280968224,0.498148213324141,1.4272626452577268,0.4956760809129297,5.77655624668499,0.5154818681365122
1594991833,18624,37229,1595029062.0,40,50,5e-05,21,14,True,False,12.081185567010307,0.5100719100119797,3.694158075601375,0.4936045173310354,30.981529209621996,0.6387931161109796,,,1594991833,2115,37229,24.633569739952716,0.516456578435854,10.92198581560284,0.4893261199500495,49.12529550827423,0.6583994632252574,,,1594991833,20739,37229,11.210762331838568,0.5136271538383989,3.254737451178938,0.4965462299600576,29.57712522300979,0.6482194657683156
1595399328,18624,32565,1595431893.0,40,50,8e-05,18,16,False,False,10.996563573883162,0.508356549345063,4.166666666666666,0.4924980785994543,27.883376288659797,0.6301197613779019,,,1595399328,2115,32565,21.84397163120568,0.5131635649031077,10.969267139479904,0.4868831501549869,44.63356973995272,0.6468289383027888,,,1595399328,20739,32565,10.169246347461305,0.5105050046401854,3.688702444669463,0.4938537621892457,26.356140604657888,0.6398578714753176
1596946541,18624,40996,1596987537.0,40,50,7e-05,17,17,True,False,3.6136168384879728,0.4955698253568297,1.406786941580756,0.4927438243866649,6.201675257731958,0.5129688705219938,0.2,cityblock,1596946541,2115,40996,5.011820330969267,0.5019609893884397,3.8297872340425534,0.5006623742991885,7.801418439716313,0.5067828168226449,0.2,cityblock,1596946541,20739,40996,3.327064950094026,0.4982445472206093,1.2102801485124646,0.4958150659186962,5.728337914074931,0.5156785449700653
1596184224,18624,37297,1596221521.0,40,50,7e-05,17,17,True,False,5.337199312714778,0.4971823510304894,2.3786512027491407,0.49344426272246794,8.446091065292096,0.5229911120961986,0.1,euclidean,1596184224,2115,37297,6.4775413711583925,0.5017836874028219,4.491725768321513,0.4991801742458508,9.739952718676124,0.5146818441436694,0.1,euclidean,1596184224,20739,37297,4.923091759486957,0.4964627631966967,2.04927913592748,0.4926061806460639,8.187472877187908,0.5232103474777895
1595107729,18624,35200,1595142929.0,40,50,8e-05,25,12,True,False,31.679553264604806,0.5223863424637933,9.960266323024054,0.4998527783596065,53.0176116838488,0.7057461685895063,,,1595107729,2115,35200,43.356973995271865,0.518537845847443,23.026004728132392,0.4824103528190475,63.877068557919635,0.7132362900978644,,,1595107729,20739,35200,29.890544384975165,0.5199677175059982,9.060224697429963,0.4952891697862513,51.33323689666811,0.7147623855800128
1597061142,18624,32881,1597094023.0,40,50,0.0001,17,17,False,False,8.17225085910653,0.5072938084242686,3.2699742268041234,0.4936690331114438,24.301975945017187,0.6131624789930643,1.0,cityblock,1597061142,2115,32881,17.02127659574468,0.5076602983685881,8.226950354609928,0.4842568582668941,40.52009456264775,0.6252569468806529,1.0,cityblock,1597061142,20739,32881,7.5172380539080965,0.5094440197236503,2.8545252905154537,0.4950182913948329,22.749409325425525,0.6201134217257412
1596526192,18624,34867,1596561059.0,40,50,7e-05,17,17,False,False,13.772551546391751,0.5006763874295785,5.46069587628866,0.4880272916972225,30.015034364261176,0.5935973383524386,0.1,sqeuclidean,1596526192,2115,34867,19.905437352245862,0.5042506797927575,9.976359338061462,0.4846320584430036,40.803782505910156,0.6034013170155468,0.1,sqeuclidean,1596526192,20739,34867,12.869472973624573,0.5022017268489856,4.739862095568736,0.4889234016844219,28.111287911664014,0.6002651018609193
1596718871,18624,40854,1596759725.0,40,50,0.0001,17,17,True,False,4.66602233676976,0.5059796761826201,2.33569587628866,0.4930791117543705,14.400773195876287,0.6058886138783329,none,sqeuclidean,1596718871,2115,40854,10.8274231678487,0.511154226368361,6.4775413711583925,0.4917625738997536,29.12529550827423,0.6083098309230415,none,sqeuclidean,1596718871,20739,40854,4.330006268383239,0.5077597998776986,2.0155263031004385,0.4948619720460699,13.34683446646415,0.6100901140467225
1593462661,18624,122490,,40,50,0.0001,60,5,True,False,12.48926116838488,0.5078344400495455,4.832474226804124,0.4926312299864525,34.4286941580756,0.6259496123554578,,,1593462661,2115,122490,25.579196217494093,0.5120290138703938,13.286052009456265,0.4850682746924985,54.46808510638298,0.6536194265850717,,,1593462661,20739,122490,11.615796325763053,0.5105852322786593,4.301075268817205,0.4945814068219732,33.179034668981146,0.6352048878584383
1593244389,18624,108803,,40,50,5e-05,5,60,False,False,0.8698453608247423,0.4945279665280387,0.5798969072164949,0.4928413000613657,2.158505154639175,0.5025305111284849,,,1593244389,2115,108803,2.6477541371158386,0.5013708534039081,2.2222222222222223,0.5009406305350125,5.7683215130023635,0.5037024305537179,,,1593244389,20739,108803,0.7666714884999277,0.4972274134104663,0.5014706591446069,0.495983361807673,1.9239114711413283,0.505093061952145
1596561093,18624,43078,1596604171.0,40,50,0.0001,17,17,True,False,7.935996563573883,0.5034071420841341,3.3881013745704465,0.4953964372259287,15.7055412371134,0.5671892643990771,soft,sqeuclidean,1596561093,2115,43078,11.536643026004727,0.5104405734816915,7.328605200945627,0.5001760756955844,23.687943262411352,0.5539525358832087,soft,sqeuclidean,1596561093,20739,43078,7.425623221948985,0.5052224294563425,2.9847147885626115,0.496872099669196,14.735522445633832,0.5684364679747965
1594192645,18624,59528,,40,50,1e-05,7,40,True,False,17.719072164948454,0.51783809953242,5.696950171821307,0.4971382759321524,39.71219931271477,0.6824004377163722,,,1594192645,2115,59528,32.104018912529554,0.5192900570208451,15.319148936170214,0.485889720181641,56.973995271867615,0.6937741031554148,,,1594192645,20739,59528,16.60157191764309,0.5201771883996671,4.932735426008969,0.4983530417494084,37.64887410193356,0.6946417039553832
1598149283,18624,20327,1598169610.0,40,50,8e-05,15,20,True,False,32.640678694158076,0.5172227634417629,9.600515463917525,0.495993265530217,52.700816151202744,0.688005833110048,soft,euclidean,1598149283,2115,20327,43.877068557919614,0.5161121235873509,21.182033096926716,0.481987658977221,64.01891252955083,0.6966737268296443,soft,euclidean,1598149283,20739,20327,30.994744201745505,0.5174105523357424,8.684121703071508,0.4945223393553152,50.86551907035055,0.6986914025954964
1594232848,18624,-1,,40,50,1e-05,5,60,False,False,1.5410223367697595,0.4998663285436514,0.6926546391752577,0.4987750908339432,2.7867268041237114,0.5052347304895752,,,1594232848,2115,-1,2.9787234042553195,0.5041242849790724,2.458628841607565,0.5050526292112437,5.7683215130023635,0.5019773099742489,,,1594232848,20739,-1,1.4320844785187328,0.5018633649834386,0.6171946574087468,0.5012393909098429,2.381985630936882,0.50867403749006
1595635727,18624,32043,1595667770.0,40,50,9e-05,16,18,True,False,3.88208762886598,0.4938548947377608,1.7719072164948453,0.4900646414529877,6.62585910652921,0.516719417965486,,,1595635727,2115,32043,5.059101654846336,0.5009764637277774,3.687943262411348,0.4992599439780712,7.84869976359338,0.5071328391962776,,,1595635727,20739,32043,3.5247601137952653,0.4953319565358931,1.5381648102608612,0.4919813960339752,6.056222575823328,0.5171999666297153
1593695731,18624,117325,,40,50,0.0001,30,10,True,False,32.339991408934715,0.5101885804973341,9.203178694158076,0.4933065864845325,53.125,0.6428417915066083,,,1593695731,2115,117325,45.200945626477534,0.513165221730687,20.803782505910164,0.4829014739840741,67.04491725768321,0.6712576693274619,,,1593695731,20739,117325,30.584888374560013,0.5100511367548891,8.332127875018081,0.4915091891613011,51.06321423405179,0.6520617119583977
1595326272,18624,34110,1595360382.0,40,50,5.9999999999999995e-05,21,14,False,False,33.682345360824755,0.5196876808162958,10.991194158075599,0.4978907200880422,55.417740549828174,0.6956654239510967,,,1595326272,2115,34110,44.255319148936174,0.5179704557574775,23.87706855791962,0.4821648033829582,64.91725768321514,0.7062311234091616,,,1595326272,20739,34110,31.84338685568253,0.5181244252389834,9.865470852017935,0.4941807674768591,53.18964270215536,0.7057662119863135
1595636690,18624,32305,1595668995.0,40,50,7e-05,16,18,True,False,40.29209621993128,0.5190491595103015,12.784579037800686,0.4966318542754987,60.405927835051536,0.6995569801887448,,,1595636690,2115,32305,51.725768321513,0.5207996207919791,26.19385342789598,0.4850119350800925,70.11820330969267,0.7156555596848089,,,1595636690,20739,32305,38.30464342543035,0.5186036448156338,11.529003327064949,0.4943492546050727,58.469550122956754,0.7098716870643801
1596759993,18624,34852,1596794845.0,40,50,0.0001,17,17,False,False,11.603307560137456,0.5015084012781044,5.004295532646048,0.4912403434722872,22.052190721649485,0.5776409574130165,none,sqeuclidean,1596759993,2115,34852,15.035460992907801,0.5002759075878312,9.219858156028367,0.48319882985425705,27.23404255319149,0.5761801396931687,none,sqeuclidean,1596759993,20739,34852,10.762331838565023,0.4995466612288423,4.3878682675153104,0.4881815334108718,20.825497854284198,0.5810141302348313
1596835082,18624,34638,1596869720.0,40,50,7e-05,17,17,False,False,7.758805841924398,0.4953640519035148,3.565292096219931,0.4907094269707781,10.502577319587632,0.5278880276483271,soft,cityblock,1596835082,2115,34638,7.5650118203309695,0.4989867753813795,5.91016548463357,0.4944906647189152,11.016548463356974,0.5186592707206059,soft,cityblock,1596835082,20739,34638,7.198997058681711,0.4955850271540903,3.0763296205217223,0.4907594879871804,9.995660350065094,0.5282514606652362
1596335566,18624,39627,1596375193.0,40,50,7e-05,17,17,True,False,24.312714776632298,0.5228070622844283,8.344072164948454,0.5004662782361483,49.280498281786954,0.7036324455666169,none,euclidean,1596335566,2115,39627,38.817966903073284,0.5184709500330072,19.29078014184397,0.4822293871099672,62.695035460992905,0.7141101891898287,none,euclidean,1596335566,20739,39627,22.855489657167656,0.5208312875464775,7.531703553691112,0.4966087608098729,47.340758956555284,0.7142165183019343
1595399723,18624,34085,1595433808.0,40,50,9e-05,25,12,False,False,24.887242268041238,0.5193786991306507,8.338702749140891,0.4966100556411892,49.994630584192436,0.7010016814080741,,,1595399723,2115,34085,37.54137115839244,0.5183689478230901,18.865248226950353,0.4820175965015335,63.68794326241136,0.7160239122108599,,,1595399723,20739,34085,23.410000482183328,0.5184466093955955,7.5365253869521185,0.4940568652572154,47.475770287863455,0.7111226266448719
1596561322,18624,43042,1596604364.0,40,50,0.0001,17,17,True,False,14.631658075601376,0.4988951093916766,5.7935996563573875,0.4891718045324634,24.688573883161517,0.5696515404994631,0.1,sqeuclidean,1596561322,2115,43042,17.777777777777782,0.4984595689979192,11.016548463356974,0.4846200967965193,25.579196217494093,0.566980970537615,0.1,sqeuclidean,1596561322,20739,43042,13.660253628429528,0.4980920782831511,5.222045421669318,0.4876118776374941,23.207483485221086,0.5728560002109115
1593355864,18624,106678,,40,50,0.0001,60,5,False,False,14.153780068728526,0.5049197619325146,5.4714347079037795,0.4885872438012329,35.368341924398635,0.6328982696730799,,,1593355864,2115,106678,26.004728132387704,0.5134148891081148,11.631205673758865,0.4853016586172509,52.95508274231678,0.662163503822412,,,1593355864,20739,106678,13.178070302328944,0.5079285810199103,4.9038044264429335,0.4904921903907981,33.84926949226096,0.6403062045152397
1595029308,18624,34115,1595063423.0,40,50,5e-05,21,14,False,False,30.32109106529209,0.5212978172045702,9.874355670103093,0.4990698594962006,51.69673539518901,0.7012660073968763,,,1595029308,2115,34115,40.803782505910156,0.5195397152145976,21.607565011820327,0.483228070814348,62.78959810874704,0.7093669003283638,,,1595029308,20739,34115,28.43917257341241,0.5204261303950178,8.785380201552629,0.4960707838225624,49.69863542118714,0.7124444500801569
1598148899,18624,14084,1598162983.0,40,50,8e-05,15,20,True,False,5.041881443298968,0.4915339396451637,2.0457474226804124,0.4874691759716085,6.786941580756014,0.5152569544693462,soft,euclidean,1598148899,2115,14084,5.059101654846336,0.5030945010233144,3.7825059101654848,0.5021668470271773,7.8959810874704495,0.5081768640586299,soft,euclidean,1598148899,20739,14084,4.65306909687063,0.496186327023964,1.774434640050147,0.49291613201183604,6.4275037369207775,0.5175787484997119
1596869960,18624,41368,1596911328.0,40,50,0.0001,17,17,True,False,25.52083333333333,0.5216519554166527,8.671606529209622,0.4988450981342554,50.27920962199313,0.7078911846480476,soft,cityblock,1596869960,2115,41368,39.101654846335705,0.5194848932651421,20.61465721040189,0.4836126935838001,63.40425531914894,0.7159957893571138,soft,cityblock,1596869960,20739,41368,23.858430975456873,0.519954393063278,7.796904383046434,0.4950341862961246,48.290660108973434,0.7176409715172486
1595063681,18624,38042,1595101723.0,40,50,0.0001,25,12,True,False,13.096005154639174,0.5077045263340773,4.730455326460481,0.4919852138621963,31.110395189003444,0.6303629342836439,,,1595063681,2115,38042,23.64066193853428,0.5144971134013857,11.442080378250589,0.4891377699719842,47.23404255319149,0.6480095208324959,,,1595063681,20739,38042,12.261921982737837,0.5116113412321288,4.209460436858094,0.4952259043052586,29.345677226481513,0.6398906517640996
1596607509,18624,34754,1596642263.0,40,50,0.0001,17,17,False,False,18.470790378006875,0.5036625187818471,7.404424398625428,0.4896906396443813,34.86361683848797,0.6076242731947765,0.5,sqeuclidean,1596607509,2115,34754,23.40425531914893,0.5027438125737341,13.47517730496454,0.4819306251695199,43.54609929078014,0.6063845963388593,0.5,sqeuclidean,1596607509,20739,34754,17.382708905926034,0.5039240251984245,6.625198900622016,0.48935123536696595,33.21760933506919,0.6134270234911315
1595570417,18624,32183,1595602600.0,40,50,9e-05,18,16,True,False,19.431915807560138,0.5123486816423066,5.841924398625428,0.4948144496183812,41.5270618556701,0.6502252313913764,,,1595570417,2115,32183,34.515366430260045,0.5168769112776823,15.839243498817966,0.4860842146321518,59.19621749408983,0.6761513564115974,,,1595570417,20739,32183,18.216886060080046,0.5140525063013512,5.23168908819133,0.495415283926339,39.65475673851199,0.6601038197487636
1596553484,18624,41789,1596595273.0,40,50,5.9999999999999995e-05,18,16,True,False,31.899699312714766,0.5205715581184859,10.797895189003437,0.4988535237489133,54.5801116838488,0.6971874569418416,soft,euclidean,1596553484,2115,41789,44.72813238770685,0.5184803017913024,23.82978723404256,0.482828346585435,65.39007092198581,0.708339020958174,soft,euclidean,1596553484,20739,41789,30.1702107141135,0.5181786474744121,9.68706302136072,0.4942672272861769,53.112493369979255,0.7066681423660063
1595099038,18624,33554,1595132592.0,40,50,0.0001,18,16,False,False,9.45017182130584,0.5085962356638081,3.6565721649484537,0.4925734486330179,25.542310996563568,0.6336380279387649,,,1595099038,2115,33554,18.912529550827426,0.5136082723897183,10.16548463356974,0.4876499053159611,41.465721040189116,0.6419471476668943,,,1595099038,20739,33554,8.635903370461449,0.5124372256007721,3.119726119870774,0.4959177301241402,23.718597810887694,0.6421179572916546
1596516521,18624,36711,1596553232.0,40,50,8e-05,25,12,True,False,24.414733676975946,0.5091538652888085,7.533290378006872,0.4930831037346895,45.38230240549829,0.6349291993445398,soft,euclidean,1596516521,2115,36711,38.10874704491726,0.5141170071080894,17.35224586288416,0.4848213765141732,60.56737588652482,0.6676143339430116,soft,euclidean,1596516521,20739,36711,23.17855248565505,0.5087307990295501,6.866290563672309,0.4910347304445032,43.69545301123487,0.6442051029931332
1593023149,18624,109411,,40,50,5e-05,6,50,False,False,0.9718642611683848,0.4954603074457464,0.4725085910652921,0.4938430600419052,2.228307560137457,0.5037373775235717,,,1593023149,2115,109411,3.0732860520094563,0.5021773029731714,2.458628841607565,0.5016991324547815,5.7683215130023635,0.5060648902266173,,,1593023149,20739,109411,0.8341771541540094,0.4940217256108618,0.3616374945754376,0.4922590472448513,2.039635469405468,0.5021974656026493
1596058492,18624,35155,1596093647.0,40,50,8e-05,15,20,False,False,4.832474226804124,0.4950978176749339,2.0940721649484533,0.4914394145926187,7.544029209621992,0.5190858706108591,,,1596058492,2115,35155,5.7683215130023635,0.5029170151373222,4.3498817966903065,0.5014676417763227,9.030732860520096,0.5081073463760685,,,1596058492,20739,35155,4.600028930999566,0.4974237391154606,1.9673079704903804,0.4942556075382637,6.914508896282366,0.5186942377405215
1596256723,18624,43569,1596300292.0,40,50,0.0001,17,17,True,False,6.856743986254297,0.5074444994133733,2.802835051546392,0.4921840831653087,22.519329896907216,0.6232813539087922,0.1,euclidean,1596256723,2115,43569,16.453900709219855,0.5118106480609338,8.226950354609928,0.4876778051143818,40.189125295508276,0.6336379378084301,0.1,euclidean,1596256723,20739,43569,6.2828487390906025,0.5106629284574165,2.4977096292010224,0.4949899099093265,21.052124017551478,0.6312977083029231
1596258245,18624,43563,1596301808.0,40,50,7e-05,16,18,True,False,37.172465635738824,0.5183617738569821,11.936211340206187,0.4966638575413613,58.12929553264605,0.6932420264539916,soft,euclidean,1596258245,2115,43563,49.030732860520104,0.5188487804990474,25.626477541371155,0.483572260940773,67.75413711583924,0.7070563082950567,soft,euclidean,1596258245,20739,43563,35.19456097208158,0.5172569673662349,10.800906504653067,0.4936126910585471,56.217753990067024,0.7030604850689928
1596454143,18624,34670,1596488813.0,40,50,0.0001,17,17,False,False,4.68213058419244,0.5047006481768005,2.2175687285223367,0.4950747578394179,10.336125429553263,0.5784762045859153,1.0,euclidean,1596454143,2115,34670,7.044917257683216,0.5099237441249362,5.153664302600473,0.4944150216696377,18.62884160756501,0.5824791800128123,1.0,euclidean,1596454143,20739,34670,4.1949949370750765,0.5062732814274177,1.8708713052702641,0.4962357328288778,9.44597135831043,0.5823240875525408
1596225537,18624,34728,1596260265.0,40,50,7e-05,17,17,False,False,6.062070446735394,0.4944754175409456,2.8404209621993126,0.4903367414552381,8.532001718213058,0.5210100417561582,0.5,euclidean,1596225537,2115,34728,5.91016548463357,0.5018250538342088,4.3971631205673765,0.4999822779963157,9.219858156028367,0.5095437134771933,0.5,euclidean,1596225537,20739,34728,5.636723082115821,0.496836529379372,2.463956796373981,0.493153174078546,7.984955880225662,0.5223994034265924
1596221771,18624,34692,1596256463.0,40,50,7e-05,17,17,False,False,10.083762886597937,0.50678190658771,4.043170103092784,0.4931990901440874,24.489905498281782,0.6121065690056537,0.1,euclidean,1596221771,2115,34692,18.3451536643026,0.5100721221162526,10.023640661938538,0.4856640823358033,42.50591016548464,0.6377992935346697,0.1,euclidean,1596221771,20739,34692,9.28202902743623,0.506725872491413,3.466898114663195,0.4917838489403881,23.10140315347895,0.6197537818975785
1594033616,18624,84335,,40,50,1e-05,30,10,False,False,16.602233676975946,0.5195980221419891,4.955970790378006,0.4975156725609841,37.983247422680414,0.6956972585664614,,,1594033616,2115,84335,32.29314420803783,0.519797577207238,13.900709219858156,0.4854483180770977,55.93380614657211,0.7008455444324251,,,1594033616,20739,84335,15.51183760065577,0.5249036546183367,4.310718935339216,0.5023938723466634,36.00945079319157,0.7079445769918996
1593813177,18624,116208,,40,50,1e-05,60,5,False,False,13.171176975945018,0.5174802860453019,4.2633161512027495,0.4966270993753807,33.027276632302396,0.6820121063562268,,,1593813177,2115,116208,26.57210401891253,0.5219799111646918,13.04964539007092,0.4926488870878874,50.73286052009457,0.6859435853804372,,,1593813177,20739,116208,12.199238150344764,0.5249874910776261,3.6838806114084575,0.5046056170336429,31.8240995226385,0.6922057334406916
1598225452,18624,21587,1598247039.0,40,50,7e-05,16,18,True,False,12.424828178694158,0.5090678023136217,4.419029209621994,0.4928879984832628,30.82581615120275,0.6340054845747081,soft,euclidean,1598225452,2115,21587,23.87706855791962,0.5146314179639297,11.063829787234043,0.4875325702897047,49.219858156028366,0.6558538726022479,soft,euclidean,1598225452,20739,21587,11.567577993152995,0.5124471297365873,3.920150441197744,0.4956721022132958,29.65909638844689,0.6431979102403982
1596375695,18624,35033,1596410728.0,40,50,7e-05,17,17,False,False,8.558848797250857,0.5054902163642196,3.5706615120274914,0.4917399786868952,23.41602233676976,0.6090748719845149,0.2,euclidean,1596375695,2115,35033,17.399527186761233,0.5093272150954793,9.361702127659576,0.4865542720856145,40.09456264775414,0.6257687084660329,0.2,euclidean,1596375695,20739,35033,7.845122715656493,0.5067682992894276,3.172766285741839,0.4922552824319189,22.00684700323063,0.6172549946512098
1597059046,18624,32857,1597091903.0,40,50,0.0001,17,17,False,False,7.9198883161512015,0.5075813855420748,3.3397766323024056,0.4928963514101529,22.041451890034367,0.6188387870688841,0.2,cityblock,1597059046,2115,32857,14.940898345153663,0.5123178452941299,8.51063829787234,0.489018924493068,39.290780141843975,0.6318401111233235,0.2,cityblock,1597059046,20739,32857,7.198997058681711,0.5098639945902556,2.868990790298472,0.4948797589625511,20.62298085732196,0.625974996878284
1596479945,18624,36302,1596516247.0,40,50,9e-05,15,20,False,False,9.44480240549828,0.5078947905426279,3.565292096219931,0.492421922061681,27.04574742268041,0.6270866262198119,soft,euclidean,1596479945,2115,36302,19.66903073286052,0.5118643873258596,9.078014184397164,0.4864488856892133,42.5531914893617,0.6403044799706018,soft,euclidean,1596479945,20739,36302,8.722696369159554,0.5117279883089123,3.0956169535657456,0.4958545189654531,25.044601957664298,0.6350443105786836
1593696278,18624,108208,,40,50,0.0001,5,60,False,False,1.6591494845360826,0.5058307663748214,1.0792525773195876,0.4936418702647962,9.428694158075599,0.599391504745044,,,1593696278,2115,108208,7.375886524822695,0.5067787310545949,4.633569739952718,0.4884588156165064,27.32860520094563,0.608550917695079,,,1593696278,20739,108208,1.514055643955832,0.5068346013300846,0.9547229856791551,0.4940681023013761,8.963788032209846,0.6037882481061473
1596988070,18624,33071,1597021141.0,40,50,7e-05,17,17,False,False,26.428264604811,0.5115965567590663,8.462199312714777,0.4919598380453192,49.2858676975945,0.6621448475914694,none,cityblock,1596988070,2115,33071,38.48699763593381,0.5128583394574635,19.62174940898345,0.4827628285038264,63.26241134751773,0.6740997570544079,none,cityblock,1596988070,20739,33071,24.745648295481946,0.5129525927716696,7.565456386518154,0.492692300133019,47.446839288297404,0.6711960224214466
1595954945,18624,34014,1595988959.0,40,50,7e-05,15,20,True,False,4.5478951890034365,0.4944180107106636,2.0887027491408934,0.491211599350074,6.856743986254297,0.5133929849867337,,,1595954945,2115,34014,4.822695035460993,0.4993644487357893,3.404255319148936,0.4974057837048636,7.8959810874704495,0.5062175496491926,,,1595954945,20739,34014,4.1949949370750765,0.4971330841907127,1.7889001398331648,0.494312092214543,6.215343073436522,0.5166869519394017
1593570490,18624,113341,,40,50,0.0001,15,20,True,False,37.575171821305844,0.5180167289140863,12.768470790378005,0.4963951626628919,58.956185567010316,0.691729284609215,,,1593570490,2115,113341,49.83451536643025,0.5176566856552121,24.917257683215126,0.4820639269743228,68.98345153664303,0.7068217995591053,,,1593570490,20739,113341,35.483870967741936,0.516337915740896,11.56275615989199,0.4926328518446642,57.003712811610974,0.7016216236622771
1596795150,18624,39703,1596834853.0,40,50,7e-05,17,17,True,False,9.375,0.5099134326080628,3.307560137457045,0.4933491697730695,26.707474226804123,0.6385656646342123,0.1,cityblock,1596795150,2115,39703,19.8581560283688,0.515692239937955,9.1725768321513,0.4890685035125735,45.7210401891253,0.6553991855394123,0.1,cityblock,1596795150,20739,39703,8.568397704807367,0.5140936834994017,2.7725541250783547,0.4970006878182071,25.32426828680264,0.6476470292693146
1596686401,18624,34947,1596721348.0,40,50,7e-05,17,17,False,False,4.515678694158075,0.506346676741751,2.077963917525773,0.4943552343469466,12.349656357388316,0.593881839778224,1.0,sqeuclidean,1596686401,2115,34947,10.212765957446807,0.5149462856424356,6.619385342789598,0.4952896669332736,24.49172576832151,0.6126448441777405,1.0,sqeuclidean,1596686401,20739,34947,4.1660639375090405,0.5107311201521553,1.7840783065721586,0.4987682799681898,11.630261825546071,0.6016714115809311
1596564704,18624,42550,1596607254.0,40,50,0.0001,17,17,True,False,18.513745704467357,0.5064046151433523,7.125214776632303,0.4915194079393023,37.913445017182134,0.6206749634235622,0.5,sqeuclidean,1596564704,2115,42550,27.75413711583925,0.5062054574684843,14.468085106382976,0.4819965447966882,51.96217494089834,0.629425676655324,0.5,sqeuclidean,1596564704,20739,42550,17.40681807223106,0.5065026526908742,6.30695790539563,0.4906679295999929,36.269829789285886,0.6274445741070639
1595470197,18624,32807,1595503004.0,40,50,8e-05,16,18,False,False,9.75622852233677,0.5078769300265984,3.51159793814433,0.4922480729062609,26.44437285223368,0.6271475811046796,,,1595470197,2115,32807,17.446808510638302,0.5127182936005446,9.739952718676124,0.4867989565517234,43.215130023640654,0.6452849761373431,,,1595470197,20739,32807,8.896282366555766,0.5114185251331308,3.028111287911664,0.4953141619839066,24.490091132648637,0.6358333448136265
1593929477,18624,89909,,40,50,1e-05,15,20,False,False,14.239690721649485,0.5172325132432544,4.617697594501719,0.495997437565208,34.589776632302396,0.6857029958236837,,,1593929477,2115,89909,27.848699763593377,0.5201386812302919,12.576832151300234,0.4871245140964087,53.286052009456256,0.6949078827834209,,,1593929477,20739,89909,13.120208303196875,0.5228395868453231,4.15642027098703,0.5013311752265728,32.63898934374849,0.6978816213981625
1595136249,18624,38534,1595174783.0,40,50,0.0001,21,14,True,False,14.228951890034365,0.512034367837891,4.553264604810996,0.4955477760961412,34.0904209621993,0.6428278853598988,,,1595136249,2115,38534,27.659574468085108,0.515931527911086,12.245862884160754,0.4880870111224032,50.35460992907801,0.6612961915139223,,,1595136249,20739,38534,13.303437967115096,0.5162082010884382,4.055161772505906,0.4990850041764801,32.62934567722648,0.6534628553032228
1593023060,18624,109505,,40,50,5e-05,60,5,False,False,11.254295532646045,0.5029648132762913,4.821735395189004,0.4888542427671861,28.903565292096214,0.6118296742402507,,,1593023060,2115,109505,20.8983451536643,0.5085774441207861,11.15839243498818,0.4846128012874807,45.059101654846344,0.630141191158997,,,1593023060,20739,109505,10.54534934181976,0.5059991279270902,4.373402767732292,0.4909889696498961,27.199961425333914,0.618369333282505
1596410988,18624,39558,1596450546.0,40,50,0.0001,17,17,True,False,7.876932989690722,0.5076938596043903,3.3182989690721647,0.4939330124930146,21.364905498281782,0.6150267420091515,0.2,euclidean,1596410988,2115,39558,15.933806146572106,0.510479510767449,8.463356973995271,0.4880059505869089,38.817966903073284,0.6293159122386767,0.2,euclidean,1596410988,20739,39558,7.208640725203723,0.5090175872364449,2.825594290949419,0.494221019238192,20.468682192969766,0.6213519240648321
1596409725,18624,34839,1596444564.0,40,50,5e-05,18,16,False,False,32.24334192439863,0.5189014463447059,10.126718213058421,0.4966299099696631,53.6243556701031,0.6968424207706958,soft,euclidean,1596409725,2115,34839,43.59338061465722,0.5187206668679748,21.182033096926716,0.4830504719487074,64.77541371158392,0.7095384628572985,soft,euclidean,1596409725,20739,34839,30.42094604368581,0.5180913528639941,9.118086696562033,0.4940368635007191,51.42002989536621,0.7073695567173598
1595472034,18624,33891,1595505925.0,40,50,9e-05,15,20,False,False,33.15077319587629,0.5168387362786642,11.136168384879728,0.4946114584962432,55.00429553264605,0.6928728407205504,,,1595472034,2115,33891,44.53900709219858,0.5189152892742047,23.40425531914893,0.4841467348896677,64.63356973995272,0.7047854950105552,,,1595472034,20739,33891,31.32745069675491,0.5166706921451989,10.149959014417279,0.492735523691329,53.0594532041082,0.7036824691041428
1596444832,18624,34858,1596479690.0,40,50,5.9999999999999995e-05,21,14,False,False,37.2583762886598,0.5178158864262794,11.372422680412368,0.4957142432892356,57.227233676975935,0.6951282652876473,soft,euclidean,1596444832,2115,34858,47.56501182033097,0.5183840378357094,24.34988179669031,0.4830818820228511,66.33569739952718,0.7073185418785812,soft,euclidean,1596444832,20739,34858,35.305463137084715,0.516502364802959,10.289792178986449,0.4924487234409629,55.28714017069289,0.7053387765436172
1595919239,18624,35459,1595954698.0,40,50,5.9999999999999995e-05,15,20,False,False,4.123711340206185,0.5031104685939037,1.7504295532646048,0.4927114425017307,7.689003436426117,0.5779946258009347,,,1595919239,2115,35459,6.808510638297872,0.5176133944634274,5.390070921985815,0.5028461457747387,17.494089834515368,0.5889083880325754,,,1595919239,20739,35459,3.746564443801533,0.5142080027872011,1.475480977867785,0.5054056664266959,7.271324557596798,0.5877280549808177
1597021394,18624,37860,1597059254.0,40,50,0.0001,17,17,True,False,27.861898625429554,0.5113986522420575,8.902491408934706,0.4941190005037154,48.3569587628866,0.6474269124618771,none,cityblock,1597021394,2115,37860,41.276595744680854,0.5143067537541132,19.810874704491727,0.4837262299985386,62.03309692671395,0.6720574168078532,none,cityblock,1597021394,20739,37860,26.33685327161387,0.5116438283363801,8.17300737740489,0.4929303688661849,46.665702300014466,0.6559233650738957
1593134313,18624,110897,,40,50,5e-05,15,20,True,False,10.266323024054982,0.5051648210349426,3.731743986254296,0.4883816436465282,27.330326460481096,0.6339783932869484,,,1593134313,2115,110897,20.61465721040189,0.5127027501303469,10.212765957446807,0.4854659078323266,43.356973995271865,0.6531352345811207,,,1593134313,20739,110897,9.537586190269543,0.5115272000255128,3.26438111770095,0.494551491033896,25.82091711268624,0.6428468180826112
1595503323,18624,33435,1595536758.0,40,50,7e-05,21,14,True,False,6.212414089347079,0.4948920725626969,2.8189432989690717,0.4908339358850005,8.574957044673539,0.5210126233116403,,,1595503323,2115,33435,6.335697399527186,0.5019460919516825,4.728132387706856,0.4997870217986923,9.408983451536642,0.5082319660450875,,,1595503323,20739,33435,5.723516080813925,0.4954357872671518,2.4350257968079463,0.4914300037862163,8.071748878923767,0.5218660855371902
1598189473,18624,18893,1598208366.0,40,50,8e-05,25,12,True,False,26.567869415807557,0.5139325617378853,7.608462199312714,0.4943542068921614,48.620060137457045,0.6680836858788174,soft,euclidean,1598189473,2115,18893,39.43262411347518,0.5146551278449301,18.108747044917262,0.4818315985186694,63.12056737588654,0.6865173397074968,soft,euclidean,1598189473,20739,18893,25.02049279135927,0.5145656803342845,6.798784898018228,0.4936721938859306,47.032161627850904,0.6778777139639323
1594920479,18624,36407,1594956886.0,40,50,5e-05,25,12,True,False,25.54768041237113,0.5231510814367222,8.161512027491407,0.5004671826851159,50.585266323024065,0.7086918646561713,,,1594920479,2115,36407,41.70212765957447,0.5218715215271366,20.61465721040189,0.4858543669415729,64.68085106382978,0.7192770440930045,,,1594920479,20739,36407,23.964511307199,0.5244354308622954,7.334008389989874,0.5003447253368245,48.33887844158349,0.719538112417109
1596410763,18624,39532,1596450295.0,40,50,0.0001,17,17,True,False,8.070231958762887,0.5091875953461636,2.6685996563573884,0.4927312787794666,25.92890893470791,0.6369611236235103,none,euclidean,1596410763,2115,39532,21.70212765957447,0.5161383786894651,9.976359338061462,0.4892592118196023,45.62647754137115,0.6535342620114873,none,euclidean,1596410763,20739,39532,7.415979555426973,0.5140418615088301,2.4398476300689516,0.4971812350556774,24.53348763199769,0.6471452587111719
1596529501,18624,34929,1596564430.0,40,50,7e-05,17,17,False,False,14.841065292096221,0.5033721065384823,5.5090206185567006,0.4922898866595604,25.03221649484536,0.5871303627995728,0.5,sqeuclidean,1596529501,2115,34929,16.6903073286052,0.5000113266840651,9.645390070921986,0.4834906268382298,29.314420803782507,0.5831351094934663,0.5,sqeuclidean,1596529501,20739,34929,13.857948792130768,0.5012743427819031,4.706109262741695,0.4890608427673702,23.347316649790248,0.5903094358671233
1598202465,18624,22776,1598225241.0,40,50,8e-05,25,12,True,False,6.1479810996563575,0.4974746790939239,2.614905498281787,0.493607257275181,9.101159793814432,0.5242893785224028,soft,euclidean,1598202465,2115,22776,6.5248226950354615,0.5027625285227704,4.4444444444444455,0.500652178014355,10.118203309692671,0.5149874778948028,soft,euclidean,1598202465,20739,22776,5.68494141472588,0.495447358022793,2.179468633974637,0.4911463634061693,8.655190703505474,0.5243232007858007
1596837656,18624,34636,1596872292.0,40,50,7e-05,17,17,False,False,4.9828178694158085,0.4981109397429644,2.077963917525773,0.4907790238015074,8.290378006872851,0.552495218709756,0.5,cityblock,1596837656,2115,34636,5.390070921985815,0.5127183693114168,4.113475177304964,0.5042801123465218,11.394799054373523,0.5496547602609819,0.5,cityblock,1596837656,20739,34636,4.556632431650513,0.5062779114384166,1.7503254737451182,0.499555181712139,7.560634553257147,0.56281707447018
1596450560,18624,34656,1596485216.0,40,50,0.0001,17,17,False,False,13.794029209621995,0.5110675204544485,4.537156357388317,0.49478859383206003,33.16688144329897,0.6388987035582144,none,euclidean,1596450560,2115,34656,25.53191489361702,0.5157871394734629,11.347517730496454,0.4886138872850141,49.9290780141844,0.6560107395186496,none,euclidean,1596450560,20739,34656,12.850185640580552,0.5124835181723135,3.997299773373837,0.49513738612571595,31.404600028930997,0.6480614433655311
1595064319,18624,37972,1595102291.0,40,50,7e-05,30,10,True,False,24.9731529209622,0.5209254285137173,9.2676116838488,0.4981635087634674,48.512671821305844,0.7031674264259576,,,1595064319,2115,37972,36.45390070921986,0.5205447783590944,18.865248226950353,0.485719564359306,60.85106382978724,0.7090840229081856,,,1595064319,20739,37972,23.50161531414244,0.520574105518942,8.274265875886012,0.4962750822839712,46.86821929697671,0.7135637038723213
1594957873,18624,34303,1594992176.0,40,50,5.9999999999999995e-05,30,10,False,False,26.739690721649485,0.5214349602703062,8.96155498281787,0.4984363339619556,50.413445017182134,0.7064082842814731,,,1594957873,2115,34303,40.283687943262414,0.5207915890327309,19.71631205673759,0.4842485403415194,65.01182033096927,0.7200701391845081,,,1594957873,20739,34303,24.89994695983413,0.5223454828128853,7.97531221370365,0.4980906499242208,48.49317710593567,0.7169938055171562
1595989172,18624,35299,1596024471.0,40,50,7e-05,15,20,False,False,11.265034364261167,0.5079082205032666,4.28479381443299,0.4924185847341255,28.345146048109964,0.6276884358507904,,,1595989172,2115,35299,21.938534278959807,0.5131740805833446,10.212765957446807,0.4870475025929305,43.64066193853428,0.6465377224346064,,,1595989172,20739,35299,10.37176334442355,0.5107937048763646,3.66941511162544,0.4946073917715105,26.58758860118617,0.636256333717324
1595434064,18624,37734,1595471798.0,40,50,9e-05,15,20,True,False,4.3116408934707895,0.4945597746708488,1.95446735395189,0.4913449288498149,6.61512027491409,0.5137909328700511,,,1595434064,2115,37734,4.91725768321513,0.5017460123914491,3.7825059101654848,0.500630747393435,8.085106382978722,0.5085699629465,,,1595434064,20739,37734,3.9828342735908193,0.4979036869234984,1.6490669752639953,0.4951941849508579,6.061044409084334,0.5167460673880562
1593023112,18624,111088,,40,50,5e-05,15,20,False,False,4.67676116838488,0.4980994977346978,2.0994415807560136,0.4863192408646401,8.854166666666668,0.5834552942047184,,,1593023112,2115,111088,6.4775413711583925,0.5074785203395075,4.539007092198582,0.4912329287609537,18.2033096926714,0.5927188225910228,,,1593023112,20739,111088,4.30589710207821,0.5096040149621479,1.8178311393991995,0.4991754669439576,8.216403876753944,0.5903044429277067
1595398605,18624,32932,1595431537.0,40,50,5.9999999999999995e-05,18,16,False,False,25.0536941580756,0.5212032480058718,8.601804123711341,0.4986216460456391,48.15829037800689,0.7034005694791248,,,1595398605,2115,32932,37.77777777777778,0.5216673604040366,19.763593380614658,0.4866990180884818,61.70212765957447,0.7129815180366557,,,1595398605,20739,32932,23.482327981098408,0.522479867780774,7.835479049134481,0.4984800924825166,46.24620280630696,0.7150933587784649
1596911384,18624,34906,1596946290.0,40,50,0.0001,17,17,False,False,18.68019759450172,0.5098559771445109,6.4379295532646035,0.4931883673685388,41.280068728522345,0.6406421721305849,0.1,cityblock,1596911384,2115,34906,32.71867612293144,0.5131737636013517,16.170212765957444,0.4838198854071172,58.72340425531914,0.6666226731345439,0.1,cityblock,1596911384,20739,34906,17.590047736149284,0.5107733082518262,5.887458411688124,0.4928348439801031,39.74154973721009,0.6496308078290132
1595669221,18624,32991,1595702212.0,40,50,7e-05,16,18,False,False,9.160223367697592,0.5065335647784921,3.6243556701030935,0.4916637652712493,25.40807560137457,0.6207143718403194,,,1595669221,2115,32991,19.148936170212764,0.5115330945171072,10.212765957446807,0.4861473411824178,43.07328605200946,0.6402665119311972,,,1595669221,20739,32991,8.43820820676021,0.5103927332988735,3.1583007859588217,0.4948752355503688,23.67520131153865,0.6297410189189228
1595536453,18624,33710,1595570163.0,40,50,9e-05,21,14,False,False,24.076460481099648,0.5097761708886447,7.909149484536082,0.4922866893669551,46.1608676975945,0.6460568816511136,,,1595536453,2115,33710,37.02127659574468,0.5113999729516879,18.108747044917262,0.4815537377440036,61.087470449172585,0.6673574756296665,,,1595536453,20739,33710,22.566179661507306,0.5103257153670561,7.2279280582477465,0.4915170115094529,44.577848497998936,0.6552064097196051
1595136799,18624,38468,1595175267.0,40,50,7e-05,25,12,True,False,9.815292096219931,0.5086544822660344,3.769329896907216,0.4936688742576506,25.322164948453608,0.6245872357359415,,,1595136799,2115,38468,17.35224586288416,0.5131545871073359,8.888888888888891,0.4888811253181513,42.269503546099294,0.6406310199800411,,,1595136799,20739,38468,8.98307536525387,0.5110360381407806,3.2740247842229615,0.4954014261337971,24.08987897198515,0.6329186250970645
1597059501,18624,33001,1597092502.0,40,50,0.0001,17,17,False,False,4.279424398625428,0.5070690644817454,2.0511168384879723,0.5016825970149171,7.758805841924398,0.5499564538896071,none,cityblock,1597059501,2115,33001,5.7683215130023635,0.51199752437285,4.113475177304964,0.5058557005311556,12.05673758865248,0.5401291079540134,none,cityblock,1597059501,20739,33001,3.896041274892714,0.500355598332519,1.7840783065721586,0.4936791519322825,7.396692222382951,0.5478767418945039
1595035644,18624,35672,1595071316.0,40,50,8e-05,30,10,True,False,26.41215635738832,0.52348118092014,9.3481529209622,0.5009232881723656,50.6872852233677,0.7077338033409886,,,1595035644,2115,35672,40.23640661938535,0.5203753087870782,20.472813238770684,0.48367567848471205,64.68085106382978,0.7187371509064897,,,1595035644,20739,35672,24.779401128308983,0.5212642882700722,8.481604706109263,0.4965514319902302,48.73426876898597,0.7178852534684648
1594992442,18624,37214,1595029656.0,40,50,5.9999999999999995e-05,25,12,True,False,22.31529209621993,0.5217206225624034,7.82323883161512,0.4989680253053719,47.91129725085911,0.7052251997211291,,,1594992442,2115,37214,38.48699763593381,0.5204086780704201,20.236406619385342,0.4846213244616601,61.74940898345154,0.7140119691390387,,,1594992442,20739,37214,21.00390568494141,0.5245822887542311,6.953083562370412,0.5009848818578716,46.130478808042824,0.7162980479903565
1593798768,18624,130597,,40,50,0.0001,7,40,True,False,2.2873711340206184,0.4945124537994705,1.0362972508591064,0.4919144768890991,4.274054982817868,0.5082765039689011,,,1593798768,2115,130597,4.302600472813238,0.5009350165580913,3.0732860520094563,0.4994258366797482,7.044917257683216,0.5089828265584883,,,1593798768,20739,130597,2.0010608033174213,0.4959787414593289,0.8438208206760209,0.4937014081640702,3.7562081103235454,0.5102485778556489
1595469825,18624,33271,1595503096.0,40,50,5.9999999999999995e-05,16,18,False,False,5.041881443298968,0.4951658369513173,2.2927405498281783,0.4917786221930725,7.603092783505153,0.5171788935113839,,,1595469825,2115,33271,5.815602836879433,0.5020501344257708,4.208037825059101,0.5003485900588395,8.226950354609928,0.5076916551707757,,,1595469825,20739,33271,4.67717826317566,0.4988720085379954,1.9673079704903804,0.4960069255909907,7.208640725203723,0.5195526832011431
1598190556,18624,13366,1598203922.0,40,50,7e-05,16,18,True,False,23.716709621993125,0.5169421864753867,6.443298969072164,0.4967295071888246,44.29768041237113,0.6794613148184239,soft,euclidean,1598190556,2115,13366,36.312056737588655,0.5177170675033064,16.501182033096928,0.4855931694722712,59.14893617021277,0.6876254195083471,soft,euclidean,1598190556,20739,13366,22.28651333236897,0.5188130742065714,5.554751916678722,0.4974055963355751,42.50446019576643,0.6903954127791915
