ts,training_segmentation_training_samples,training_patch_count_per_image,training_learning_rate,training_batch_k,training_batch_p,training_flip_augment,training_standardize,training_general_first_hit_percentage,training_general_AUC,training_among_other_donors_first_hit_percentage,training_among_other_donors_AUC,training_within_donor_first_hit_percentage,training_within_donor_AUC,ts,validation_general_first_hit_percentage,validation_general_AUC,validation_among_other_donors_first_hit_percentage,validation_among_other_donors_AUC,validation_within_donor_first_hit_percentage,validation_within_donor_AUC,ts,general_first_hit_percentage,general_AUC,among_other_donors_first_hit_percentage,among_other_donors_AUC,within_donor_first_hit_percentage,within_donor_AUC
1584753511,0,0,1e-05,10,20,False,1,3.2803607859980675,0.5086435346532818,1.9811016858155264,0.4925487159625879,11.800708686781915,0.6343426299055145,1584753511,9.215500945179585,0.5138073760542813,5.293005671077505,0.4913697698075793,27.788279773156894,0.6327888644420288,1584753511,2.960177417799634,0.51347285493406,1.6873975508629833,0.4979178365963594,11.286279047343555,0.6341162922850259
1583770480,0,0,1e-05,10,20,False,0,8.080103081713734,0.5125978701950488,4.144743906367443,0.4930558598140119,24.86846343820466,0.6691977884213729,1583770480,19.4234404536862,0.5180875683899937,12.003780718336484,0.4895349335024724,43.28922495274102,0.6713511903695453,1583770480,7.371516729341433,0.5208507281212341,3.668884389162087,0.5015528303870037,22.905216469000102,0.6740905059764578
1585521837,0,0,1e-06,10,20,False,1,2.695157306990229,0.5060806997147603,1.685815526683131,0.490824055744625,9.663910662514764,0.6221657932694067,1585521837,7.277882797731569,0.5122797263470368,4.914933837429111,0.4922223820327272,25.0,0.6171594553289661,1585521837,2.434673609102304,0.5128397209243185,1.4752675730402085,0.4987937889927113,9.227654035290714,0.6227276866664626
1584025762,0,0,1e-06,10,20,False,0,7.806292279609148,0.5115928252745617,3.1300332868033935,0.4920998990559528,24.208096209599482,0.666547909627645,1584025762,18.99810964083176,0.5140302770058655,10.066162570888471,0.4832443890208286,43.95085066162571,0.6719291691033431,1584025762,7.2027769742551335,0.5220576801494744,2.6178767717674285,0.5034892403965205,23.020923729630702,0.6717101270260531
1586831151,0,0,1e-05,10,20,False,1,2.9421239128100503,0.5081599577127289,1.7717169547943734,0.4907681019488464,11.070546547836358,0.6410824206805776,1586831151,9.120982986767483,0.5140412357237198,5.860113421550095,0.4910813139393821,25.897920604914926,0.6420786863264586,1586831151,2.6901938096615563,0.5154958113023975,1.5668691543727704,0.4992993768033034,10.548645260823449,0.6417097300719318
1586740776,0,0,1e-05,10,20,False,0,4.993020508965962,0.5073479816080473,2.931386234296145,0.4898509262200572,16.36959089444862,0.6438501291923693,1586740776,13.9413988657845,0.5112327979821029,9.120982986767483,0.4855163904244533,32.608695652173914,0.645719463322758,1586740776,4.449908398418668,0.5195122559905561,2.492527239417607,0.5033803415307188,14.979269115803685,0.6485635413918173
1587686591,0,0,1e-05,10,20,False,1,4.923225598625577,0.5107461125192833,2.652206592934608,0.4923072246015334,14.426071083431767,0.6540652230559723,1587686591,9.829867674858225,0.5144538749557418,5.52930056710775,0.4897605309254873,30.056710775047254,0.6477396769365874,1587686591,4.47401407771671,0.5162006423386074,2.265933854016006,0.4984979178867853,13.55703403721917,0.6546077255317391
1587462051,0,0,1e-05,10,20,False,0,12.546977343498336,0.5129132776514875,4.84806184902824,0.4921018487829826,33.093525179856115,0.6793876955709119,1587462051,24.007561436672965,0.5198646411097698,12.145557655954633,0.4886180688629452,49.858223062381846,0.6836380762395837,1587462051,11.623758557516153,0.5215633192490811,4.290810915051587,0.5010608322696023,31.660399190049176,0.6845972328814202
1589259198,0,0,1e-05,10,20,False,0,7.774914089347079,0.5110353196862106,3.946520618556701,0.4914170061146703,25.44029209621993,0.6676124109089204,1589259198,18.676122931442077,0.5177739790837248,11.48936170212766,0.4892036260121701,44.302600472813246,0.6716754577191263,1589259198,7.112204059983605,0.5171187599523974,3.4620762814021893,0.4970193064660815,23.99826414002604,0.6763444898000557
1589258734,0,0,1e-05,10,20,True,0,10.867697594501722,0.5112911424632735,4.494201030927835,0.4901709612994012,31.121134020618552,0.6781533014079476,1589258734,22.080378250591014,0.5178427940140463,12.15130023640662,0.4862430829921,48.93617021276596,0.6847156226213937,1589258734,10.149959014417279,0.5195718619521129,3.929794107719755,0.4982822189663704,29.056367230821163,0.6884504599050739
1589222258,0,0,1e-05,10,20,False,0,11.420747422680412,0.5116427240890997,4.64991408934708,0.4909564147158157,32.05004295532646,0.6766872359438033,1589222258,24.539007092198577,0.5187049756694674,13.995271867612296,0.4876410031010268,49.78723404255321,0.6821251578958281,1589222258,10.535705675297748,0.5190977777281491,4.117845604898982,0.4979709913461664,30.435411543468827,0.6865742188182206
1591130418,40,50,5e-05,60,5,False,0,23.31937285223368,0.5196385937612383,8.097079037800688,0.4970986584397102,46.50451030927835,0.7039240598312199,1591130418,35.271867612293136,0.5197909547973005,17.304964539007088,0.4848557290696915,60.18912529550827,0.7115245661437493,1591130418,21.804330006268387,0.5231260667214148,7.184531558898692,0.4994694086724457,44.70321616278509,0.7121090252470842
1591130635,40,20,5e-05,60,5,False,0,12.591280068728526,0.5102738206877414,4.9022766323024065,0.4903534915190603,36.082474226804116,0.6672257390503787,1591130635,26.80851063829787,0.5154451798984959,14.940898345153663,0.4840084750707019,54.98817966903074,0.6824474554218872,1591130635,11.659192825112108,0.5137107341214785,4.383046434254304,0.4929576666862811,34.037320989440175,0.6739398051872688
1591132845,40,50,5e-05,60,5,True,0,29.95060137457045,0.5189418774532086,9.428694158075599,0.496537400949277,53.61898625429553,0.7045372488712783,1591132845,45.673758865248224,0.5199790588086977,22.364066193853425,0.4844010144443938,65.43735224586288,0.7134810463993408,1591132845,28.27523024253821,0.5210701546819416,8.418920873716187,0.4969843591435437,51.9890062201649,0.7120494322104252
1591188766,40,50,5e-05,30,10,True,0,24.468427835051546,0.5179981089271051,8.446091065292096,0.49482984560871796,48.609321305841924,0.7058986740845709,1591188766,37.304964539007095,0.522915209104422,18.77068557919622,0.4872383443453458,62.695035460992905,0.7161856514226075,1591188766,22.966391822170788,0.521737956583041,7.550990886735137,0.4972638699899946,46.24620280630696,0.7142667221754215
1591234815,40,50,5e-05,30,10,True,0,14.52426975945017,0.505417669556265,4.977448453608247,0.48910338002196296,33.34407216494845,0.6322150945097393,1591234815,25.626477541371155,0.5140293204873931,11.48936170212766,0.4873178180240572,49.73995271867612,0.6543254764144822,1591234815,13.58792612951444,0.5104840973798677,4.416799267081344,0.4935201165782914,31.467283861324074,0.6412067480795971
1591250445,40,50,5e-05,30,10,True,0,31.87285223367697,0.5162760377301366,9.809922680412368,0.4932805500208641,53.710266323024065,0.7022763784166832,1591250445,42.74231678486998,0.5200202428188988,21.134751773049647,0.4840641095408778,65.24822695035462,0.7114502702002675,1591250445,30.0014465499783,0.5187125903363963,8.87699503351174,0.4942779136569364,51.79131105646365,0.7101097772672649
1591297149,40,50,5e-05,15,20,True,0,10.427405498281788,0.5057557241994798,3.9841065292096216,0.4889007067781602,28.119630584192443,0.6358374906836983,1591297149,21.134751773049647,0.5145506487379021,10.78014184397163,0.4875359623185765,46.66666666666666,0.6562516141665179,1591297149,9.580982689618594,0.5121354634158546,3.4620762814021893,0.4949715002512287,26.495973769227056,0.6448155056282152
1591329662,40,50,5e-05,15,20,True,0,34.33741408934708,0.5119214279899906,10.717353951890033,0.489764947688363,55.015034364261176,0.6891707728489945,1591329662,42.88416075650118,0.5177162870905546,22.5531914893617,0.483827109187546,67.28132387706856,0.6970441699815261,1591329662,32.42682868026424,0.5148506653942471,9.489367857659484,0.4912889593203155,53.12213703650129,0.6972000656252203
1591342075,40,50,5e-05,15,20,True,0,28.624355670103093,0.5122547887265567,9.38573883161512,0.4902678264000363,49.801331615120276,0.6859883482980799,1591342075,39.43262411347518,0.5171018709206041,20.520094562647753,0.4827897161221682,60.94562647754137,0.6970481238010885,1591342075,26.954047929022607,0.5155794299004629,8.341771541540094,0.4924129414940068,48.03992477940113,0.6955697819236624
1591395395,40,50,5e-05,7,40,True,0,26.927620274914087,0.5150423466236014,8.983032646048109,0.4931387570060913,49.355670103092784,0.6907140354818394,1591395395,38.01418439716312,0.5194151534153051,19.05437352245863,0.4849361632360054,62.364066193853425,0.7021399523538501,1591395395,25.23265345484353,0.518238092759324,8.134432711316842,0.4948598664780328,47.461304788080426,0.700500304262504
1591423439,40,50,5e-05,7,40,True,0,13.820876288659795,0.5086148148906459,4.655283505154639,0.4895193796119727,34.28908934707904,0.6570832210224403,1591423439,28.08510638297873,0.5163279342297405,12.43498817966903,0.4861241414843725,52.34042553191489,0.6720949562252254,1591423439,12.864651140363565,0.5155396206186038,3.997299773373837,0.4960737184301737,33.082598003761035,0.6676262763954389
1591434031,40,50,5e-05,7,40,True,0,10.024699312714775,0.5038183608709336,3.2699742268041234,0.4870570951498964,27.324957044673532,0.6316764139305575,1591434031,21.98581560283688,0.5128912835783851,9.976359338061462,0.486436846653631,45.39007092198582,0.6478327273652905,1591434031,9.248276194609193,0.5113212514473562,2.85934712377646,0.4945651076978453,25.907710111384354,0.6403465990774404
1591490025,40,50,5e-05,6,50,True,0,0.3006872852233677,0.4989165392120114,0.3006872852233677,0.4984684970068871,0.9450171821305842,0.5017053179736146,1591490025,1.98581560283688,0.5023510311751211,1.702127659574468,0.5029426971838545,5.153664302600473,0.496265488399279,1591490025,0.24591349631129755,0.5034268549273886,0.2362698297892859,0.5037712158820438,0.7280968224118809,0.504652623941511
1591509560,40,50,5e-05,6,50,True,0,1.068513745704467,0.4946994937542337,0.5262027491408935,0.4929738284472688,2.2068298969072164,0.5032467423146707,1591509560,2.789598108747045,0.5010147141345193,2.2222222222222223,0.5003887521080865,5.815602836879433,0.5018954956504267,1591509560,0.9740103187231786,0.4985171956337274,0.4436086600125368,0.4973766621432274,2.0010608033174213,0.5061730605015138
1591521386,40,50,5e-05,6,50,True,0,7.135953608247423,0.5095435368963103,2.5182560137457046,0.4923192067493629,23.260309278350515,0.6419850256681217,1591521386,20.236406619385342,0.5183084065220726,10.732860520094563,0.4978868458207262,41.60756501182033,0.6307891211529478,1591521386,6.64448623366604,0.5202361333018314,2.295192632238777,0.5044853327639967,22.137036501277784,0.6499304032569858
1591588276,40,50,5e-05,5,60,True,0,9.922680412371133,0.5078615110574586,3.4417955326460485,0.4926120150747532,27.953178694158076,0.6253148707818282,1591588276,23.40425531914893,0.5167523252305832,11.394799054373523,0.494617942779263,45.248226950354606,0.6431603710764628,1591588276,9.267563527653213,0.5123186941271626,3.0232894546506586,0.4974409962124374,26.182554607261682,0.6305879178784854
1591600820,40,50,5e-05,5,60,True,0,0.3597508591065292,0.4987542059696273,0.28994845360824745,0.4982684697171931,1.5088058419243986,0.5014682305494697,1591600820,2.5059101654846336,0.4978724684721544,2.316784869976359,0.497017664075295,5.673758865248227,0.4991196978197179,1591600820,0.3134191619653792,0.4977172104121676,0.2218043300062684,0.4969788774149636,1.461015478084768,0.501551481069979
1591615341,40,50,5e-05,5,60,True,0,0.6765463917525774,0.49810023868181497,0.6711769759450171,0.4975804487927205,0.934278350515464,0.5008460668642595,1591615341,2.127659574468085,0.4979411405836209,1.7966903073286054,0.4973752318804291,5.106382978723404,0.5010907621586403,1591615341,0.2169824967452625,0.5003446090287631,0.19769516370123924,0.5001807344313358,0.8486426539370269,0.5014527692651402
1591684726,40,50,0.001,60,5,True,0,0.09664948453608248,0.498307043841485,0.10738831615120276,0.4980400517036216,0.7517182130584192,0.4996474134927844,1591684726,0.9929078014184398,0.4993556678989976,0.8037825059101654,0.4990284087139165,4.208037825059101,0.5019855325193567,1591684726,0.2410916630502917,0.5008988401138839,0.2218043300062684,0.5009935108327728,0.7088094893678577,0.5011150329441858
1591695239,40,50,0.001,60,5,True,0,0.2684707903780069,0.4998426477629532,0.26310137457044674,0.4998119182409074,0.7893041237113402,0.5001920125078887,1591695239,1.98581560283688,0.499633414572248,1.702127659574468,0.4994902905147606,4.728132387706856,0.4996893102583642,1591695239,0.2410916630502917,0.5005775576978658,0.2218043300062684,0.5006494698144185,0.6750566565408168,0.5006594985836912
1591712071,40,50,0.001,60,5,True,0,0.273840206185567,0.5007233022669335,0.2684707903780069,0.5007643082233885,0.7946735395189003,0.5007925241394227,1591712071,1.938534278959811,0.4998482716369736,1.6548463356973997,0.4997585909118206,4.728132387706856,0.499625502433589,1591712071,0.24591349631129755,0.501095127121122,0.22662616326727425,0.5012910774626166,0.6943439895848401,0.5007318235257407
1591783517,40,50,0.001,30,10,True,0,0.25236254295532645,0.4995404506337603,0.22014604810996566,0.4996021403243739,0.6872852233676976,0.4992377451801007,1591783517,1.938534278959811,0.500358246705066,1.938534278959811,0.5003750128438722,4.3971631205673765,0.5020062769509771,1591783517,0.20251699696224504,0.4985725465613342,0.2073388302232509,0.4984223621222469,0.5834418245817059,0.4983768633079145
1591793952,40,50,0.001,30,10,True,0,0.2684707903780069,0.4994300917963934,0.26310137457044674,0.4992970944621784,0.7893041237113402,0.5000776404461971,1591793952,1.938534278959811,0.5002287781642754,1.6548463356973997,0.5002626224037042,4.633569739952718,0.499832417532793,1591793952,0.2410916630502917,0.5004553268380325,0.2218043300062684,0.500526387406812,0.6557693234967935,0.5003716902585756
1591813151,40,50,0.001,30,10,True,0,0.3221649484536082,0.5004775293535834,0.31142611683848803,0.5003665459011776,0.8054123711340205,0.5005041926116743,1591813151,1.8912529550827424,0.5012294836367126,1.6548463356973997,0.5017125801165756,4.775413711583925,0.4988129968871981,1591813151,0.2700226626163267,0.5011229767486346,0.25073532957230343,0.5011695579215333,0.7184531558898694,0.5023940981971831
1591881335,40,50,0.001,15,20,True,0,0.28994845360824745,0.4999859396856644,0.2845790378006873,0.4999865158076383,0.8107817869415809,0.5001269852228113,1591881335,1.98581560283688,0.5003087414592757,1.702127659574468,0.5002958275258917,4.633569739952718,0.5026395791246551,1591881335,0.2410916630502917,0.500765547685881,0.2218043300062684,0.5008829692238342,0.6702348232798111,0.5005147770598948
1591897361,40,50,0.001,15,20,True,0,0.2147766323024055,0.4973271527954375,0.2255154639175257,0.4967757472608162,0.8107817869415809,0.5005390303469601,1591897361,1.938534278959811,0.49811401652780196,2.0803782505910164,0.4975452221023133,4.633569739952718,0.5007730263956383,1591897361,0.06750566565408167,0.4989769734436718,0.06750566565408167,0.49879885925369605,0.5979073243647235,0.4995160107444222
1591914659,40,50,0.001,15,20,True,0,0.22014604810996566,0.4991486872337528,0.20940721649484534,0.4992351928304826,0.665807560137457,0.4984604501761466,1591914659,1.8912529550827424,0.499566402718627,2.0803782505910164,0.4994742533541524,4.491725768321513,0.4995116267443878,1591914659,0.1928733304402334,0.4992940900925385,0.1832296639182217,0.4994737891785638,0.5737981580596943,0.4974387367928856
1591986392,40,50,0.001,7,40,True,0,0.28994845360824745,0.5002169889420969,0.2845790378006873,0.5002252090592796,0.8322594501718213,0.5005364990205037,1591986392,1.98581560283688,0.5002842351394657,1.702127659574468,0.5002861057994352,4.58628841607565,0.5014147807333696,1591986392,0.25073532957230343,0.4999478865152628,0.2314479965282801,0.4998540369725944,0.6750566565408168,0.5004136158678387
1591997885,40,50,0.001,7,40,True,0,0.26310137457044674,0.5005800539716283,0.25773195876288657,0.5006969505589304,0.7785652920962199,0.4998481182245964,1591997885,1.98581560283688,0.5003960284630513,1.702127659574468,0.5004765255711805,4.728132387706856,0.5006183791290462,1591997885,0.2410916630502917,0.4996905423240802,0.2218043300062684,0.4996416581434758,0.6557693234967935,0.4999880007975208
1592014294,40,50,0.001,7,40,True,0,0.2684707903780069,0.4998552405839803,0.26310137457044674,0.4998412417142139,0.7785652920962199,0.4999101663733875,1592014294,2.0330969267139483,0.5003823488342672,1.702127659574468,0.5005262510277662,4.680851063829787,0.4994824148407842,1592014294,0.2410916630502917,0.5000451106700379,0.2218043300062684,0.5000645171365976,0.6654129900188052,0.4999172979682482
1592079079,40,50,0.001,6,50,True,0,0.26310137457044674,0.4998832706991437,0.25773195876288657,0.4998081235505206,0.7946735395189003,0.5002511727423311,1592079079,1.98581560283688,0.4998050748682533,1.702127659574468,0.4997419907071855,4.728132387706856,0.5018879225989086,1592079079,0.2410916630502917,0.5004487676331645,0.2218043300062684,0.5005579685714537,0.6654129900188052,0.5002099836862395
1592090557,40,50,0.001,6,50,True,0,0.26310137457044674,0.5009887612865839,0.25773195876288657,0.5011686746934289,0.8054123711340205,0.4999843602610683,1592090557,1.938534278959811,0.4997987830161766,1.702127659574468,0.4997721185435959,4.680851063829787,0.501111005802274,1592090557,0.2362698297892859,0.5009992587323288,0.2169824967452625,0.501041023426432,0.6847003230628285,0.501589961032957
1592105924,40,50,0.001,6,50,True,0,0.2684707903780069,0.5015750997986319,0.26310137457044674,0.5018182800196479,0.8215206185567011,0.500359424790663,1592105924,1.938534278959811,0.5009231736189849,1.702127659574468,0.5013659588727943,4.633569739952718,0.5002523534083128,1592105924,0.24591349631129755,0.5001444376802469,0.2218043300062684,0.5001414213324943,0.6750566565408168,0.5002215161735728
1592178919,40,50,0.001,5,60,True,0,0.3382731958762887,0.5002227887104697,0.3275343642611684,0.5000722015987522,0.8966924398625429,0.5013694696593763,1592178919,1.98581560283688,0.5002917154789079,1.7494089834515367,0.5002842651682525,4.775413711583925,0.5012709867889504,1592178919,0.2989536621823617,0.5016459238133689,0.2796663291383384,0.5017772318645022,0.7280968224118809,0.5021639812561134
