{
  "id": "peperonix",
  "password": 123456789,
  "last will": "Ihmakuruku Eruczene",
  "channels to establish": {

  },
  "channels to publish": {

  },
  "channels to subscribe": {
    "time_stamp": {"last will testament": "yes", "keep updated":  "yes"}
  }
}