<?xml version="1.0" encoding="utf-8"?>
<!-- Generator: Adobe Illustrator 17.0.2, SVG Export Plug-In . SVG Version: 6.00 Build 0)  -->
<!DOCTYPE svg PUBLIC "-//W3C//DTD SVG 1.1//EN" "http://www.w3.org/Graphics/SVG/1.1/DTD/svg11.dtd">
<svg version="1.1" id="Layer_1" xmlns="http://www.w3.org/2000/svg" xmlns:xlink="http://www.w3.org/1999/xlink" x="0px" y="0px"
	 width="16px" height="16px" viewBox="0 0 16 16" enable-background="new 0 0 16 16" xml:space="preserve">
<path fill-rule="evenodd" clip-rule="evenodd" fill="#5582C3" d="M15,16H1c-0.6,0-1-0.4-1-1v-1h0.1c0.4-2.4,2.2-4.3,4.5-4.8
	C4.2,8.5,4,7.8,4,7V4c0-2.2,1.8-4,4-4c2.2,0,4,1.8,4,4v3c0,0.8-0.2,1.5-0.6,2.2c2.3,0.5,4.1,2.4,4.5,4.8H16v1C16,15.6,15.6,16,15,16
	z M10,4c0-1.1-0.9-2-2-2S6,2.9,6,4v3c0,1.1,0.9,2,2,2s2-0.9,2-2V4z M10,11H6c-1.9,0-3.4,1.3-3.9,3h11.7C13.4,12.3,11.9,11,10,11z"/>
</svg>
