<?xml version="1.0" encoding="utf-8"?>
<!-- Generator: Adobe Illustrator 17.0.2, SVG Export Plug-In . SVG Version: 6.00 Build 0)  -->
<!DOCTYPE svg PUBLIC "-//W3C//DTD SVG 1.1//EN" "http://www.w3.org/Graphics/SVG/1.1/DTD/svg11.dtd">
<svg version="1.1" id="Layer_1" xmlns="http://www.w3.org/2000/svg" xmlns:xlink="http://www.w3.org/1999/xlink" x="0px" y="0px"
	 width="23px" height="12px" viewBox="0 0 39.4 21.8" enable-background="new 0 0 39.4 21.8" xml:space="preserve">
<line fill="none" stroke="#999999" stroke-width="3" stroke-linecap="square" stroke-miterlimit="10" x1="2.1" y1="19.7" x2="19.7" y2="2.1"/>
<line fill="none" stroke="#999999" stroke-width="3" stroke-linecap="square" stroke-miterlimit="10" x1="19.7" y1="2.1" x2="37.3" y2="19.7"/>
</svg>
