<?xml version="1.0" encoding="utf-8"?>
<!-- Generator: Adobe Illustrator 17.0.2, SVG Export Plug-In . SVG Version: 6.00 Build 0)  -->
<!DOCTYPE svg PUBLIC "-//W3C//DTD SVG 1.1//EN" "http://www.w3.org/Graphics/SVG/1.1/DTD/svg11.dtd">
<svg version="1.1" id="Layer_1" xmlns="http://www.w3.org/2000/svg" xmlns:xlink="http://www.w3.org/1999/xlink" x="0px" y="0px"
	 width="116px" height="76px" viewBox="2 7 116 76" enable-background="new 2 7 116 76" xml:space="preserve">
<g id="Page-1">
	<g id="icon-9-mail-checked">
		<path id="mail-checked" fill="#7CCF32" d="M97.9,38.8V15c0-1.1-0.5-2.2-1.2-2.9l0,0L65.9,38.7l11.6,10.1
			c3.9-6.1,10.7-10.1,18.4-10.1C96.6,38.7,97.2,38.8,97.9,38.8L97.9,38.8L97.9,38.8z M75.7,52.4L63,41.3l0,0l-10.7,9.3l-10.7-9.3
			l-29,25.2h62.3c-0.5-1.9-0.8-3.9-0.8-6C74.1,57.7,74.6,54.9,75.7,52.4L75.7,52.4L75.7,52.4z M76.5,70.5H10.6c-4.4,0-8-3.5-8-7.9
			V14.9c0-4.4,3.6-7.9,8-7.9h83.3c4.4,0,8,3.5,8,7.9v24.7c9.2,2.6,15.9,11,15.9,21c0,12.1-9.8,21.8-21.8,21.8
			C87.4,82.4,80.1,77.6,76.5,70.5L76.5,70.5L76.5,70.5z M7.9,12.1c-0.8,0.7-1.2,1.8-1.2,2.9v47.6c0,1.2,0.5,2.2,1.2,2.9l0,0
			l30.7-26.7L7.9,12.1L7.9,12.1L7.9,12.1z M52.2,45.5L91.9,11H12.6L52.2,45.5L52.2,45.5z M95.9,78.4c9.9,0,17.9-8,17.9-17.9
			c0-9.9-8-17.9-17.9-17.9c-9.9,0-17.9,8-17.9,17.9C78,70.4,86,78.4,95.9,78.4L95.9,78.4L95.9,78.4z M93.9,71.5l-9.3-9.3l2.9-2.9
			l6.4,6.4l12.4-12.4l2.9,2.9L93.9,71.5L93.9,71.5z"/>
	</g>
</g>
</svg>
