<?xml version="1.0" encoding="utf-8"?>
<!-- Generator: Adobe Illustrator 15.0.0, SVG Export Plug-In . SVG Version: 6.00 Build 0)  -->
<!DOCTYPE svg PUBLIC "-//W3C//DTD SVG 1.1//EN" "http://www.w3.org/Graphics/SVG/1.1/DTD/svg11.dtd">
<svg version="1.1" id="Layer_1" xmlns="http://www.w3.org/2000/svg" xmlns:xlink="http://www.w3.org/1999/xlink" x="0px" y="0px"
	 width="406.243px" height="739.985px" viewBox="0 0 406.243 739.985" enable-background="new 0 0 406.243 739.985"
	 xml:space="preserve">
<path fill="#F9F6F4" d="M396.728,447.373c3.836-5.859,3.13-10.02,4.489-15.861c2.745-11.795,8.68-23.537,1.884-34.949
	c-1.845-3.682-0.874-8.948-1.82-12.84c-1.266-5.219-4.741-9.355-5.107-14.789c-0.033-0.471,5.506-3.625,5.98-7.713
	c0.488-4.185,0.494-8.941-0.283-13.108c-0.874-10.451-10.256-15.917-11.983-26.2c-1.673-9.951-3.735-24.02-8.971-32.43
	c-3.987-6.405-2.897-13.977-6.467-20.904c-2.706-5.253-6.817-9.904-10.666-14.341c-3.804-4.382-1.992-8.079-2.442-13.347
	c-1.922-22.417-24.002-10.764-35.641-9.39c1.896-10.097,10.728-20.356,10.39-32.547c-0.104-3.696-1.232-7.339-4.681-9.183
	c-1.39-0.742-0.316-12.158-0.495-14.456c-0.653-8.432-1.935-17.462-5.022-25.419c-12.236-31.51-56.133-35.341-80.673-16.935
	c-3.349-5.023-6.694-10.045-10.042-15.068c-5.292-7.939,3.179-7.217,2.27-13.239c-2.503-16.554-1.933-32.679-10.094-47.889
	c-3.176-5.917-1.563-11.714-6.365-18.009c-4.352-5.705-10.108-11.433-15.994-15.603c-16.247-11.513-38.352-13.629-57.699-13.608
	C76.195,9.618,23.793,79.913,57.702,147.536c-7.872,0.562-4.932,3.739-6.955,7.994c-2.177,2.458,0.143,4.691-0.691,5.914
	c-3.47,1.825-7.178,3.236-10.846,4.605c-11.631,4.344-20.918,9.11-27.391,20.424c2.092-0.917,4.568-1.063,6.604-2.089
	C10.941,190.863,5.8,201.414,0,209.407c1.717-1.037,3.83-1.411,5.559-2.429c-3.062,3.671-4.473,8.507-3.824,13.213
	c7.378-9.583,7.222,6.725,8.64,9.607c2.001,4.062,5.752,9.549,9.785,11.946c6.119,5.433,12.287,0.81,18.771,1.041
	c5.845-1.59,16.38,5.198,20.729,8.866c2.483,2.094-35.541,57.438-37.812,65.126c-7.168,24.264-2.234,54.101,8.396,76.53
	c2.833,10.203,13.041,18.223,18.383,27.541c7.843,13.682,16.673,26.822,25.5,39.883c3.67,5.427,11.335,12.851,12.702,19.401
	c3.13,15.001,8.96,22.079,17.457,34.081c6.967,6.812,1.3,10.725,3.993,17.705c1.611,4.178,4.974,7.461,6.789,11.744
	c2.562,6.045,1.402,8.331,1.859,14.729c0.293,4.082,2.491,7.843,5.027,10.923c3.339,4.052,2.053,6.956,2.932,12.237
	c2.38,14.307-5.369,23.373-5.402,37.043c-0.019,8.416,2.24,17.039,6.004,24.553c1.234,2.467-4.165,15.046-4.774,18.411
	c-4.613,25.509-4.659,52.249-3.753,78.101c0.004,0.123,1.022,0.23,2.913,0.325h232.031c14.028-0.069,24.202-0.117,28.39-0.117
	c-0.395-24.61-3.434-49.21-6.983-73.539c-1.949-13.375-2.34-29.819-5.941-42.717c-7.174-25.69-8.135-54.641-19.082-79.435
	c20.785-7.477,13.021-28.778,4.927-42.906c10.913,1.938,21.728,4.933,32.234-0.308c16.814-8.388,17.762-20.45,14.418-36.599
	C399.167,460.984,395.103,449.858,396.728,447.373z M402.995,396.351c-0.009-0.019-0.021-0.043-0.03-0.06
	C402.976,396.312,402.985,396.332,402.995,396.351z M402.853,396.066C402.664,395.689,402.737,395.835,402.853,396.066
	L402.853,396.066z M96.431,210.139c-0.061,0.397-0.113,0.746-0.163,1.072C96.359,210.606,96.431,210.139,96.431,210.139
	c-2.502,16.489-20.763,26.82-31.528,37.25c-1.146-6.27,7.709-9.732,9.853-14.76c3.327-7.802,1.328-17.554-1.373-25.256
	c0.98,1.615,2.332,3,3.321,4.609c-1.249-12.045-14.744-17.223-12.952-30.99c0.895-6.852,11.381-6.645,15.713-9.952
	c1.588,7.947,9.063,13.047,16.463,15C98.627,186.753,96.676,206.711,96.431,210.139z M95.865,213.866
	C95.857,213.917,95.857,213.917,95.865,213.866L95.865,213.866z M95.871,213.829c0.005-0.038,0.013-0.086,0.022-0.149
	C95.884,213.742,95.876,213.793,95.871,213.829z M95.967,213.194c0.012-0.077,0.024-0.157,0.037-0.242
	C95.99,213.042,95.979,213.118,95.967,213.194z M96.121,212.182c0.008-0.054,0.016-0.108,0.025-0.163
	C96.137,212.076,96.129,212.129,96.121,212.182z M96.196,211.682c0.012-0.076,0.023-0.15,0.034-0.224
	C96.219,211.537,96.208,211.608,96.196,211.682z M220.497,209.638c2.547-1.7,4.945-3.705,7.225-5.75
	c-0.036,2.247,0.038,4.494,0.221,6.736C225.935,210.689,222.346,210.404,220.497,209.638z"/>
<path fill="#EDE7E3" d="M384.402,154.78c-5.059-8.895-12.606-18.93,2.551-56.957c15.154-38.047-2.738-58.906-21.503-68.817
	c-20.319-10.74-41.095-0.29-46.962,3.152c-3.234-2.385-6.968-3.214-10.181-1.907C293.379,12.358,268.29-0.042,236.132,0
	c-35.271,1.037-58.823,25.503-62.556,29.629c-0.332,0.353-0.809,0.56-1.285,0.519c-3.09-0.229-14.68-0.727-22.268,4.478
	c-9.559,6.553-18.082,11.072-17.833,35.124c0.229,21.958,8.356,35.58,14.805,29.836c1.39,2.385,5.745,10.285,7.922,18.433
	c-1.827,0.125-4.771,0.788-7.507-0.809c-3.049-1.762-3.773-3.068-3.773-3.068s1.389,6.096,10.74,6.676
	c0.435,0.021,0.829,0.041,1.201,0.062c0.395,1.929,0.623,3.836,0.623,5.641c0,11.154-4.687,16.711-9.206,23.803
	c-5.806,9.122,6.759,11.962,11.218,13.103c4.458,1.121,7.483,7.091,5.971,11.571c-1.7,5.018-4.166,4.229-1.929,8.853
	c2.074,4.209,7.899-0.415,7.899,1.472c0,1.887-6.096,2.364-4.291,6.864c1.225,3.027,2.654,3.711,5.931,5.35
	c3.276,1.637,2.714,10.948,3.712,15.612c1.014,4.645,6.364,9.559,19.47,5.91c11.091-3.089,20.069-9.539,24.983-10.596
	c0.809-0.166,6.779-1.72,9.973,3.754c2.322,4.021,0.083,18.784-4.125,30.769c-5.039,14.347-9.788,24.052-19.988,34.502
	c-10.201,10.45-32.533,30.936-45.884,39.996c-2.488,1.7-5.04,3.442-7.548,5.328c-0.374-0.456-0.727-0.932-1.12-1.409
	c-1.866-2.218-6.531-7.133-8.046-9.6c-1.472-2.446,0.727-5.288,3.774-7.07c5.04-2.944,7.134-4.438,12.689-2.861
	c14.141,4.002,18.64-5.35,19.034-11.177c0.395-6.053-9.994-9.433-12.877-10.241c-8.045-2.239-16.027-0.622-24.071-0.021
	c-6.511,0.476-13.104,0.6-17.957-5.122c-1.367-1.638-2.902-3.463,0.146-4.707c7.318-2.985,7.258-9.869,9.953-16.151
	c1.183-2.779,4.871-3.92,2.593-7.05c-4.935-6.718,5.161-10.617-3.981-16.112c-0.747-0.435-0.642-2.964-0.457-4.477
	c0.871-7.59,3.317-14.95,2.8-22.767c0-0.353-0.083-15.675-14.494-27.183c-18.143-14.514-39.042-17.333-61-10.761
	c-20.255,6.076-29.194,17.5-33.608,39.085c-4.064,19.841,1.201,34.812,16.938,47.274c3.734,2.944,6.698,4.561,11.094,6.344
	c3.774,1.535,1.929,4.645-0.497,8.17c-2.364,3.482-3.006,7.504-2.945,11.589c0.104,8.293,0.146,16.608,0.788,24.861
	c1.223,15.883,0.788,32.096,5.494,47.377c5.971,19.283,11.984,38.586,19.658,57.308c11.03,27.017,21.708,54.199,32.572,81.279
	c1.183,2.966,10.595,23.056,13.582,26.603c10.407,12.295,23.305,11.922,36.823,6.842c0.312-0.125,0.601-0.269,0.891-0.395
	c-0.124,1.389-0.083,2.781-0.394,4.086c-8.604,38.025-4.893,68.899,4.168,88.598c18.078,39.311,5.992,56.416,5.992,85.84
	c0,5.68,0.145,22.328,0.538,39.022h114.683c-1.824-28.595,37.119-63.067,48.898-100.681c16.066-51.355-24.363-81.064-50.164-121.137
	c-7.941-70.931,46.342-150.674,31.952-197.098c-1.785-5.806-4.749-20.879-5.558-26.913c-1.846-13.893-5.559-40.37-8.792-54.697
	c-4.541-20.03-10.595-39.666-7.567-56.273c3.026-16.63,4.914-18.143,10.201-29.09c1.658-3.443,5.246-8.667,9.018-15.924
	c-8.582,26.312,1.142,52.852,17.398,76.261c9.66,13.892,5.99,23.947-3.629,53.494c-9.476,29.132,35.766,55.587,37.053,56.334
	c-0.499-0.872-15.697-27.431-15.967-35.496c-0.478-14.784,28.841-19.532,33.01-31.33c4.166-11.777-1.287-24.01-2.136-34.024
	c-0.851-10.016,12.793-24.239,12.358-37.302C391.119,182.377,394.936,173.338,384.402,154.78z M152.365,461.957
	c-1.493,2.074-2.984,3.651-5.059,0.562c-5.473-8.232-11.135-16.34-16.381-24.717c-2.279-3.606-6.632-15.654-2.796-16.505
	c3.46-0.767,12.438,10.223,14.596,12.981c2.51,3.172,4.994,6.387,7.836,9.247c5.205,5.224,8.958,4.271,11.281-2.593
	c0.371-1.118,0.683-2.219,0.953-3.338c0.041,3.297,0.062,6.719,0.082,10.223C159.353,452.525,155.849,457.232,152.365,461.957z
	 M318.902,125.193c5.599-15.095,9.352-35.725,4.086-62.929c-0.209-1.285-0.457-2.571-0.728-3.856c1.7-1.286,2.925-3.214,3.588-5.515
	c0.146,0.125,0.27,0.248,0.394,0.372C337.314,63.468,336.236,94.776,318.902,125.193z"/>
</svg>
