<svg width="120" height="120" viewBox="0 0 120 120" fill="none" xmlns="http://www.w3.org/2000/svg">
<path d="M59.8 86.36H24V23H96.96V86.36H77" stroke="#006699" stroke-width="3" stroke-miterlimit="10"/>
<path d="M32.2793 30.4399H88.6793" stroke="#006699" stroke-width="3" stroke-miterlimit="10"/>
<path d="M32.2793 36.4399H88.6793" stroke="#006699" stroke-width="3" stroke-miterlimit="10"/>
<path d="M32.2793 42.4399H55.0793" stroke="#006699" stroke-width="3" stroke-miterlimit="10"/>
<path d="M68.3997 73.4C75.4248 73.4 81.1197 67.705 81.1197 60.68C81.1197 53.6549 75.4248 47.96 68.3997 47.96C61.3747 47.96 55.6797 53.6549 55.6797 60.68C55.6797 67.705 61.3747 73.4 68.3997 73.4Z" stroke="#006699" stroke-width="3" stroke-miterlimit="10"/>
<path d="M76.9998 70.5V96.44L68.3998 87.98L59.7998 96.44V70.5" stroke="#006699" stroke-width="3" stroke-miterlimit="10" stroke-linecap="round" stroke-linejoin="round"/>
</svg>
