C:\Users\Pavel\IdeaProjects\testdemo\src\test\java\Pages\StartPage.java
C:\Users\Pavel\IdeaProjects\testdemo\src\test\java\Pages\WebSite.java
C:\Users\Pavel\IdeaProjects\testdemo\src\test\java\Pages\LoginPage.java
C:\Users\Pavel\IdeaProjects\testdemo\src\test\java\Pages\SideBar.java
C:\Users\Pavel\IdeaProjects\testdemo\src\test\java\Pages\Tests.java
C:\Users\Pavel\IdeaProjects\testdemo\src\test\java\Pages\MainPage.java
C:\Users\Pavel\IdeaProjects\testdemo\src\test\java\Pages\TestsMoveElements.java
C:\Users\Pavel\IdeaProjects\testdemo\src\test\java\Pages\RegistrationPage.java
C:\Users\Pavel\IdeaProjects\testdemo\src\test\java\Pages\TestsBrebuiltsRendor.java
