^C:\USERS\PATRY\SOURCE\REPOS\PASJANS\PASJANS\DECK_INITIALIZATION.CPP|C:\USERS\PATRY\SOURCE\REPOS\PASJANS\PASJANS\PASJANS.CPP
C:\USERS\PATRY\SOURCE\REPOS\PASJANS\PASJANS\DEBUG\VC142.PDB
C:\USERS\PATRY\SOURCE\REPOS\PASJANS\PASJANS\DEBUG\VC142.IDB
C:\USERS\PATRY\SOURCE\REPOS\PASJANS\PASJANS\DEBUG\DECK_INITIALIZATION.OBJ
^C:\USERS\PATRY\SOURCE\REPOS\PASJANS\PASJANS\DISPLAY.CPP|C:\USERS\PATRY\SOURCE\REPOS\PASJANS\PASJANS\GAME.CPP|C:\USERS\PATRY\SOURCE\REPOS\PASJANS\PASJANS\SOLITAIRE.CPP
C:\USERS\PATRY\SOURCE\REPOS\PASJANS\PASJANS\DEBUG\VC142.PDB
C:\USERS\PATRY\SOURCE\REPOS\PASJANS\PASJANS\DEBUG\VC142.IDB
C:\USERS\PATRY\SOURCE\REPOS\PASJANS\PASJANS\DEBUG\GAME.OBJ
C:\USERS\PATRY\SOURCE\REPOS\PASJANS\PASJANS\DEBUG\DISPLAY.OBJ
C:\USERS\PATRY\SOURCE\REPOS\PASJANS\PASJANS\DEBUG\SOLITAIRE.OBJ
^C:\USERS\PATRY\SOURCE\REPOS\PASJANS\PASJANS\DECK_INITIALIZATION.CPP|C:\USERS\PATRY\SOURCE\REPOS\PASJANS\PASJANS\DISPLAY.CPP|C:\USERS\PATRY\SOURCE\REPOS\PASJANS\PASJANS\GAME.CPP|C:\USERS\PATRY\SOURCE\REPOS\PASJANS\PASJANS\SOLITAIRE.CPP
C:\USERS\PATRY\SOURCE\REPOS\PASJANS\PASJANS\DEBUG\VC142.PDB
C:\USERS\PATRY\SOURCE\REPOS\PASJANS\PASJANS\DEBUG\VC142.IDB
C:\USERS\PATRY\SOURCE\REPOS\PASJANS\PASJANS\DEBUG\GAME.OBJ
C:\USERS\PATRY\SOURCE\REPOS\PASJANS\PASJANS\DEBUG\DISPLAY.OBJ
C:\USERS\PATRY\SOURCE\REPOS\PASJANS\PASJANS\DEBUG\DECK_INITIALIZATION.OBJ
C:\USERS\PATRY\SOURCE\REPOS\PASJANS\PASJANS\DEBUG\SOLITAIRE.OBJ
^C:\USERS\PATRY\SOURCE\REPOS\PASJANS\PASJANS\SOLITAIRE.CPP
C:\USERS\PATRY\SOURCE\REPOS\PASJANS\PASJANS\DEBUG\VC142.PDB
^C:\USERS\PATRY\SOURCE\REPOS\PASJANS\PASJANS\DECK_INITIALIZATION.CPP
C:\USERS\PATRY\SOURCE\REPOS\PASJANS\PASJANS\DEBUG\VC142.PDB
^C:\USERS\PATRY\SOURCE\REPOS\PASJANS\PASJANS\DISPLAY.CPP
C:\USERS\PATRY\SOURCE\REPOS\PASJANS\PASJANS\DEBUG\VC142.PDB
^C:\USERS\PATRY\SOURCE\REPOS\PASJANS\PASJANS\GAME.CPP
C:\USERS\PATRY\SOURCE\REPOS\PASJANS\PASJANS\DEBUG\VC142.PDB
