<?xml version="1.0" encoding="UTF-8" standalone="no"?>
<!DOCTYPE svg PUBLIC "-//W3C//DTD SVG 1.1//EN"
 "http://www.w3.org/Graphics/SVG/1.1/DTD/svg11.dtd">
<!-- Generated by graphviz version 2.47.3 (20210619.1520)
 -->
<!-- Title: dependencies Pages: 1 -->
<svg width="5714pt" height="258pt"
 viewBox="0.00 0.00 5714.00 257.80" xmlns="http://www.w3.org/2000/svg" xmlns:xlink="http://www.w3.org/1999/xlink">
<g id="graph0" class="graph" transform="scale(1 1) rotate(0) translate(4 253.8)">
<title>dependencies</title>
<polygon fill="white" stroke="transparent" points="-4,4 -4,-253.8 5710,-253.8 5710,4 -4,4"/>
<text text-anchor="middle" x="2853" y="-8.2" font-family="sans-serif" font-size="14.00">dependencies</text>
<g id="clust1" class="cluster">
<title>cluster_AppModule</title>
<polygon fill="none" stroke="black" stroke-dasharray="1,5" points="8,-32.8 8,-241.8 614,-241.8 614,-32.8 8,-32.8"/>
</g>
<g id="clust2" class="cluster">
<title>cluster_AppModule_declarations</title>
<polygon fill="none" stroke="black" points="484,-40.8 484,-92.8 606,-92.8 606,-40.8 484,-40.8"/>
</g>
<g id="clust4" class="cluster">
<title>cluster_AppModule_imports</title>
<polygon fill="none" stroke="black" points="332,-40.8 332,-92.8 476,-92.8 476,-40.8 332,-40.8"/>
</g>
<g id="clust6" class="cluster">
<title>cluster_AppModule_bootstrap</title>
<polygon fill="none" stroke="black" points="268,-181.8 268,-233.8 392,-233.8 392,-181.8 268,-181.8"/>
</g>
<g id="clust7" class="cluster">
<title>cluster_AppModule_providers</title>
<polygon fill="none" stroke="black" points="16,-40.8 16,-92.8 324,-92.8 324,-40.8 16,-40.8"/>
</g>
<g id="clust14" class="cluster">
<title>cluster_DashboardModule</title>
<polygon fill="none" stroke="black" stroke-dasharray="1,5" points="622,-32.8 622,-168.8 1629,-168.8 1629,-32.8 622,-32.8"/>
</g>
<g id="clust15" class="cluster">
<title>cluster_DashboardModule_declarations</title>
<polygon fill="none" stroke="black" points="630,-40.8 630,-92.8 1621,-92.8 1621,-40.8 630,-40.8"/>
</g>
<g id="clust25" class="cluster">
<title>cluster_EcomboxModule</title>
<polygon fill="none" stroke="black" stroke-dasharray="1,5" points="2192,-108.8 2192,-233.8 3059,-233.8 3059,-108.8 2192,-108.8"/>
</g>
<g id="clust26" class="cluster">
<title>cluster_EcomboxModule_declarations</title>
<polygon fill="none" stroke="black" points="2774,-116.8 2774,-168.8 3051,-168.8 3051,-116.8 2774,-116.8"/>
</g>
<g id="clust29" class="cluster">
<title>cluster_EcomboxModule_imports</title>
<polygon fill="none" stroke="black" points="2200,-116.8 2200,-168.8 2766,-168.8 2766,-116.8 2200,-116.8"/>
</g>
<g id="clust39" class="cluster">
<title>cluster_ImagesModule</title>
<polygon fill="none" stroke="black" stroke-dasharray="1,5" points="1637,-32.8 1637,-100.8 1791,-100.8 1791,-32.8 1637,-32.8"/>
</g>
<g id="clust40" class="cluster">
<title>cluster_ImagesModule_declarations</title>
<polygon fill="none" stroke="black" points="1645,-40.8 1645,-92.8 1783,-92.8 1783,-40.8 1645,-40.8"/>
</g>
<g id="clust46" class="cluster">
<title>cluster_MiscellaneousModule</title>
<polygon fill="none" stroke="black" stroke-dasharray="1,5" points="1799,-32.8 1799,-100.8 2359,-100.8 2359,-32.8 1799,-32.8"/>
</g>
<g id="clust47" class="cluster">
<title>cluster_MiscellaneousModule_declarations</title>
<polygon fill="none" stroke="black" points="2017,-40.8 2017,-92.8 2351,-92.8 2351,-40.8 2017,-40.8"/>
</g>
<g id="clust50" class="cluster">
<title>cluster_MiscellaneousModule_imports</title>
<polygon fill="none" stroke="black" points="1807,-40.8 1807,-92.8 2009,-92.8 2009,-40.8 1807,-40.8"/>
</g>
<g id="clust60" class="cluster">
<title>cluster_ServersModule</title>
<polygon fill="none" stroke="black" stroke-dasharray="1,5" points="3517,-32.8 3517,-168.8 5698,-168.8 5698,-32.8 3517,-32.8"/>
</g>
<g id="clust61" class="cluster">
<title>cluster_ServersModule_declarations</title>
<polygon fill="none" stroke="black" points="3695,-40.8 3695,-92.8 5690,-92.8 5690,-40.8 3695,-40.8"/>
</g>
<g id="clust72" class="cluster">
<title>cluster_ServersModule_imports</title>
<polygon fill="none" stroke="black" points="3525,-40.8 3525,-92.8 3687,-92.8 3687,-40.8 3525,-40.8"/>
</g>
<g id="clust82" class="cluster">
<title>cluster_SharedModule</title>
<polygon fill="none" stroke="black" stroke-dasharray="1,5" points="2367,-32.8 2367,-100.8 3509,-100.8 3509,-32.8 2367,-32.8"/>
</g>
<g id="clust87" class="cluster">
<title>cluster_SharedModule_providers</title>
<polygon fill="none" stroke="black" points="2375,-40.8 2375,-92.8 3501,-92.8 3501,-40.8 2375,-40.8"/>
</g>
<!-- AppComponent -->
<g id="node1" class="node">
<title>AppComponent</title>
<polygon fill="#ffffb3" stroke="black" points="597.94,-84.8 492.06,-84.8 492.06,-48.8 597.94,-48.8 597.94,-84.8"/>
<text text-anchor="middle" x="545" y="-62.6" font-family="Times,serif" font-size="14.00">AppComponent</text>
</g>
<!-- AppModule -->
<g id="node2" class="node">
<title>AppModule</title>
<polygon fill="#8dd3c7" stroke="black" points="371.66,-160.8 368.66,-164.8 347.66,-164.8 344.66,-160.8 288.34,-160.8 288.34,-124.8 371.66,-124.8 371.66,-160.8"/>
<text text-anchor="middle" x="330" y="-138.6" font-family="Times,serif" font-size="14.00">AppModule</text>
</g>
<!-- AppComponent&#45;&gt;AppModule -->
<g id="edge1" class="edge">
<title>AppComponent&#45;&gt;AppModule</title>
<path fill="none" stroke="black" d="M545,-84.83C545,-109.78 545,-151.8 545,-151.8 545,-151.8 381.71,-151.8 381.71,-151.8"/>
<polygon fill="black" stroke="black" points="381.71,-148.3 371.71,-151.8 381.71,-155.3 381.71,-148.3"/>
</g>
<!-- AppComponent  -->
<g id="node4" class="node">
<title>AppComponent </title>
<polygon fill="#80b1d3" stroke="black" points="384.44,-225.8 275.56,-225.8 275.56,-189.8 384.44,-189.8 384.44,-225.8"/>
<text text-anchor="middle" x="330" y="-203.6" font-family="Times,serif" font-size="14.00">AppComponent </text>
</g>
<!-- AppModule&#45;&gt;AppComponent  -->
<g id="edge3" class="edge">
<title>AppModule&#45;&gt;AppComponent </title>
<path fill="none" stroke="black" stroke-dasharray="1,5" d="M330,-160.91C330,-160.91 330,-179.79 330,-179.79"/>
<polygon fill="black" stroke="black" points="326.5,-179.79 330,-189.79 333.5,-179.79 326.5,-179.79"/>
</g>
<!-- AppRoutingModule -->
<g id="node3" class="node">
<title>AppRoutingModule</title>
<polygon fill="#8dd3c7" stroke="black" points="468.27,-84.8 465.27,-88.8 444.27,-88.8 441.27,-84.8 339.73,-84.8 339.73,-48.8 468.27,-48.8 468.27,-84.8"/>
<text text-anchor="middle" x="404" y="-62.6" font-family="Times,serif" font-size="14.00">AppRoutingModule</text>
</g>
<!-- AppRoutingModule&#45;&gt;AppModule -->
<g id="edge2" class="edge">
<title>AppRoutingModule&#45;&gt;AppModule</title>
<path fill="none" stroke="black" d="M355.72,-84.81C355.72,-84.81 355.72,-114.65 355.72,-114.65"/>
<polygon fill="black" stroke="black" points="352.22,-114.65 355.72,-124.65 359.22,-114.65 352.22,-114.65"/>
</g>
<!-- AuthService -->
<g id="node5" class="node">
<title>AuthService</title>
<ellipse fill="#fdb462" stroke="black" cx="257" cy="-66.8" rx="59.11" ry="18"/>
<text text-anchor="middle" x="257" y="-62.6" font-family="Times,serif" font-size="14.00">AuthService</text>
</g>
<!-- AuthService&#45;&gt;AppModule -->
<g id="edge4" class="edge">
<title>AuthService&#45;&gt;AppModule</title>
<path fill="none" stroke="black" d="M302.24,-78.68C302.24,-78.68 302.24,-114.79 302.24,-114.79"/>
<polygon fill="black" stroke="black" points="298.74,-114.79 302.24,-124.79 305.74,-114.79 298.74,-114.79"/>
</g>
<!-- TokenInterceptor -->
<g id="node6" class="node">
<title>TokenInterceptor</title>
<ellipse fill="#fdb462" stroke="black" cx="102" cy="-66.8" rx="78.13" ry="18"/>
<text text-anchor="middle" x="102" y="-62.6" font-family="Times,serif" font-size="14.00">TokenInterceptor</text>
</g>
<!-- TokenInterceptor&#45;&gt;AppModule -->
<g id="edge5" class="edge">
<title>TokenInterceptor&#45;&gt;AppModule</title>
<path fill="none" stroke="black" d="M102,-84.81C102,-107.29 102,-142.8 102,-142.8 102,-142.8 278.18,-142.8 278.18,-142.8"/>
<polygon fill="black" stroke="black" points="278.18,-146.3 288.18,-142.8 278.18,-139.3 278.18,-146.3"/>
</g>
<!-- DashboardComponent -->
<g id="node7" class="node">
<title>DashboardComponent</title>
<polygon fill="#ffffb3" stroke="black" points="1612.97,-84.8 1471.03,-84.8 1471.03,-48.8 1612.97,-48.8 1612.97,-84.8"/>
<text text-anchor="middle" x="1542" y="-62.6" font-family="Times,serif" font-size="14.00">DashboardComponent</text>
</g>
<!-- DashboardModule -->
<g id="node12" class="node">
<title>DashboardModule</title>
<polygon fill="#8dd3c7" stroke="black" points="1298.19,-160.8 1295.19,-164.8 1274.19,-164.8 1271.19,-160.8 1177.81,-160.8 1177.81,-124.8 1298.19,-124.8 1298.19,-160.8"/>
<text text-anchor="middle" x="1238" y="-138.6" font-family="Times,serif" font-size="14.00">DashboardModule</text>
</g>
<!-- DashboardComponent&#45;&gt;DashboardModule -->
<g id="edge6" class="edge">
<title>DashboardComponent&#45;&gt;DashboardModule</title>
<path fill="none" stroke="black" d="M1542,-85C1542,-109.16 1542,-148.8 1542,-148.8 1542,-148.8 1308.42,-148.8 1308.42,-148.8"/>
<polygon fill="black" stroke="black" points="1308.42,-145.3 1298.42,-148.8 1308.42,-152.3 1308.42,-145.3"/>
</g>
<!-- EcomboxServerDetailsComponent -->
<g id="node8" class="node">
<title>EcomboxServerDetailsComponent</title>
<polygon fill="#ffffb3" stroke="black" points="1452.68,-84.8 1241.32,-84.8 1241.32,-48.8 1452.68,-48.8 1452.68,-84.8"/>
<text text-anchor="middle" x="1347" y="-62.6" font-family="Times,serif" font-size="14.00">EcomboxServerDetailsComponent</text>
</g>
<!-- EcomboxServerDetailsComponent&#45;&gt;DashboardModule -->
<g id="edge7" class="edge">
<title>EcomboxServerDetailsComponent&#45;&gt;DashboardModule</title>
<path fill="none" stroke="black" d="M1269.75,-84.81C1269.75,-84.81 1269.75,-114.65 1269.75,-114.65"/>
<polygon fill="black" stroke="black" points="1266.25,-114.65 1269.75,-124.65 1273.25,-114.65 1266.25,-114.65"/>
</g>
<!-- EcomboxServerPieComponent -->
<g id="node9" class="node">
<title>EcomboxServerPieComponent</title>
<polygon fill="#ffffb3" stroke="black" points="1223.91,-84.8 1034.09,-84.8 1034.09,-48.8 1223.91,-48.8 1223.91,-84.8"/>
<text text-anchor="middle" x="1129" y="-62.6" font-family="Times,serif" font-size="14.00">EcomboxServerPieComponent</text>
</g>
<!-- EcomboxServerPieComponent&#45;&gt;DashboardModule -->
<g id="edge8" class="edge">
<title>EcomboxServerPieComponent&#45;&gt;DashboardModule</title>
<path fill="none" stroke="black" d="M1200.81,-84.81C1200.81,-84.81 1200.81,-114.65 1200.81,-114.65"/>
<polygon fill="black" stroke="black" points="1197.31,-114.65 1200.81,-124.65 1204.31,-114.65 1197.31,-114.65"/>
</g>
<!-- EcomboxStateComponent -->
<g id="node10" class="node">
<title>EcomboxStateComponent</title>
<polygon fill="#ffffb3" stroke="black" points="1016.48,-84.8 853.52,-84.8 853.52,-48.8 1016.48,-48.8 1016.48,-84.8"/>
<text text-anchor="middle" x="935" y="-62.6" font-family="Times,serif" font-size="14.00">EcomboxStateComponent</text>
</g>
<!-- EcomboxStateComponent&#45;&gt;DashboardModule -->
<g id="edge9" class="edge">
<title>EcomboxStateComponent&#45;&gt;DashboardModule</title>
<path fill="none" stroke="black" d="M935,-85.11C935,-104.95 935,-133.8 935,-133.8 935,-133.8 1167.77,-133.8 1167.77,-133.8"/>
<polygon fill="black" stroke="black" points="1167.77,-137.3 1177.77,-133.8 1167.77,-130.3 1167.77,-137.3"/>
</g>
<!-- EcomboxUsageStatsComponent -->
<g id="node11" class="node">
<title>EcomboxUsageStatsComponent</title>
<polygon fill="#ffffb3" stroke="black" points="835.69,-84.8 638.31,-84.8 638.31,-48.8 835.69,-48.8 835.69,-84.8"/>
<text text-anchor="middle" x="737" y="-62.6" font-family="Times,serif" font-size="14.00">EcomboxUsageStatsComponent</text>
</g>
<!-- EcomboxUsageStatsComponent&#45;&gt;DashboardModule -->
<g id="edge10" class="edge">
<title>EcomboxUsageStatsComponent&#45;&gt;DashboardModule</title>
<path fill="none" stroke="black" d="M737,-84.81C737,-107.29 737,-142.8 737,-142.8 737,-142.8 1167.57,-142.8 1167.57,-142.8"/>
<polygon fill="black" stroke="black" points="1167.57,-146.3 1177.57,-142.8 1167.57,-139.3 1167.57,-146.3"/>
</g>
<!-- EcomboxModule -->
<g id="node15" class="node">
<title>EcomboxModule</title>
<polygon fill="#8dd3c7" stroke="black" points="2589.71,-225.8 2586.71,-229.8 2565.71,-229.8 2562.71,-225.8 2476.29,-225.8 2476.29,-189.8 2589.71,-189.8 2589.71,-225.8"/>
<text text-anchor="middle" x="2533" y="-203.6" font-family="Times,serif" font-size="14.00">EcomboxModule</text>
</g>
<!-- DashboardModule&#45;&gt;EcomboxModule -->
<g id="edge13" class="edge">
<title>DashboardModule&#45;&gt;EcomboxModule</title>
<path fill="none" stroke="black" d="M1238,-161.08C1238,-182.12 1238,-213.8 1238,-213.8 1238,-213.8 2466.1,-213.8 2466.1,-213.8"/>
<polygon fill="black" stroke="black" points="2466.1,-217.3 2476.1,-213.8 2466.1,-210.3 2466.1,-217.3"/>
</g>
<!-- EcomboxComponent -->
<g id="node13" class="node">
<title>EcomboxComponent</title>
<polygon fill="#ffffb3" stroke="black" points="3043.49,-160.8 2908.51,-160.8 2908.51,-124.8 3043.49,-124.8 3043.49,-160.8"/>
<text text-anchor="middle" x="2976" y="-138.6" font-family="Times,serif" font-size="14.00">EcomboxComponent</text>
</g>
<!-- EcomboxComponent&#45;&gt;EcomboxModule -->
<g id="edge11" class="edge">
<title>EcomboxComponent&#45;&gt;EcomboxModule</title>
<path fill="none" stroke="black" d="M2976,-161.08C2976,-182.12 2976,-213.8 2976,-213.8 2976,-213.8 2600.01,-213.8 2600.01,-213.8"/>
<polygon fill="black" stroke="black" points="2600.01,-210.3 2590.01,-213.8 2600.01,-217.3 2600.01,-210.3"/>
</g>
<!-- HelpComponent -->
<g id="node14" class="node">
<title>HelpComponent</title>
<polygon fill="#ffffb3" stroke="black" points="2890.05,-160.8 2781.95,-160.8 2781.95,-124.8 2890.05,-124.8 2890.05,-160.8"/>
<text text-anchor="middle" x="2836" y="-138.6" font-family="Times,serif" font-size="14.00">HelpComponent</text>
</g>
<!-- HelpComponent&#45;&gt;EcomboxModule -->
<g id="edge12" class="edge">
<title>HelpComponent&#45;&gt;EcomboxModule</title>
<path fill="none" stroke="black" d="M2836,-160.82C2836,-178.17 2836,-201.8 2836,-201.8 2836,-201.8 2599.64,-201.8 2599.64,-201.8"/>
<polygon fill="black" stroke="black" points="2599.64,-198.3 2589.64,-201.8 2599.64,-205.3 2599.64,-198.3"/>
</g>
<!-- EcomboxRoutingModule -->
<g id="node16" class="node">
<title>EcomboxRoutingModule</title>
<polygon fill="#8dd3c7" stroke="black" points="2758.33,-160.8 2755.33,-164.8 2734.33,-164.8 2731.33,-160.8 2599.67,-160.8 2599.67,-124.8 2758.33,-124.8 2758.33,-160.8"/>
<text text-anchor="middle" x="2679" y="-138.6" font-family="Times,serif" font-size="14.00">EcomboxRoutingModule</text>
</g>
<!-- EcomboxRoutingModule&#45;&gt;EcomboxModule -->
<g id="edge14" class="edge">
<title>EcomboxRoutingModule&#45;&gt;EcomboxModule</title>
<path fill="none" stroke="black" d="M2599.64,-142.8C2591.37,-142.8 2585.91,-142.8 2585.91,-142.8 2585.91,-142.8 2585.91,-179.69 2585.91,-179.69"/>
<polygon fill="black" stroke="black" points="2582.41,-179.69 2585.91,-189.69 2589.41,-179.69 2582.41,-179.69"/>
</g>
<!-- ImagesModule -->
<g id="node17" class="node">
<title>ImagesModule</title>
<polygon fill="#8dd3c7" stroke="black" points="2307.97,-160.8 2304.97,-164.8 2283.97,-164.8 2280.97,-160.8 2208.03,-160.8 2208.03,-124.8 2307.97,-124.8 2307.97,-160.8"/>
<text text-anchor="middle" x="2258" y="-138.6" font-family="Times,serif" font-size="14.00">ImagesModule</text>
</g>
<!-- ImagesModule&#45;&gt;EcomboxModule -->
<g id="edge15" class="edge">
<title>ImagesModule&#45;&gt;EcomboxModule</title>
<path fill="none" stroke="black" d="M2258,-160.82C2258,-178.17 2258,-201.8 2258,-201.8 2258,-201.8 2466.35,-201.8 2466.35,-201.8"/>
<polygon fill="black" stroke="black" points="2466.35,-205.3 2476.35,-201.8 2466.35,-198.3 2466.35,-205.3"/>
</g>
<!-- MiscellaneousModule -->
<g id="node18" class="node">
<title>MiscellaneousModule</title>
<polygon fill="#8dd3c7" stroke="black" points="2466.41,-160.8 2463.41,-164.8 2442.41,-164.8 2439.41,-160.8 2325.59,-160.8 2325.59,-124.8 2466.41,-124.8 2466.41,-160.8"/>
<text text-anchor="middle" x="2396" y="-138.6" font-family="Times,serif" font-size="14.00">MiscellaneousModule</text>
</g>
<!-- MiscellaneousModule&#45;&gt;EcomboxModule -->
<g id="edge16" class="edge">
<title>MiscellaneousModule&#45;&gt;EcomboxModule</title>
<path fill="none" stroke="black" d="M2466.58,-142.8C2474.67,-142.8 2480.09,-142.8 2480.09,-142.8 2480.09,-142.8 2480.09,-179.69 2480.09,-179.69"/>
<polygon fill="black" stroke="black" points="2476.59,-179.69 2480.09,-189.69 2483.59,-179.69 2476.59,-179.69"/>
</g>
<!-- SharedModule -->
<g id="node19" class="node">
<title>SharedModule</title>
<polygon fill="#8dd3c7" stroke="black" points="2582.42,-160.8 2579.42,-164.8 2558.42,-164.8 2555.42,-160.8 2483.58,-160.8 2483.58,-124.8 2582.42,-124.8 2582.42,-160.8"/>
<text text-anchor="middle" x="2533" y="-138.6" font-family="Times,serif" font-size="14.00">SharedModule</text>
</g>
<!-- SharedModule&#45;&gt;EcomboxModule -->
<g id="edge17" class="edge">
<title>SharedModule&#45;&gt;EcomboxModule</title>
<path fill="none" stroke="black" d="M2533,-160.91C2533,-160.91 2533,-179.79 2533,-179.79"/>
<polygon fill="black" stroke="black" points="2529.5,-179.79 2533,-189.79 2536.5,-179.79 2529.5,-179.79"/>
</g>
<!-- ImagesComponent -->
<g id="node20" class="node">
<title>ImagesComponent</title>
<polygon fill="#ffffb3" stroke="black" points="1774.76,-84.8 1653.24,-84.8 1653.24,-48.8 1774.76,-48.8 1774.76,-84.8"/>
<text text-anchor="middle" x="1714" y="-62.6" font-family="Times,serif" font-size="14.00">ImagesComponent</text>
</g>
<!-- ImagesComponent&#45;&gt;ImagesModule -->
<g id="edge18" class="edge">
<title>ImagesComponent&#45;&gt;ImagesModule</title>
<path fill="none" stroke="black" d="M1714,-84.83C1714,-105.57 1714,-136.8 1714,-136.8 1714,-136.8 2197.8,-136.8 2197.8,-136.8"/>
<polygon fill="black" stroke="black" points="2197.8,-140.3 2207.8,-136.8 2197.8,-133.3 2197.8,-140.3"/>
</g>
<!-- MiscellaneousComponent -->
<g id="node21" class="node">
<title>MiscellaneousComponent</title>
<polygon fill="#ffffb3" stroke="black" points="2343.2,-84.8 2180.8,-84.8 2180.8,-48.8 2343.2,-48.8 2343.2,-84.8"/>
<text text-anchor="middle" x="2262" y="-62.6" font-family="Times,serif" font-size="14.00">MiscellaneousComponent</text>
</g>
<!-- MiscellaneousComponent&#45;&gt;MiscellaneousModule -->
<g id="edge19" class="edge">
<title>MiscellaneousComponent&#45;&gt;MiscellaneousModule</title>
<path fill="none" stroke="black" d="M2338.77,-84.81C2338.77,-84.81 2338.77,-114.65 2338.77,-114.65"/>
<polygon fill="black" stroke="black" points="2335.27,-114.65 2338.77,-124.65 2342.27,-114.65 2335.27,-114.65"/>
</g>
<!-- NotFoundComponent -->
<g id="node22" class="node">
<title>NotFoundComponent</title>
<polygon fill="#ffffb3" stroke="black" points="2163.11,-84.8 2024.89,-84.8 2024.89,-48.8 2163.11,-48.8 2163.11,-84.8"/>
<text text-anchor="middle" x="2094" y="-62.6" font-family="Times,serif" font-size="14.00">NotFoundComponent</text>
</g>
<!-- NotFoundComponent&#45;&gt;MiscellaneousModule -->
<g id="edge20" class="edge">
<title>NotFoundComponent&#45;&gt;MiscellaneousModule</title>
<path fill="none" stroke="black" d="M2094,-84.92C2094,-87.77 2094,-89.8 2094,-89.8 2094,-89.8 2334.45,-89.8 2334.45,-89.8 2334.45,-89.8 2334.45,-114.56 2334.45,-114.56"/>
<polygon fill="black" stroke="black" points="2330.95,-114.56 2334.45,-124.56 2337.95,-114.56 2330.95,-114.56"/>
</g>
<!-- MiscellaneousRoutingModule -->
<g id="node23" class="node">
<title>MiscellaneousRoutingModule</title>
<polygon fill="#8dd3c7" stroke="black" points="2000.53,-84.8 1997.53,-88.8 1976.53,-88.8 1973.53,-84.8 1815.47,-84.8 1815.47,-48.8 2000.53,-48.8 2000.53,-84.8"/>
<text text-anchor="middle" x="1908" y="-62.6" font-family="Times,serif" font-size="14.00">MiscellaneousRoutingModule</text>
</g>
<!-- MiscellaneousRoutingModule&#45;&gt;MiscellaneousModule -->
<g id="edge21" class="edge">
<title>MiscellaneousRoutingModule&#45;&gt;MiscellaneousModule</title>
<path fill="none" stroke="black" d="M1908,-85.01C1908,-90.35 1908,-94.8 1908,-94.8 1908,-94.8 2330.12,-94.8 2330.12,-94.8 2330.12,-94.8 2330.12,-114.65 2330.12,-114.65"/>
<polygon fill="black" stroke="black" points="2326.62,-114.65 2330.12,-124.65 2333.62,-114.65 2326.62,-114.65"/>
</g>
<!-- DialogMultipleStacksPromptComponent -->
<g id="node24" class="node">
<title>DialogMultipleStacksPromptComponent</title>
<polygon fill="#ffffb3" stroke="black" points="5681.93,-84.8 5436.07,-84.8 5436.07,-48.8 5681.93,-48.8 5681.93,-84.8"/>
<text text-anchor="middle" x="5559" y="-62.6" font-family="Times,serif" font-size="14.00">DialogMultipleStacksPromptComponent</text>
</g>
<!-- ServersModule -->
<g id="node34" class="node">
<title>ServersModule</title>
<polygon fill="#8dd3c7" stroke="black" points="4581.53,-160.8 4578.53,-164.8 4557.53,-164.8 4554.53,-160.8 4480.47,-160.8 4480.47,-124.8 4581.53,-124.8 4581.53,-160.8"/>
<text text-anchor="middle" x="4531" y="-138.6" font-family="Times,serif" font-size="14.00">ServersModule</text>
</g>
<!-- DialogMultipleStacksPromptComponent&#45;&gt;ServersModule -->
<g id="edge22" class="edge">
<title>DialogMultipleStacksPromptComponent&#45;&gt;ServersModule</title>
<path fill="none" stroke="black" d="M5559,-85.03C5559,-110.81 5559,-154.8 5559,-154.8 5559,-154.8 4591.63,-154.8 4591.63,-154.8"/>
<polygon fill="black" stroke="black" points="4591.63,-151.3 4581.63,-154.8 4591.63,-158.3 4591.63,-151.3"/>
</g>
<!-- DialogNamePromptComponent -->
<g id="node25" class="node">
<title>DialogNamePromptComponent</title>
<polygon fill="#ffffb3" stroke="black" points="5418.09,-84.8 5223.91,-84.8 5223.91,-48.8 5418.09,-48.8 5418.09,-84.8"/>
<text text-anchor="middle" x="5321" y="-62.6" font-family="Times,serif" font-size="14.00">DialogNamePromptComponent</text>
</g>
<!-- DialogNamePromptComponent&#45;&gt;ServersModule -->
<g id="edge23" class="edge">
<title>DialogNamePromptComponent&#45;&gt;ServersModule</title>
<path fill="none" stroke="black" d="M5321,-85C5321,-109.16 5321,-148.8 5321,-148.8 5321,-148.8 4591.62,-148.8 4591.62,-148.8"/>
<polygon fill="black" stroke="black" points="4591.62,-145.3 4581.62,-148.8 4591.62,-152.3 4591.62,-145.3"/>
</g>
<!-- DialogTemplateComponent -->
<g id="node26" class="node">
<title>DialogTemplateComponent</title>
<polygon fill="#ffffb3" stroke="black" points="5206.3,-84.8 5033.7,-84.8 5033.7,-48.8 5206.3,-48.8 5206.3,-84.8"/>
<text text-anchor="middle" x="5120" y="-62.6" font-family="Times,serif" font-size="14.00">DialogTemplateComponent</text>
</g>
<!-- DialogTemplateComponent&#45;&gt;ServersModule -->
<g id="edge24" class="edge">
<title>DialogTemplateComponent&#45;&gt;ServersModule</title>
<path fill="none" stroke="black" d="M5120,-84.81C5120,-107.29 5120,-142.8 5120,-142.8 5120,-142.8 4591.73,-142.8 4591.73,-142.8"/>
<polygon fill="black" stroke="black" points="4591.73,-139.3 4581.73,-142.8 4591.73,-146.3 4591.73,-139.3"/>
</g>
<!-- ServerAdvancedCardComponent -->
<g id="node27" class="node">
<title>ServerAdvancedCardComponent</title>
<polygon fill="#ffffb3" stroke="black" points="5015.83,-84.8 4814.17,-84.8 4814.17,-48.8 5015.83,-48.8 5015.83,-84.8"/>
<text text-anchor="middle" x="4915" y="-62.6" font-family="Times,serif" font-size="14.00">ServerAdvancedCardComponent</text>
</g>
<!-- ServerAdvancedCardComponent&#45;&gt;ServersModule -->
<g id="edge25" class="edge">
<title>ServerAdvancedCardComponent&#45;&gt;ServersModule</title>
<path fill="none" stroke="black" d="M4915,-84.83C4915,-105.57 4915,-136.8 4915,-136.8 4915,-136.8 4591.6,-136.8 4591.6,-136.8"/>
<polygon fill="black" stroke="black" points="4591.6,-133.3 4581.6,-136.8 4591.6,-140.3 4591.6,-133.3"/>
</g>
<!-- ServerAdvancedComponent -->
<g id="node28" class="node">
<title>ServerAdvancedComponent</title>
<polygon fill="#ffffb3" stroke="black" points="4796.12,-84.8 4621.88,-84.8 4621.88,-48.8 4796.12,-48.8 4796.12,-84.8"/>
<text text-anchor="middle" x="4709" y="-62.6" font-family="Times,serif" font-size="14.00">ServerAdvancedComponent</text>
</g>
<!-- ServerAdvancedComponent&#45;&gt;ServersModule -->
<g id="edge26" class="edge">
<title>ServerAdvancedComponent&#45;&gt;ServersModule</title>
<path fill="none" stroke="black" d="M4709,-84.97C4709,-103.89 4709,-130.8 4709,-130.8 4709,-130.8 4591.53,-130.8 4591.53,-130.8"/>
<polygon fill="black" stroke="black" points="4591.53,-127.3 4581.53,-130.8 4591.53,-134.3 4591.53,-127.3"/>
</g>
<!-- ServerBaseComponent -->
<g id="node29" class="node">
<title>ServerBaseComponent</title>
<polygon fill="#ffffb3" stroke="black" points="4603.58,-84.8 4458.42,-84.8 4458.42,-48.8 4603.58,-48.8 4603.58,-84.8"/>
<text text-anchor="middle" x="4531" y="-62.6" font-family="Times,serif" font-size="14.00">ServerBaseComponent</text>
</g>
<!-- ServerBaseComponent&#45;&gt;ServersModule -->
<g id="edge27" class="edge">
<title>ServerBaseComponent&#45;&gt;ServersModule</title>
<path fill="none" stroke="black" d="M4531,-84.81C4531,-84.81 4531,-114.65 4531,-114.65"/>
<polygon fill="black" stroke="black" points="4527.5,-114.65 4531,-124.65 4534.5,-114.65 4527.5,-114.65"/>
</g>
<!-- ServerStatusCardComponent -->
<g id="node30" class="node">
<title>ServerStatusCardComponent</title>
<polygon fill="#ffffb3" stroke="black" points="4440.8,-84.8 4261.2,-84.8 4261.2,-48.8 4440.8,-48.8 4440.8,-84.8"/>
<text text-anchor="middle" x="4351" y="-62.6" font-family="Times,serif" font-size="14.00">ServerStatusCardComponent</text>
</g>
<!-- ServerStatusCardComponent&#45;&gt;ServersModule -->
<g id="edge28" class="edge">
<title>ServerStatusCardComponent&#45;&gt;ServersModule</title>
<path fill="none" stroke="black" d="M4351,-84.97C4351,-103.89 4351,-130.8 4351,-130.8 4351,-130.8 4470.38,-130.8 4470.38,-130.8"/>
<polygon fill="black" stroke="black" points="4470.38,-134.3 4480.38,-130.8 4470.38,-127.3 4470.38,-134.3"/>
</g>
<!-- ServersCreateComponent -->
<g id="node31" class="node">
<title>ServersCreateComponent</title>
<polygon fill="#ffffb3" stroke="black" points="4242.84,-84.8 4083.16,-84.8 4083.16,-48.8 4242.84,-48.8 4242.84,-84.8"/>
<text text-anchor="middle" x="4163" y="-62.6" font-family="Times,serif" font-size="14.00">ServersCreateComponent</text>
</g>
<!-- ServersCreateComponent&#45;&gt;ServersModule -->
<g id="edge29" class="edge">
<title>ServersCreateComponent&#45;&gt;ServersModule</title>
<path fill="none" stroke="black" d="M4163,-84.83C4163,-105.57 4163,-136.8 4163,-136.8 4163,-136.8 4470.22,-136.8 4470.22,-136.8"/>
<polygon fill="black" stroke="black" points="4470.22,-140.3 4480.22,-136.8 4470.22,-133.3 4470.22,-140.3"/>
</g>
<!-- ServersManageComponent -->
<g id="node32" class="node">
<title>ServersManageComponent</title>
<polygon fill="#ffffb3" stroke="black" points="4065.4,-84.8 3896.6,-84.8 3896.6,-48.8 4065.4,-48.8 4065.4,-84.8"/>
<text text-anchor="middle" x="3981" y="-62.6" font-family="Times,serif" font-size="14.00">ServersManageComponent</text>
</g>
<!-- ServersManageComponent&#45;&gt;ServersModule -->
<g id="edge30" class="edge">
<title>ServersManageComponent&#45;&gt;ServersModule</title>
<path fill="none" stroke="black" d="M3981,-84.81C3981,-107.29 3981,-142.8 3981,-142.8 3981,-142.8 4470.24,-142.8 4470.24,-142.8"/>
<polygon fill="black" stroke="black" points="4470.24,-146.3 4480.24,-142.8 4470.24,-139.3 4470.24,-146.3"/>
</g>
<!-- ShowcaseDialogComponent -->
<g id="node33" class="node">
<title>ShowcaseDialogComponent</title>
<polygon fill="#ffffb3" stroke="black" points="3878.91,-84.8 3703.09,-84.8 3703.09,-48.8 3878.91,-48.8 3878.91,-84.8"/>
<text text-anchor="middle" x="3791" y="-62.6" font-family="Times,serif" font-size="14.00">ShowcaseDialogComponent</text>
</g>
<!-- ShowcaseDialogComponent&#45;&gt;ServersModule -->
<g id="edge31" class="edge">
<title>ShowcaseDialogComponent&#45;&gt;ServersModule</title>
<path fill="none" stroke="black" d="M3791,-85C3791,-109.16 3791,-148.8 3791,-148.8 3791,-148.8 4470.43,-148.8 4470.43,-148.8"/>
<polygon fill="black" stroke="black" points="4470.43,-152.3 4480.43,-148.8 4470.43,-145.3 4470.43,-152.3"/>
</g>
<!-- ServersRoutingModule -->
<g id="node35" class="node">
<title>ServersRoutingModule</title>
<polygon fill="#8dd3c7" stroke="black" points="3679.15,-84.8 3676.15,-88.8 3655.15,-88.8 3652.15,-84.8 3532.85,-84.8 3532.85,-48.8 3679.15,-48.8 3679.15,-84.8"/>
<text text-anchor="middle" x="3606" y="-62.6" font-family="Times,serif" font-size="14.00">ServersRoutingModule</text>
</g>
<!-- ServersRoutingModule&#45;&gt;ServersModule -->
<g id="edge32" class="edge">
<title>ServersRoutingModule&#45;&gt;ServersModule</title>
<path fill="none" stroke="black" d="M3606,-85.03C3606,-110.81 3606,-154.8 3606,-154.8 3606,-154.8 4470.28,-154.8 4470.28,-154.8"/>
<polygon fill="black" stroke="black" points="4470.28,-158.3 4480.28,-154.8 4470.28,-151.3 4470.28,-158.3"/>
</g>
<!-- ContainerService -->
<g id="node36" class="node">
<title>ContainerService</title>
<ellipse fill="#fdb462" stroke="black" cx="3415" cy="-66.8" rx="78.15" ry="18"/>
<text text-anchor="middle" x="3415" y="-62.6" font-family="Times,serif" font-size="14.00">ContainerService</text>
</g>
<!-- ContainerService&#45;&gt;SharedModule -->
<g id="edge33" class="edge">
<title>ContainerService&#45;&gt;SharedModule</title>
<path fill="none" stroke="black" d="M3415,-85.04C3415,-100.37 3415,-119.8 3415,-119.8 3415,-119.8 2576.69,-119.8 2576.69,-119.8 2576.69,-119.8 2576.69,-120.29 2576.69,-120.29"/>
<polygon fill="black" stroke="black" points="2573.19,-114.68 2576.69,-124.68 2580.19,-114.68 2573.19,-114.68"/>
</g>
<!-- DockerRegistryService -->
<g id="node37" class="node">
<title>DockerRegistryService</title>
<ellipse fill="#fdb462" stroke="black" cx="3218" cy="-66.8" rx="101.26" ry="18"/>
<text text-anchor="middle" x="3218" y="-62.6" font-family="Times,serif" font-size="14.00">DockerRegistryService</text>
</g>
<!-- DockerRegistryService&#45;&gt;SharedModule -->
<g id="edge34" class="edge">
<title>DockerRegistryService&#45;&gt;SharedModule</title>
<path fill="none" stroke="black" d="M3218,-84.95C3218,-98.54 3218,-114.8 3218,-114.8 3218,-114.8 2571.17,-114.8 2571.17,-114.8 2571.17,-114.8 2571.17,-115.78 2571.17,-115.78"/>
<polygon fill="black" stroke="black" points="2567.67,-114.59 2571.17,-124.59 2574.67,-114.59 2567.67,-114.59"/>
</g>
<!-- ImageService -->
<g id="node38" class="node">
<title>ImageService</title>
<ellipse fill="#fdb462" stroke="black" cx="3035" cy="-66.8" rx="64.24" ry="18"/>
<text text-anchor="middle" x="3035" y="-62.6" font-family="Times,serif" font-size="14.00">ImageService</text>
</g>
<!-- ImageService&#45;&gt;SharedModule -->
<g id="edge35" class="edge">
<title>ImageService&#45;&gt;SharedModule</title>
<path fill="none" stroke="black" d="M3007.19,-83.3C3007.19,-95.43 3007.19,-109.8 3007.19,-109.8 3007.19,-109.8 2565.65,-109.8 2565.65,-109.8 2565.65,-109.8 2565.65,-114.76 2565.65,-114.76"/>
<polygon fill="black" stroke="black" points="2562.15,-114.76 2565.65,-124.76 2569.15,-114.76 2562.15,-114.76"/>
</g>
<!-- StackStore -->
<g id="node39" class="node">
<title>StackStore</title>
<ellipse fill="#fdb462" stroke="black" cx="2900" cy="-66.8" rx="52.74" ry="18"/>
<text text-anchor="middle" x="2900" y="-62.6" font-family="Times,serif" font-size="14.00">StackStore</text>
</g>
<!-- StackStore&#45;&gt;SharedModule -->
<g id="edge36" class="edge">
<title>StackStore&#45;&gt;SharedModule</title>
<path fill="none" stroke="black" d="M2868.7,-81.38C2868.7,-92.1 2868.7,-104.8 2868.7,-104.8 2868.7,-104.8 2560.13,-104.8 2560.13,-104.8 2560.13,-104.8 2560.13,-114.69 2560.13,-114.69"/>
<polygon fill="black" stroke="black" points="2556.63,-114.69 2560.13,-124.69 2563.63,-114.69 2556.63,-114.69"/>
</g>
<!-- StacksService -->
<g id="node40" class="node">
<title>StacksService</title>
<ellipse fill="#fdb462" stroke="black" cx="2764" cy="-66.8" rx="65.4" ry="18"/>
<text text-anchor="middle" x="2764" y="-62.6" font-family="Times,serif" font-size="14.00">StacksService</text>
</g>
<!-- StacksService&#45;&gt;SharedModule -->
<g id="edge37" class="edge">
<title>StacksService&#45;&gt;SharedModule</title>
<path fill="none" stroke="black" d="M2728.48,-82.14C2728.48,-90.76 2728.48,-99.8 2728.48,-99.8 2728.48,-99.8 2554.61,-99.8 2554.61,-99.8 2554.61,-99.8 2554.61,-114.31 2554.61,-114.31"/>
<polygon fill="black" stroke="black" points="2551.11,-114.31 2554.61,-124.31 2558.11,-114.31 2551.11,-114.31"/>
</g>
<!-- SystemService -->
<g id="node41" class="node">
<title>SystemService</title>
<ellipse fill="#fdb462" stroke="black" cx="2612" cy="-66.8" rx="68.35" ry="18"/>
<text text-anchor="middle" x="2612" y="-62.6" font-family="Times,serif" font-size="14.00">SystemService</text>
</g>
<!-- SystemService&#45;&gt;SharedModule -->
<g id="edge38" class="edge">
<title>SystemService&#45;&gt;SharedModule</title>
<path fill="none" stroke="black" d="M2549.09,-74.09C2549.09,-74.09 2549.09,-114.53 2549.09,-114.53"/>
<polygon fill="black" stroke="black" points="2545.59,-114.53 2549.09,-124.53 2552.59,-114.53 2545.59,-114.53"/>
</g>
<!-- VolumeService -->
<g id="node42" class="node">
<title>VolumeService</title>
<ellipse fill="#fdb462" stroke="black" cx="2454" cy="-66.8" rx="71.21" ry="18"/>
<text text-anchor="middle" x="2454" y="-62.6" font-family="Times,serif" font-size="14.00">VolumeService</text>
</g>
<!-- VolumeService&#45;&gt;SharedModule -->
<g id="edge39" class="edge">
<title>VolumeService&#45;&gt;SharedModule</title>
<path fill="none" stroke="black" d="M2504.45,-79.69C2504.45,-79.69 2504.45,-114.71 2504.45,-114.71"/>
<polygon fill="black" stroke="black" points="2500.95,-114.71 2504.45,-124.71 2507.95,-114.71 2500.95,-114.71"/>
</g>
</g>
</svg>
