{
    "name": "com.EyePM",
    "references": [
        "GUID:ac145e6b8c6034cdbadc8c6e26aedbcf",
        "GUID:478a2357cc57436488a56e564b08d223"
    ],
    "includePlatforms": [],
    "excludePlatforms": [],
    "allowUnsafeCode": false,
    "overrideReferences": false,
    "precompiledReferences": [],
    "autoReferenced": true,
    "defineConstraints": [],
    "versionDefines": [],
    "noEngineReferences": false
}