19:39:33.176,-0.08205737918615341
19:39:33.200,-0.08207856118679047
19:39:33.227,-0.08206052333116531
19:39:33.261,-0.08201676607131958
19:39:33.296,-0.08205313980579376
19:39:33.350,-0.08209531754255295
19:39:33.360,-0.08211035281419754
19:39:33.393,-0.08208821713924408
19:39:33.431,-0.0820067822933197
19:39:33.467,-0.08201931416988373
19:39:33.497,-0.0822172537446022
19:39:33.531,-0.08238885551691055
19:39:33.569,-0.082598015666008
19:39:33.602,-0.0827053040266037
19:39:33.633,-0.08278686553239822
19:39:33.673,-0.08281800150871277
19:39:33.697,-0.08286098390817642
19:39:33.731,-0.08287282288074493
19:39:33.765,-0.08287721872329712
19:39:33.804,-0.0828697681427002
19:39:33.832,-0.08280882984399796
19:39:33.864,-0.08277565985918045
19:39:33.903,-0.08263755589723587
19:39:33.931,-0.08251333236694336
19:39:33.977,-0.08236338198184967
19:39:34.003,-0.082187719643116
19:39:34.031,-0.0820215716958046
19:39:34.067,-0.08210840821266174
19:39:34.102,-0.08213415741920471
19:39:34.143,-0.0821341797709465
19:39:34.184,-0.08212454617023468
19:39:34.197,-0.08210849016904831
19:39:34.233,-0.08205707371234894
19:39:34.272,-0.08198745548725128
19:39:34.304,-0.08218316733837128
19:39:34.331,-0.08227114379405975
19:39:34.372,-0.08242779970169067
19:39:34.399,-0.08249648660421371
19:39:34.434,-0.08255874365568161
19:39:34.511,-0.08261457085609436
19:39:34.542,-0.08270693570375443
19:39:34.568,-0.0827735885977745
19:39:34.601,-0.082814522087574
19:39:34.635,-0.08282975107431412
19:39:34.692,-0.0828043669462204
19:39:34.735,-0.08275531232357025
19:39:34.768,-0.08272113651037216
19:39:34.807,-0.08268053829669952
19:39:34.831,-0.08263351023197174
19:39:34.871,-0.08258005231618881
19:39:34.898,-0.08252017199993134
19:39:34.998,-0.08245386183261871
19:39:35.031,-0.08238112181425095
19:39:35.107,-0.08230195939540863
19:39:35.133,-0.08212434500455856
19:39:35.164,-0.0821482464671135
19:39:35.198,-0.08244235813617706
19:39:35.230,-0.08260540664196014
19:39:35.298,-0.08274274319410324
19:39:35.332,-0.08280176669359207
19:39:35.371,-0.08297362923622131
19:39:35.397,-0.08303504437208176
19:39:35.433,-0.08304386585950851
19:39:35.464,-0.08298440277576447
19:39:35.493,-0.08291611820459366
19:39:35.529,-0.08287234604358673
19:39:35.566,-0.08276551216840744
19:39:35.595,-0.08255708962678909
19:39:35.653,-0.08238601684570312
19:39:35.701,-0.08229084312915802
19:39:35.734,-0.0821896493434906
19:39:35.764,-0.0819806382060051
19:39:35.859,-0.08208167552947998
19:39:35.895,-0.08218216150999069
19:39:35.927,-0.0822758674621582
19:39:35.997,-0.08244400471448898
19:39:36.026,-0.08258645236492157
19:39:36.062,-0.08264804631471634
19:39:36.092,-0.08270321041345596
19:39:36.134,-0.08279427886009216
19:39:36.201,-0.08288271725177765
19:39:36.294,-0.0829133540391922
19:39:36.395,-0.08288619667291641
19:39:36.431,-0.08286430686712265
19:39:36.795,-0.0821748822927475
19:39:36.826,-0.08245401829481125
19:39:36.863,-0.08253416419029236
19:39:36.893,-0.08273610472679138
19:39:36.930,-0.08279057592153549
19:39:36.961,-0.08283863216638565
19:39:36.994,-0.08288026601076126
19:39:37.030,-0.08291548490524292
19:39:37.061,-0.08296666294336319
19:39:37.795,-0.08211348950862885
19:39:38.729,-0.08243419229984283
19:39:39.240,-0.08297405391931534
19:39:39.620,-0.08219066262245178
19:39:39.900,-0.08295846730470657
19:39:40.157,-0.08229182660579681
19:39:40.562,-0.08294330537319183
19:39:40.958,-0.08236479759216309
19:39:41.400,-0.08275388181209564
