12:28:14.794,-0.08202793449163437
12:28:14.824,-0.08213608711957932
12:28:14.880,-0.0823296457529068
12:28:14.885,-0.08249720185995102
12:28:14.933,-0.08263900876045227
12:28:14.961,-0.08270025998353958
12:28:14.998,-0.08280344307422638
12:28:15.021,-0.08284537494182587
12:28:15.056,-0.08288087695837021
12:28:15.091,-0.08290993422269821
12:28:15.130,-0.08294874429702759
12:28:15.164,-0.08295848965644836
12:28:15.195,-0.08295866847038269
12:28:15.226,-0.08294910192489624
12:28:15.270,-0.08291064947843552
12:28:15.329,-0.08288177102804184
12:28:15.358,-0.08284644782543182
12:28:15.398,-0.08280468732118607
12:28:15.432,-0.08275648951530457
12:28:15.544,-0.08264077454805374
12:28:15.620,-0.08257325738668442
12:28:15.628,-0.08249930292367935
12:28:15.673,-0.08241891115903854
12:28:15.731,-0.082332082092762
12:28:15.760,-0.0822388157248497
12:28:15.807,-0.0821392685174942
12:28:15.828,-0.08203475922346115
12:28:15.860,-0.0820154994726181
12:28:15.900,-0.08212395757436752
12:28:15.924,-0.08222438395023346
12:28:15.965,-0.08231810480356216
12:28:15.995,-0.08240539580583572
12:28:16.028,-0.08248624205589294
12:28:16.063,-0.08256065100431442
12:28:16.097,-0.08274524658918381
12:28:16.122,-0.08279389888048172
12:28:16.164,-0.08287188410758972
12:28:16.189,-0.08290121704339981
12:28:16.231,-0.08295058459043503
12:28:16.266,-0.08295416086912155
12:28:16.608,-0.08294199407100677
12:28:16.609,-0.08213573694229126
12:28:16.630,-0.08201213926076889
12:28:16.660,-0.08212067931890488
12:28:16.737,-0.08222118765115738
12:28:16.775,-0.08240237087011337
12:28:16.793,-0.0825577974319458
12:28:16.826,-0.0826258510351181
12:28:16.880,-0.08274265378713608
12:28:16.890,-0.08283369243144989
12:28:16.958,-0.08289898931980133
12:28:16.991,-0.08292197436094284
12:28:17.030,-0.08293852210044861
12:28:17.062,-0.08295230567455292
12:28:17.104,-0.08294034004211426
12:28:17.152,-0.08292470127344131
12:28:17.159,-0.08290262520313263
12:28:17.206,-0.0828741118311882
12:28:17.250,-0.08279777318239212
12:28:17.259,-0.08269567787647247
12:28:17.291,-0.08249426633119583
12:28:17.323,-0.08241426199674606
12:28:17.360,-0.08232781291007996
12:28:17.403,-0.08213570713996887
12:28:17.446,-0.08203141391277313
12:28:17.461,-0.08212105184793472
12:28:17.491,-0.0822216272354126
12:28:17.532,-0.08240275084972382
12:28:17.575,-0.08248365670442581
12:28:17.594,-0.08255812525749207
12:28:17.630,-0.08262616395950317
12:28:17.674,-0.08268776535987854
12:28:17.711,-0.08274293690919876
12:28:17.785,-0.08286982774734497
12:28:17.839,-0.08289925754070282
12:28:17.885,-0.08292225003242493
12:28:17.958,-0.08293881267309189
12:28:17.960,-0.08294893801212311
12:28:18.009,-0.08295262604951859
12:28:18.061,-0.0829407125711441
12:28:18.087,-0.08292510360479355
12:28:18.124,-0.08290305733680725
12:28:18.178,-0.0828745886683464
12:28:18.226,-0.08275055885314941
12:28:18.321,-0.08232884109020233
12:28:18.374,-0.08223604410886765
12:28:18.396,-0.08203279972076416
12:28:18.434,-0.08212275803089142
12:28:18.485,-0.08231744170188904
12:28:18.520,-0.08248604089021683
12:28:18.552,-0.082560695707798
12:28:18.586,-0.08269072324037552
12:28:18.619,-0.08279502391815186
12:28:18.657,-0.08287361264228821
12:28:18.719,-0.08290326595306396
12:28:18.755,-0.08292648941278458
12:28:18.789,-0.08294328302145004
12:28:18.819,-0.08295509219169617
12:28:18.854,-0.08294617384672165
12:28:18.893,-0.08293083310127258
12:28:18.920,-0.08284623175859451
12:28:18.968,-0.08280517905950546
12:28:18.992,-0.08270379155874252
12:28:19.269,-0.08224540948867798
12:28:19.286,-0.08214659988880157
12:28:19.320,-0.0820426419377327
12:28:19.380,-0.08202394843101501
12:28:19.410,-0.08223389089107513
12:28:19.419,-0.08232803642749786
12:28:19.452,-0.08241575211286545
12:28:19.525,-0.08257191628217697
12:28:20.252,-0.08266075700521469
12:28:21.065,-0.0829274132847786
12:28:21.599,-0.0821717381477356
12:28:21.955,-0.08284930139780045
12:28:22.526,-0.08268662542104721
12:28:22.828,-0.0820833295583725
12:28:23.431,-0.08296875655651093
12:28:24.203,-0.08253445476293564
12:28:24.690,-0.08292391896247864
12:28:25.257,-0.08224499970674515
12:28:25.785,-0.08295606076717377
12:28:26.355,-0.08257679641246796
12:28:26.814,-0.08296247571706772
12:28:27.330,-0.08236630260944366
12:28:27.747,-0.08254390954971313
12:28:28.317,-0.08281836658716202
