12:27:29.941,-0.00034584925587702564,-0.6701735391140478,45.83666366667735
12:27:30.300,-0.0003740608475453899,-0.7271511548010372,45.83666395968193
12:27:30.493,-0.0003913763230489616,-0.7623094300545693,45.836664153774805
12:27:30.724,-0.0004117460367147973,-0.8038654366092748,45.836664396098605
12:27:31.035,-0.0004283211077514855,-0.8378484886796282,45.836664604531585
12:27:31.187,-0.0004508185093422131,-0.8842395161274259,45.83666490374896
12:27:31.596,-0.0004900168803873299,-0.9659225159477399,45.83666547069768
12:27:31.720,-0.000509522300675998,-1.0070607012291548,45.836665774889056
12:27:31.792,-0.0005175320725061283,-1.024067730594719,45.83666590408858
12:27:32.010,-0.0005428329250326374,-1.0782993462856754,45.83666632842454
12:27:32.191,-0.0005657416344662326,-1.1282428348254554,45.83666673452865
12:27:32.395,-0.0005859704282575172,-1.1732841920879913,45.836667111339324
12:27:32.624,-0.0006048259239769762,-1.2165109375080387,45.83666747929952
12:27:32.826,-0.0006198497524886711,-1.2525017191487944,45.83666778594611
12:27:33.143,-0.0006323629851384022,-1.2849933995785876,45.836668054232966
12:27:33.221,-0.000635610084548597,-1.2944577155486248,45.83666812738707
12:27:33.332,-0.0006383362369087981,-1.3035283332117018,45.83666819183796
12:27:33.503,-0.0006398897038812363,-1.3109115502223956,45.83666823394654
12:27:33.553,-0.0006399877381839502,-1.3135685158971382,45.83666824174659
12:27:33.754,-0.0006373011927256962,-1.3149818478800197,45.83666820188164
12:27:33.954,-0.0006319098078110892,-1.3097166162375715,45.836668103244065
12:27:34.053,-0.0006247555336687504,-1.300236547201599,45.83666796757716
12:27:34.153,-0.0006179688922854879,-1.2902124931656633,45.83666783772884
12:27:34.386,-0.0006040493029211823,-1.268101649828454,45.83666757189017
12:27:34.587,-0.0005870321453032831,-1.2394958837199412,45.83666725108302
12:27:34.689,-0.0005774302874059047,-1.2228708496819494,45.83666707287771
12:27:34.787,-0.0005671406574778273,-1.2047679316134312,45.83666688445429
12:27:34.887,-0.0005561967981276135,-1.185245571858987,45.8366666871221
12:27:35.086,-0.0005299957074081617,-1.1376158364323252,45.83666622833322
12:27:35.219,-0.0005092946162672626,-1.0992742351697107,45.83666588012977
12:27:35.422,-0.00048739917159958487,-1.0581654557035427,45.83666552608629
12:27:35.520,-0.00046449011179513377,-1.0146247171607798,45.83666517174455
12:27:35.620,-0.0004467599358139576,-0.9805924094904769,45.83666490901952
12:27:35.719,-0.00043180183302540917,-0.951665041858657,45.836664695059056
12:27:35.921,-0.00040477284347813144,-0.8989023954772714,45.83666432623308
12:27:36.020,-0.00038679428371827374,-0.863459414235886,45.83666409377497
12:27:36.220,-0.0003542231368602282,-0.7985312383496997,45.836663699257784
12:27:36.319,-0.00033969190172124453,-0.7692558815088243,45.83666353445578
12:27:36.552,-0.0003113515401492781,-0.7115757887065154,45.83666323325298
12:27:36.663,-0.0002947460198815255,-0.6774012021992395,45.83666306969398
12:27:36.764,-0.0002811456102705505,-0.6491905624429625,45.836662943050236
12:27:36.852,-0.0002651747536502626,-0.6157919825925201,45.83666280282842
12:27:37.253,-0.00022024419981018728,-0.520008996619608,45.836662458479594
12:27:39.138,-0.00013829532279845813,-0.3331396173252069,45.8366620319433
12:27:39.629,-0.0001174788415967926,-0.2774305514479182,45.836661971964425
12:27:40.021,-0.00011056524269242903,-0.2514157911454151,45.83666196159016
12:27:40.631,-0.00011909584260761965,-0.2480918728427993,45.836661994634326
12:27:41.453,-0.00016277903582638742,-0.3121396026411906,45.83666213754379
12:27:42.008,-0.00021064967797406858,-0.3950777981033463,45.836662349020294
12:27:42.906,-0.0002929239276235289,-0.5483591305102667,45.83666287537095
