12:29:32.653,-0.00015323167921382265,-0.32344968283526887,45.83663923906374
12:29:32.920,-0.00016193894572718776,-0.3141381527508833,45.83663926652082
12:29:33.197,-0.00016954069959591544,-0.3092390470091558,45.83663929001501
12:29:33.319,-0.00017509776490124755,-0.30722435267326986,45.83663930701623
12:29:33.438,-0.00018414107686735262,-0.3057802607245335,45.83663933462416
12:29:33.627,-0.00019745325911654533,-0.3071482115611449,45.8366393755374
12:29:33.793,-0.0002159588263721236,-0.31364913613366063,45.8366394340597
12:29:33.957,-0.00023420575202724476,-0.3242238616380486,45.83663949477023
12:29:34.058,-0.00024274502903193345,-0.3304712588519591,45.8366395245836
12:29:34.158,-0.00025376071000841107,-0.3392218655841952,45.836639564469216
12:29:34.291,-0.00027443083780302204,-0.35841508098880465,45.83663964430762
12:29:34.388,-0.0002840564955744244,-0.3680905026944553,45.8366396822059
12:29:34.594,-0.0003158112464184624,-0.4052604366948109,45.83663982679614
12:29:34.696,-0.0003308264194228841,-0.4258148977386212,45.836639902881444
12:29:34.792,-0.0003485847474979131,-0.4511475615093166,45.83663999901923
12:29:34.892,-0.00036132466395678934,-0.47005286542665714,45.83664007283346
12:29:34.991,-0.00037406464454094076,-0.4895664134677205,45.83664015083708
12:29:35.242,-0.0003943472345173958,-0.5218992708629457,45.83664028397473
12:29:35.392,-0.00041438662964361463,-0.5576401587106266,45.83664042698085
12:29:35.487,-0.0004291472204973803,-0.585652575270564,45.83664054040504
12:29:35.586,-0.00044121238703143475,-0.6092704573916808,45.83664063840537
12:29:35.687,-0.00045302247888109003,-0.633058351415454,45.83664073907146
12:29:35.891,-0.00047792231551237717,-0.6856207216344994,45.8366409672443
12:29:36.073,-0.000497015836653586,-0.7307094151004606,45.836641157632016
12:29:36.087,-0.0005050747019995663,-0.7511395467964379,45.836641242443946
12:29:36.264,-0.0005221087247573498,-0.7963979887127081,45.836641430916906
12:29:37.606,-0.0005750684627290652,-0.9805439421837885,45.83664210588864
12:29:38.377,-0.0005884894456071152,-1.1077709180563042,45.83664229330668
12:29:39.039,-0.0005781928917061847,-1.1679746497778227,45.836642093465656
12:29:39.887,-0.0005450241121263015,-1.2005946833320587,45.83664145826239
12:29:40.257,-0.0005106668535565713,-1.197183889371146,45.83664080036489
12:29:41.087,-0.0004433865546566612,-1.1482410619508365,45.83663954738514
12:29:41.706,-0.0003663880997740961,-1.0525408965767398,45.83663821347763
12:29:42.293,-0.00031338725638312495,-0.965531327522237,45.836637380141894
12:29:42.826,-0.0002519156873125104,-0.8444933666262255,45.83663652101013
12:29:43.500,-0.0002107809926318399,-0.7460685976535997,45.83663602356262
12:29:44.007,-0.0001730697928838968,-0.6316205476774124,45.836635632683695
12:29:44.395,-0.00016521291693142763,-0.604045871446433,45.836635560521295
12:29:44.800,-0.0001464412531764342,-0.5190840987494442,45.83663540236601
12:29:45.174,-0.00013823824036802578,-0.455514085540831,45.83663533903929
12:29:45.521,-0.00013679019271082562,-0.41782766107597474,45.83663532401056
12:29:45.743,-0.00013791589725666196,-0.39273518947156244,45.83663532473908
12:29:46.461,-0.0001625538802811038,-0.32232661392073997,45.83663540292079
12:29:47.171,-0.00021034194082029175,-0.31199009977321823,45.83663554841995
12:29:47.935,-0.0002717383377311358,-0.34976783260673994,45.83663575760106
12:29:48.416,-0.00033761017929231294,-0.42237654527980395,45.83663604773741
12:29:48.932,-0.00037556904772857274,-0.47705017951140505,45.836636257935574
12:29:49.256,-0.00042295198212446706,-0.555897662726987,45.83663657330138
12:29:49.757,-0.00048073060448908516,-0.6732436255282137,45.83663705340251
12:29:50.391,-0.000527498936950935,-0.7930441930571818,45.836637533038456
12:29:50.886,-0.0005465249043843897,-0.8508352601087202,45.83663775599859
12:29:51.428,-0.0005759459059566201,-0.97210933962434,45.836638137438754
12:29:52.330,-0.0005872322001900513,-1.0777689591484356,45.83663828960929
12:29:53.373,-0.0005703238834400789,-1.1718747821300446,45.83663795818915
12:29:54.301,-0.0005429724284419214,-1.1958691474410343,45.83663743343688
