G04 #@! TF.FileFunction,Profile,NP*
%FSLAX46Y46*%
G04 Gerber Fmt 4.6, Leading zero omitted, Abs format (unit mm)*
G04 Created by KiCad (PCBNEW 4.0.2+dfsg1-stable) date Wed 09 May 2018 11:30:02 PM PDT*
%MOMM*%
G01*
G04 APERTURE LIST*
%ADD10C,0.100000*%
%ADD11C,0.150000*%
G04 APERTURE END LIST*
D10*
D11*
X149987000Y-135686800D02*
X185547000Y-135686800D01*
X185547000Y-135686800D02*
X185547000Y-62026800D01*
X185547000Y-62026800D02*
X149987000Y-62026800D01*
X149987000Y-62026800D02*
X149987000Y-135686800D01*
M02*
