\relax 
\providecommand\hyper@newdestlabel[2]{}
\providecommand\BKM@entry[2]{}
\providecommand\HyperFirstAtBeginDocument{\AtBeginDocument}
\HyperFirstAtBeginDocument{\ifx\hyper@anchor\@undefined
\global\let\oldcontentsline\contentsline
\gdef\contentsline#1#2#3#4{\oldcontentsline{#1}{#2}{#3}}
\global\let\oldnewlabel\newlabel
\gdef\newlabel#1#2{\newlabelxx{#1}#2}
\gdef\newlabelxx#1#2#3#4#5#6{\oldnewlabel{#1}{{#2}{#3}}}
\AtEndDocument{\ifx\hyper@anchor\@undefined
\let\contentsline\oldcontentsline
\let\newlabel\oldnewlabel
\fi}
\fi}
\global\let\hyper@last\relax 
\gdef\HyperFirstAtBeginDocument#1{#1}
\providecommand\HyField@AuxAddToFields[1]{}
\providecommand\HyField@AuxAddToCoFields[2]{}
\providecommand \oddpage@label [2]{}
\BKM@entry{id=1,dest={73656374696F6E2E31},srcline={39}}{4B6D65616E73}
\@writefile{toc}{\contentsline {section}{\numberline {1}Kmeans}{2}{section.1}}
\BKM@entry{id=2,dest={73656374696F6E2E32},srcline={86}}{476175737369616E204D697874757265204D6F64656C73204578706563746174696F6E204D6178696D697A6174696F6E}
\@writefile{toc}{\contentsline {section}{\numberline {2}Gaussian Mixture Models Expectation Maximization}{3}{section.2}}
