\relax 
\providecommand\hyper@newdestlabel[2]{}
\providecommand\HyperFirstAtBeginDocument{\AtBeginDocument}
\HyperFirstAtBeginDocument{\ifx\hyper@anchor\@undefined
\global\let\oldcontentsline\contentsline
\gdef\contentsline#1#2#3#4{\oldcontentsline{#1}{#2}{#3}}
\global\let\oldnewlabel\newlabel
\gdef\newlabel#1#2{\newlabelxx{#1}#2}
\gdef\newlabelxx#1#2#3#4#5#6{\oldnewlabel{#1}{{#2}{#3}}}
\AtEndDocument{\ifx\hyper@anchor\@undefined
\let\contentsline\oldcontentsline
\let\newlabel\oldnewlabel
\fi}
\fi}
\global\let\hyper@last\relax 
\gdef\HyperFirstAtBeginDocument#1{#1}
\providecommand*\HyPL@Entry[1]{}
\HyPL@Entry{0<</S/D>>}
\providecommand \oddpage@label [2]{}
\@writefile{toc}{\contentsline {section}{\numberline {1}Summary}{1}{section.1}}
\@writefile{toc}{\contentsline {section}{\numberline {2}Preprocessing}{1}{section.2}}
\@writefile{toc}{\contentsline {section}{\numberline {3}Single Tree}{1}{section.3}}
\@writefile{toc}{\contentsline {section}{\numberline {4}Single Pruned Tree}{2}{section.4}}
\@writefile{toc}{\contentsline {section}{\numberline {5}Bagging}{4}{section.5}}
\@writefile{toc}{\contentsline {section}{\numberline {6}Mutual Information}{4}{section.6}}
\@writefile{toc}{\contentsline {section}{\numberline {7}Random Forest}{4}{section.7}}
