<svg width="260" height="260" xmlns="http://www.w3.org/2000/svg" xmlns:svg="http://www.w3.org/2000/svg" preserveAspectRatio="xMidYMid meet">
 <metadata>Eltek Logo</metadata>
 <g>
  <title>Eltek Logo</title>
  <g id="svg_1" fill="#77ce21" transform="translate(0,260) scale(0.10000000149011612,-0.10000000149011612) ">
   <path id="svg_2" d="m0,1300l0,-1300l1300,0l1300,0l0,1300l0,1300l-1300,0l-1300,0l0,-1300zm1914,581c150,-53 249,-143 327,-301c39,-80 37,-85 -9,-14c-78,119 -170,178 -282,178c-180,0 -328,-158 -460,-489c-16,-41 -51,-117 -76,-167c-112,-224 -215,-326 -370,-369c-292,-81 -551,32 -679,295c-51,103 -59,141 -11,51c37,-72 124,-161 180,-185c60,-27 122,-34 173,-21c67,18 158,86 219,164c52,66 82,123 232,437c133,277 259,398 453,435c96,19 226,12 303,-14zm-744,-66c25,-8 62,-27 83,-41l38,-25l-26,-33c-14,-19 -45,-68 -69,-110l-44,-76l-49,72c-33,50 -64,82 -97,103c-115,71 -261,13 -336,-135c-26,-50 -34,-52 -13,-2c29,70 46,96 97,150c51,55 98,84 171,109c51,17 184,11 245,-12zm872,-121c114,-38 230,-202 253,-357l7,-47l-173,0l-174,0l-17,72c-22,90 -75,202 -118,252c-28,32 -31,39 -19,51c42,42 162,56 241,29zm-1378,-459c29,-88 67,-165 117,-232l39,-52l-47,-28c-55,-32 -141,-42 -199,-23c-126,41 -245,202 -270,365l-6,45l172,-2l172,-3l22,-70zm1252,-198c-52,-109 -138,-189 -240,-223c-94,-32 -236,-15 -324,38l-32,20l25,30c14,17 44,64 67,105l40,74l26,-38c85,-129 190,-173 297,-124c46,21 117,94 142,146c9,19 18,33 21,31c2,-2 -8,-29 -22,-59z"/>
  </g>
 </g>
</svg>