<svg xmlns="http://www.w3.org/2000/svg" xmlns:xlink="http://www.w3.org/1999/xlink" version="1.1" style="" xml:space="preserve" width="652" height="652"><rect id="backgroundrect" width="100%" height="100%" x="0" y="0" fill="none" stroke="none"/>
<style type="text/css">.st0{fill:#ED2024;}</style>
<!-- Brocade Signet-->
<g class="currentLayer" style=""><title>Layer 1</title>
	<path class="st0" d="M103.08569686412807,10.28570544719696 c0,1.6 -0.6000000000000004,3 -1.7000000000000002,4.2 c-1.2,1.2 -2.6,1.7000000000000002 -4.2,1.7000000000000002 c-1.6,0 -3,-0.6000000000000004 -4.2,-1.7000000000000002 c-1.2,-1.2 -1.7000000000000002,-2.6 -1.7000000000000002,-4.2 c0,-1.6 0.6000000000000004,-3 1.7000000000000002,-4.2 c1.2,-1.2 2.6,-1.7000000000000002 4.2,-1.7000000000000002 c1.6,0 3,0.6000000000000004 4.2,1.7000000000000002 C102.48569686412816,7.2857054471969604 103.08569686412807,8.685705447196966 103.08569686412807,10.28570544719696 M102.28569686412811,10.28570544719696 c0,-1.4 -0.5,-2.6 -1.5,-3.6 c-1,-1 -2.2,-1.5 -3.6,-1.5 c-1.4,0 -2.6,0.5 -3.6,1.5 c-1,1 -1.5,2.2 -1.5,3.6 c0,1.4 0.5,2.6 1.5,3.6 c1,1 2.2,1.5 3.6,1.5 c1.4,0 2.6,-0.5 3.6,-1.5 C101.78569686412811,12.885705447196955 102.28569686412811,11.685705447196966 102.28569686412811,10.28570544719696 M99.98569686412816,13.685705447196966 h-1.1 l-1.3,-2.9 h-1.9 v2.9 h-1 v-6.9 h2.9 c0.8,0 1.4,0.2 1.8,0.6000000000000004 c0.4,0.4 0.6000000000000004,0.9 0.6000000000000004,1.3 c0,0.4 -0.1,0.7000000000000004 -0.3000000000000002,1.1 c-0.2,0.3000000000000002 -0.6000000000000004,0.6000000000000004 -1,0.7000000000000004 L99.98569686412816,13.685705447196966 zM95.58569686412807,9.985705447196949 h1.8 c0.5,0 0.8,-0.1 1,-0.3000000000000002 c0.2,-0.2 0.3000000000000002,-0.5 0.3000000000000002,-0.9 c0,-0.4 -0.1,-0.6000000000000004 -0.4,-0.8 c-0.2,-0.2 -0.5,-0.3000000000000002 -0.9,-0.3000000000000002 h-1.9 V9.985705447196949 z" id="svg_9"/>
	<path class="st0" d="M84.58569686412807,38.38570544719698 c3.9,-3.2 6.4,-8.2 6.4,-13.6 c0,-9.8 -7.9,-17.7 -17.7,-17.7 h-68.6 c17.5,17.7 34.3,26.8 47.3,31.3 c-13.1,4.5 -29.8,13.6 -47.3,31.3 H73.28569686412811 c9.8,0 17.7,-7.9 17.7,-17.7 C90.98569686412816,46.58570544719697 88.48569686412816,41.68570544719694 84.58569686412807,38.38570544719698 M72.38569686412814,60.18570544719694 h-41 c15.6,-10.9 29.1,-16.2 41,-16.2 c4.5,0 8.1,3.6 8.1,8.1 C80.48569686412816,56.48570544719695 76.88569686412814,60.18570544719694 72.38569686412814,60.18570544719694 M72.38569686412814,32.88570544719698 c-12,0 -25.4,-5.3 -41,-16.2 h41 c4.5,0 8.1,3.6 8.1,8.1 C80.48569686412816,29.185705447196938 76.88569686412814,32.88570544719698 72.38569686412814,32.88570544719698 " id="svg_10"/>	
</g></svg>