// Jest Snapshot v1, https://goo.gl/fbAQLP

exports[`Description renders a description based on id should match its snapshot 1`] = `
<div
  className="ais-InstantSearch__root"
>
  <div
    className="description"
  >
    <div
      className="descriptionTitle"
    >
      <h3>
        Description
      </h3>
    </div>
    <div
      className="descriptionText"
    >
      <div
        className="ais-MultiIndex__root"
      >
        <div />
      </div>
    </div>
  </div>
</div>
`;

exports[`Description renders a description based on id show no description available when there is no data 1`] = `
<div
  className="ais-InstantSearch__root"
>
  <div
    className="description"
  >
    <div
      className="descriptionTitle"
    >
      <h3>
        Description
      </h3>
    </div>
    <div
      className="descriptionText"
    >
      <div
        className="ais-MultiIndex__root"
      >
        <div />
      </div>
    </div>
  </div>
</div>
`;
