






Privacy policy | Luxembourg Institute of Health


                    var odoo = {
                        csrf_token: "35fb04753d9b02e113b4505b9ab897e42a30be4fo",
                    };
                









                odoo.session_info = {
                    is_superuser: false,
                    is_frontend: true,
                };
            











We use cookies in this website. Read about them in our privacy policy. To disable them, configure your browser properly. If you keep using this website, you are accepting those.

OK









Toggle navigation












Public
                                        website
                                    





About
                                        us
                                    




Find US
                                    




Jobs
                                    




Press
                                    













RESEARCH 




DEPARTMENT OF INFECTION & IMMUNITY  




Research Units




Platforms & Technologies




NextImmune - PhD training program






DEPARTMENT OF ONCOLOGY 




Research units




Platforms & Technologies




Project group PPM3




Scientific Advisory Board




Canbio - PhD training program






DEPARTMENT OF POPULATION HEALTH  




Research units




Scientific Advisory Board






RESEARCH-SUPPORT SERVICES 




Methodology and Statistics




Business Development Office




Doctoral Training 




Quality, Health, Safety and Environment








EVENTS




NEWS




TRAINING




About us 




Mission & Vision




Organisation / management




Working with LIH 




Crédit d’impôt recherche




KNOWLEDGE TRANSFER






Find us




Activity Reports







                    My cart 












            Privacy policy
          








Luxembourg Institute of Health
                  ("us", "we", or "our") operates
                  https://www.lih.lu
                  (the "Site"). This page informs you of our policies regarding the collection, use and disclosure
                  of Personal Information we receive from users of the Site.
                

                  We use your Personal Information only for providing and improving the Site. By using the Site,
                  you agree to the collection and use of information in accordance with this policy.
                










Information Collection And Use 





                  While using our Site, we may ask you to provide us with certain personally identifiable information
                  that can be used to contact or identify you. Personally identifiable information may include, but is
                  not limited to your name ("Personal Information").
                










Log Data  





                  Like many site operators, we collect information that your browser sends whenever you visit our
                  Site ("Log Data"). This Log Data may include information such as your computer's Internet
                  Protocol ("IP") address, browser type, browser version, the pages of our Site that you visit, the
                  time and date of your visit, the time spent on those pages and other statistics.
                










Cookies





                  Cookies are files with small amount of data, which may include an anonymous unique identifier.
                  Cookies are sent to your browser from a web site and stored on your computer's hard drive.
                

                  Like many sites, we use "cookies" to collect information. You can instruct your browser to refuse
                  all cookies or to indicate when a cookie is being sent. However, if you do not accept cookies, you
                  may not be able to use some portions of our Site.
                










Security 





                  The security of your Personal Information is important to us, but remember that no method of
                  transmission over the Internet, or method of electronic storage, is 100% secure. While we strive to
                  use commercially acceptable means to protect your Personal Information, we cannot guarantee
                  its absolute security.
                










Changes To This Privacy Policy




We may update this Privacy Policy from time to time. We will notify
                  you of any changes by posting the new Privacy Policy on the Site. You are advised to review this
                  Privacy Policy periodically for any changes.

                










Contact Us





                  If you have any questions about these Terms, please contact us.
                

1A-B, rue Thomas Edison
Strassen
1445
Luxembourg



Email address:
                          
odoo@lih.lu
















Stay in touch
Sign up to LIH's Newsletter




Subscribe
Thanks

Thanks for your subscription!




Support LIH
Get involved, and support biomedical research ! 100% of donations are used for our research projects.
                                    
Make
                                        a donation
                                    


Follow US


Facebook


Linkedin


Twitter













Research


Department of Infection & immunity 


Department of oncology 


Department of population health 


Research-support services 








training


knowledge transfer 






About us


Mission & vision 


Boards 


Activity reports 








Contact


Find us 




Jobs


Press



Odoo Access 










                                                      Powered by Odoo,
                                                      the #1 Open Source eCommerce.
                                                    

                                                      Copyright © Luxembourg Institute of Health- Terms of use
- Privacy Policy
- Legal Advice











Terms & conditions


site map


Copyright © 2015 Luxembourg institute of
                                health - Lih.lu
                                - all rights reserved
                            



















                    (function(i,s,o,g,r,a,m){i['GoogleAnalyticsObject']=r;i[r]=i[r]||function(){
                    (i[r].q=i[r].q||[]).push(arguments)},i[r].l=1*new Date();a=s.createElement(o),
                    m=s.getElementsByTagName(o)[0];a.async=1;a.src=g;m.parentNode.insertBefore(a,m)
                    })(window,document,'script','//www.google-analytics.com/analytics.js','ga');

                    ga('create', _.str.trim('UA-16961320-1'), 'auto');
                    ga_google_analytics_data = {};
                    for(i in ga_google_analytics_data) {
                        ga('set', i, ga_google_analytics_data[i]);
                    }
                    ga('send','pageview');
                


(function(){var f5_cspm={f5_p:'ENHCKFGBPMDKHAFNDNCLHIEJIBMPFKOADIPJIMFMBOICMLNIJMFNLLMHJFNOGMBIKEICKPDDMGEBIEFBMFDEMHNGKMCAIGECAALCBAOBHGDMIEFNAAPGEONNLEALBLBA',setCharAt:function(str,index,chr){if(index>str.length-1)return str;return str.substr(0,index)+chr+str.substr(index+1);},get_byte:function(str,i){var s=(i/16)|0;i=(i&15);s=s*32;return((str.charCodeAt(i+16+s)-65)<<4)|(str.charCodeAt(i+s)-65);},set_byte:function(str,i,b){var s=(i/16)|0;i=(i&15);s=s*32;str=f5_cspm.setCharAt(str,(i+16+s),String.fromCharCode((b>>4)+65));str=f5_cspm.setCharAt(str,(i+s),String.fromCharCode((b&15)+65));return str;},set_latency:function(str,latency){latency=latency&0xffff;str=f5_cspm.set_byte(str,48,(latency>>8));str=f5_cspm.set_byte(str,49,(latency&0xff));str=f5_cspm.set_byte(str,43,2);return str;},wait_perf_data:function(){try{var wp=window.performance.timing;if(wp.loadEventEnd>0){var res=wp.loadEventEnd-wp.navigationStart;if(res<60001){var cookie_val=f5_cspm.set_latency(f5_cspm.f5_p,res);window.document.cookie='f5avr0988419764aaaaaaaaaaaaaaaa='+encodeURIComponent(cookie_val)+';path=/';}
return;}}
catch(err){return;}
setTimeout(f5_cspm.wait_perf_data,100);return;},go:function(){var chunk=window.document.cookie.split(/\s*;\s*/);for(var i=0;i<chunk.length;++i){var pair=chunk[i].split(/\s*=\s*/);if(pair[0]=='f5_cspm'&&pair[1]=='1234')
{var d=new Date();d.setTime(d.getTime()-1000);window.document.cookie='f5_cspm=;expires='+d.toUTCString()+';path=/;';setTimeout(f5_cspm.wait_perf_data,100);}}}}
f5_cspm.go();}());