



    window.PageLoadTime = new Date().getTime();
  
 window._adblock = true; 










  if (roadblockId == null) var roadblockId = 0; //  NAVIGATOR: since -1 is DB default, a negative condition against 0 will pass and NOT roadblock any ads
  





      var googletag = googletag || {};
      googletag.cmd = googletag.cmd || [];
      (function() {
        var gads = document.createElement('script');
        gads.async = true;
        gads.type = 'text/javascript';
        var useSSL = 'https:' == document.location.protocol;
        gads.src = (useSSL ? 'https:' : 'http:') + '//www.googletagservices.com/tag/js/gpt.js';
        var node =document.getElementsByTagName('script')[0];
        node.parentNode.insertBefore(gads, node);
      })();
    

var monetateT = new Date().getTime();


      //trackData Example
      window.monetateQ = window.monetateQ || [];
    



      window[ 'optimizely' ] = [];
    


      window.log = log4javascript_stub.getLogger("main");
      var appender = new log4javascript_stub.InPageAppender();
      log.addAppender(appender);
    

  window.Krux||((Krux=function(){Krux.q.push(arguments)}).q=[]);
  (function(){
    var k=document.createElement('script');k.type='text/javascript';k.async=true;
    var m,src=(m=location.href.match(/\bkxsrc=([^&]+)/))&&decodeURIComponent(m[1]);
    k.src = /^https?:\/\/([a-z0-9_\-\.]+\.)?krxd\.net(:\d{1,5})?\//i.test(src) ? src : src === "disable" ? "" :
      (location.protocol==="https:"?"https:":"http:")+"//cdn.krxd.net/controltag?confid=qp3md5klq";
    var s=document.getElementsByTagName('script')[0];s.parentNode.insertBefore(k,s);
  }());


  window.Krux || ((Krux=function(){Krux.q.push(arguments);}).q=[]);
  (function(){
    function retrieve(n){
      var m, k='kxhealthline_'+n;
      if (window.localStorage) {
        return window.localStorage[k] || '';
      } else if (navigator.cookieEnabled) {
        m = document.cookie.match(k+'=([^;]*)');
        return (m && decodeURI(m[1])) || '';
      } else {
        return '';
      }
    }
    Krux.user = retrieve('user');
    Krux.segments = retrieve('segs') && retrieve('segs').split(',') || [];
  })();


  googletag.cmd.push(function(){
    googletag.pubads().setTargeting("ksg", Krux.segments);
    googletag.pubads().setTargeting("kuid", Krux.user);
//      googletag.pubads().enableSyncRendering();
    // the above prevents ads from loading and breaks our site. Commented out if vendor states it's necessary later on.
  });



  var gcseCallback = function () {
    $('<i class="hl-icon-magnifier"></i>').appendTo($('.headSearchBox table.gsc-search-box td.gsc-input'));
    $('#hl_global_header .gsc-input input').attr('placeholder', 'Search');

    $('.gsc-input input').click(function() {
      $('.gsc-input input').attr( 'placeholder', "" );
    })

    $('#hl_global_header input').blur(function() {
      $('#hl_global_header .gsc-input input').attr('placeholder', 'Search');
    });
    $('.headSearchBox .hl-icon-magnifier').click(function() {
      $('form.gsc-search-box input.gsc-search-button').click();
      window.hl_fireSearchEvent();
    });

    $('table.gssb_c').click(function() {
      window.hl_fireSearchEvent();
    });


    $('#hl_global_header .gsc-input input').keydown(function( event ) {
      if ( event.which == 13 ) {
        window.hl_fireSearchEvent();
      }
    });

  }

  window.__gcse = {
    callback: gcseCallback
  };

  (function () {
    var cx = 'partner-pub-4771166113579725:9487389092';
    var gcse = document.createElement('script');
    gcse.type = 'text/javascript';
    gcse.async = true;
    gcse.src = (document.location.protocol == 'https:' ? 'https:' : 'http:') +
      '//cse.google.com/cse.js?cx=' + cx;
    var s = document.getElementsByTagName('script')[0];
    s.parentNode.insertBefore(gcse, s);
  })();


      requirejs.config({
        baseUrl: '/'
      });
    

    define('hlutil', [], function () {
      var exports = {};
      var domain = exports.domain = "/";
      exports.qualifyUrl = function (url) {
        return url;
      };
      return exports;
    });

    // unica stub
    var ntptEventTag = function () {
    };
    var ntptLinkTag = function () {
    };
    var ntptSubmitTag = function () {
    };

    var arrayPromiseFunctions = [];
    var adsArrayToRefresh = [];
    var adsArrayForKIMP = [];
  



(function () {
  
      microsoft_adunit_keywordhints = "Health";
    
    u_microsoft_adunit_channelids = "";
  microsoft_adunit_channelids = "";

  
  document.write('<input id="msftChannelIds1" name="msftChannelIds1" type="hidden" value="' + microsoft_adunit_channelids + '">');

  var micrositeId = '';
  

  var isMsiteActive = 'false';

  if ( micrositeId ) {
    isMsiteActive = 'true';
  }



  

  var networkCode = 4788;
  var topLevelAdUnit = 'hn.us.hl.x.x.x.x';
  var s1 = 'otherhealthsystems';
  //var adUnit = topLevelAdUnit + '.' + s1;
  var adUnit = topLevelAdUnit;
  window.slotName = '/' + networkCode + '/' + adUnit;
  var test = '';
  var kw = 'otherhealthsystems,2810722,health';
  var k1 = 'otherhealthsystems';
  var k2 = 'healthsystems';
  var k3 = 'health';
  var ugc = 'false';
  var ac = '';
  var pv = '5'; // to dynamically set page view data
  var msiteID = micrositeId;
  var urlEncoded = '%2Fprivacy-policy';
    var url = decodeURIComponent(urlEncoded);
  var type = 'top_lb';
  var pageload = true;
  var lbPageLoad = true;
  var wslPageLoad = true;
  var mr1PageLoad = true;
  var mr2PageLoad = true;
  var mr3PageLoad = true;

  

// code to generate the random number
var adRPV = Math.floor(Math.random()*100)+1;
adRPV = adRPV.toString();



  function adDisplayGATimer(eventSlotPos, dfpAdSite, adLoadImpressionTimeRounded) {
    dataLayer.push({
      'event': 'hlAdLoad',
      'hlAdLoadCategory': 'Ad Display',
      'hlAdLoadAction': eventSlotPos + ':page load',
      'hlAdLoadInteraction': true,
      'hlAdLoadLabel': eventSlotPos + ':' + dfpAdSite + ':' + adLoadImpressionTimeRounded,
      'hlAdLoadValue': adLoadImpressionTimeRounded
    });
  }

  googletag.cmd.push(
    function () {
      var roadBlockAdsHasRun = false,
        mrlRoadBlockAdsHasRun = false,
        wslRoadBlockAdsHasRun = false;

      window.HL_gptRefreshAds = function (adPositionsToHide) {
        var adPositions = ['lb1', 'mr1', 'mr2', 'wsl', 'ws', 'pb', 'rtl', 'tl'];

        if (typeof adPositionsToHide !== 'undefined' && adPositionsToHide.length > 0) {

          for (var i = 0; i < adPositionsToHide.length; i++) {
            for (var j = 0; j < adPositions.length; j++) {
              if (adPositionsToHide[i] == adPositions[j]) {
                adPositions.splice(j, 1);
                break;
              }
            }
          }

          for (var k = 0; k < adPositions.length; k++) {
            var adObject = {
              label: null
            };
            var adLoadStart = new Date().getTime();
            var adLoadDiff = adLoadStart - window.PageLoadTime;
            var adLoadTime = adLoadDiff/1000;
            var adLoadTimeRounded = Math.round(adLoadTime*10)/10;

            if(!window.adTimerStart){
              window.adTimerStart = new Date().getTime();
            }

            if (adPositions[k] == 'lb1' && window.HL_lbSlot) {
              if (!window.hlLbLoaded) {
                window.hlLbLoaded = true;

                dataLayer.push({
                  'event': 'hlAdLoad',
                  'hlAdLoadCategory': 'Ad Display',
                  'hlAdLoadAction': 'Ad Load Post Page Load',
                  'hlAdLoadInteraction': true,
                  'hlAdLoadLabel': 'lb:' + 'hn.us.hl.x.x.x.x',
                  'hlAdLoadValue': adLoadTimeRounded
                });
              }
              adPositions[k] = window.HL_lbSlot;
              adObject.label = 'LB';
            }
            if (adPositions[k] == 'mr1' && window.HL_mr1Slot) {
              adPositions[k] = window.HL_mr1Slot;
              adObject.label = 'MR1';
            }
            if (adPositions[k] == 'mr2' && window.HL_mr2Slot) {
              adPositions[k] = window.HL_mr2Slot;
              adObject.label = 'MR2';
            }
            if (adPositions[k] == 'wsl' && window.HL_wslSlot) {
              adPositions[k] = window.HL_wslSlot;
              adObject.label = 'WSL';
            }
            if (adPositions[k] == 'ws' && window.HL_wsrSlot) {
              adPositions[k] = window.HL_wsrSlot;
              adObject.label = 'WSR';
            }
            if (adPositions[k] == 'pb' && window.HL_pencilSlot) {
              adPositions[k] = window.HL_pencilSlot;
              adObject.label = null;
            }
            if (adPositions[k] == 'rtl' && window.HL_rtlSlot) {
              adPositions[k] = window.HL_rtlSlot;
              adObject.label = 'RTL';
            }
            if ( adPositions[k] == 'tl' && window.HL_tlSlot ) {
              adPositions[k] = window.HL_tlSlot;
              adObject.label = 'TL';
            }
            if (adObject.label !== null) {
              dataLayer.push({
                'event': 'hlKeyImpression',
                'hlKeyImpressionCategory': 'Ad Impression',
                'hlKeyImpressionAction': adObject.label + " Impression",
                'hlKeyImpressionLabel': topLevelAdUnit,
                'hlKeyImpressionInteraction': true
              });

              log.info('Ad-Common - KIMP called: ' + adObject.label + ' : ' + topLevelAdUnit);
            }
          }
          googletag.pubads().refresh(adPositions, {changeCorrelator: false});
        }
      };

      googletag.pubads().setTargeting('s1', s1);
      googletag.pubads().setTargeting('test', test);
      googletag.pubads().setTargeting('ugc', ugc);
      googletag.pubads().setTargeting('ac', ac);
      googletag.pubads().setTargeting('pv', pv);
      googletag.pubads().setTargeting('msiteID', msiteID);
      googletag.pubads().setTargeting('msiteactive', isMsiteActive);
      googletag.pubads().setTargeting('url', url);
      googletag.pubads().setTargeting('type', type);
      googletag.pubads().setTargeting('kw', kw);
      googletag.pubads().setTargeting('k1', k1);
      googletag.pubads().setTargeting('k2', k2);
      googletag.pubads().setTargeting('k3', k3);
      googletag.pubads().setTargeting('rpv', adRPV);

      

      googletag.pubads().enableSingleRequest();
      googletag.pubads().disableInitialLoad();
      googletag.enableServices();

      googletag.pubads().addEventListener('impressionViewable', function (event) {
        if (pageload && event.slot === window.HL_mr1Slot) {
          $(document).trigger('event:ads:mr1:loaded');
          pageload = false;
        }
        // https://developers.google.com/doubleclick-gpt/reference?hl=en#googletageventsimpressionviewableevent
      });
      googletag.pubads().addEventListener('slotRenderEnded', function (event) {
        var impressionUnfilledTargets = 'lb/mr1/mr2/mr3/wsl';
        var eventSlotPos = event.slot.getTargeting('pos');
        var adTimerEnd = new Date().getTime();
        var adLoadDiff = adTimerEnd - window.adTimerStart;
        var adLoadImpressionTime = adLoadDiff/1000;
        var adLoadImpressionTimeRounded = Math.round(adLoadImpressionTime*10)/10;

        
        if (lbPageLoad && eventSlotPos[0] === "lb") {
          lbPageLoad = false;
          adDisplayGATimer(eventSlotPos, 'hn.us.hl.x.x.x.x', adLoadImpressionTimeRounded);
        } else if (mr1PageLoad && eventSlotPos[0] === "mr1") {
          mr1PageLoad = false;
          adDisplayGATimer(eventSlotPos, 'hn.us.hl.x.x.x.x', adLoadImpressionTimeRounded);
        } else if (mr2PageLoad && eventSlotPos[0] === "mr2") {
          mr2PageLoad = false;
          adDisplayGATimer(eventSlotPos, 'hn.us.hl.x.x.x.x', adLoadImpressionTimeRounded);
        } else if (mr3PageLoad && eventSlotPos[0] === "mr3") {
          mr3PageLoad = false;
          adDisplayGATimer(eventSlotPos, 'hn.us.hl.x.x.x.x', adLoadImpressionTimeRounded);
        } else if (wslPageLoad && eventSlotPos[0] === "wsl") {
          wslPageLoad = false;
          adDisplayGATimer(eventSlotPos, 'hn.us.hl.x.x.x.x', adLoadImpressionTimeRounded);
        }
        

        if (event.isEmpty) {

          log.debug('ad-common.jsp - event.slot.getTargeting(pos) - ' + event.slot.getTargeting('pos') + ' ---- isEmpty TRUE' );

          var adType = event.slot.getTargeting('pos'),
            eventLable;

          if (adType.length && (impressionUnfilledTargets.indexOf(adType[0]) != -1)) {

            eventLable = adType + ':' + 'hn.us.hl.x.x.x.x';
            if (adType[0] === 'mr3') {
              eventLable = adType + ':' + event.slot.getTargeting('tile')[0] + ':' + 'hn.us.hl.x.x.x.x';
            }

            log.info('ad-common.jsp - Impression Unfilled: ' + eventLable);
            try {
              HL_GA_dataLayer({
                hlCustomEventCategory: 'Any Page',
                hlCustomEventAction: 'Impression Unfilled',
                hlCustomEventLabel: eventLable,
                hlCustomEventInteraction: true});
            } catch (e) {

            }
          }
          if (event.slot === window.HL_lb3Slot) {
            log.debug('GPT Promise - LB expected - MOBILE');

            googletag.cmd.push(function () {
              if (window.HL_lbSlot) {
                window.HL_gptRefreshAds(['mr1', 'mr2', 'mr3', 'wsl', 'wsr', 'pb', 'tl']);
              }
            });
          }
        } else {

          if (event.slot === window.HL_pw1Slot) {
            $('#box-pw1').show();
            try {
              dataLayer.push({
                'event': 'hlKeyImpression',
                'hlKeyImpressionCategory': 'Ad Impression',
                'hlKeyImpressionAction': "PW1 Impression",
                'hlKeyImpressionLabel': "hn.us.hl.x.x.x.x",
                'hlKeyImpressionInteraction': true
              });
            } catch (e) {
              // if an undefined value in array exists, do no log in GA
              // this does not affect ad refresh
            }
          } else if (event.slot === window.HL_tlSlot) {
            $('#box-tl').show();
            try {
              dataLayer.push({
                'event': 'hlKeyImpression',
                'hlKeyImpressionCategory': 'Ad Impression',
                'hlKeyImpressionAction': "TL Impression",
                'hlKeyImpressionLabel': "hn.us.hl.x.x.x.x",
                'hlKeyImpressionInteraction': true
              });
            } catch (e) {
              // if an undefined value in array exists, do no log in GA
              // this does not affect ad refresh
            }
          } else if (event.slot === window.HL_lb3Slot) {
            try {
              dataLayer.push({
                'event': 'hlKeyImpression',
                'hlKeyImpressionCategory': 'Ad Impression',
                'hlKeyImpressionAction': "LB3 Impression",
                'hlKeyImpressionLabel': "hn.us.hl.x.x.x.x",
                'hlKeyImpressionInteraction': true
              });
              log.debug('GPT Common - KIMP called: LB3: hn.us.hl.x.x.x.x');

            } catch (e) {
              // if an undefined value in array exists, do no log in GA
              // this does not affect ad refresh
            }
          } else if (event.slot === window.HL_mr1Slot) {

          } else if (event.slot === window.HL_wslSlot) {

          } else if (event.slot === window.HL_lbSlot) {

          } else if (event.slot === window.HL_rtnSlot) {
            $('#box-rtn').css('display', 'inline-block');
            try {
              dataLayer.push({
                'event': 'hlKeyImpression',
                'hlKeyImpressionCategory': 'Ad Impression',
                'hlKeyImpressionAction': "RTN Impression",
                'hlKeyImpressionLabel': "hn.us.hl.x.x.x.x",
                'hlKeyImpressionInteraction': true
              });
              log.debug('GPT Common - KIMP called: RTN: hn.us.hl.x.x.x.x');
            } catch (e) {
              // if an undefined value in array exists, do no log in GA
            }
          } else if (event.slot === window.HL_rtlSlot) {
            $('#box-rtl').show();
          } else {
            $.each(HL_mr3Slots, function (i) {
              if (HL_mr3Slots[i].ad === event.slot) {
                log.debug('ad-lb.jsp - HL_mr3Slots[i].ad === event.slot is TRUE - event:LoadedMR3 trigger FIRED');

                $(document).trigger('event:LoadedMR3:' + i);
              }
            });
          }
        }
        if (event.slot !== window.HL_OutOfPageSlot && adsArrayToRefresh.length) {
          var index = -1;
          $.each(adsArrayToRefresh, function (i) {
            if (adsArrayToRefresh[i] === event.slot) {
              index = i;
            }
          });
          if (index !== -1) {
            adsArrayToRefresh.splice(index, 1);
            if (!adsArrayToRefresh.length) {
              $(document).trigger('event:ads:loaded');
            }
          }
        }
      });

    });  // googletag.cmd.push
})();



      var HL_ga_showNewsletterSignup = true;
    


  // GTM dataLayer
  window.dataLayer = window.dataLayer || [];


require([
  'jquery',
  'base/util/ga-custom-vars'
], function ($) {

  //var _gaq = _gaq || [];

  // add _gaq to global space
  window._gaq = window._gaq || [];

  
  var pluginUrl = '//www.google-analytics.com/plugins/ga/inpage_linkid.js';
  _gaq.push(['hl._require', 'inpage_linkid', pluginUrl]);

  dataLayer.push({ 'linkid': 'linkid.js' });

  
  var HL_ga_marinId = "";
  

  var HL_ga_toolCount = "";
  
  var HL_ga_smartAnswerCount = "";
  

  if (HL_ga_showNewsletterSignup == "") {
    var HL_ga_showNewsletterSignup = false;
  }

  var alternateTitles,
    alternateImages,
    authorName = '';

  
  var articleVars = '',
    publishedDate = '',
    updatedDate = '';

  

  var micrositeId = "";
  if (false) {
    micrositeId = "";
  } else if (false) {
    micrositeId = "diabetesmine";
  } else {
    micrositeId = "";
  }

  
  dataLayer.push({
    'fireGTM': true
  });
  
  dataLayer.push({
    'uaPropertyId': 'UA-26124207-1'
  });

  
  window.HL_ga_customVars = {
    account: "UA-26124207-20",
    domainName: ".healthline.com",
    siteSpeedSampleRate: 10,
    topiccenter: "",
    isResponsive: false,
    hcSubPage: "",
    toolCount: HL_ga_toolCount,
    smartAnswerCount: HL_ga_smartAnswerCount,
    isExpandableNav: false ? true : false,
    dfpAdSite: "hn.us.hl.x.x.x.x",
    webHostName: "njc-web07.healthline.com",
    k1: "otherhealthsystems",
    k2: "healthsystems",
    imuid: false ? "" : "",
    micrositeId: micrositeId,
    marinId: HL_ga_marinId,
    isErrorPage: true ? true : false,
    platformPageType: "null",
    showNewsletterSignup: HL_ga_showNewsletterSignup,
    authorName: authorName,
    articleVars: articleVars,
    hasCustomContent: false ? true : false,
    isCompletelyOriginal: false ? true : false,
    isBrandedDrug: false ? true : false,
    publishedDate: publishedDate,
    updatedDate: updatedDate,
    alternateTitles: alternateTitles,
    alternateImages: alternateImages,
    articleWordCount: '',
    articleId: '',
    articleTitle: ""
  };
  
  HL_ga_setCustomVars(HL_ga_customVars);

  var HL_ga_url_msId_fragment = '';
  
      var HL_ga_url404 = '/404.html?loc=' + document.location.pathname + document.location.search + '&from=' + encodeURIComponent(document.referrer);
      _gaq.push(['hl._trackPageview', HL_ga_url404]);

      log.info('google-analytics.jsp - pageview called - error page');
    

  // UA implementation: these two functions call general HL_ga_sendTrackEvent method
  dataLayer.push({ 'primaryPageview': 'Yes' });

  _gaq.push(HL_ga_trackTimeOnPageWrapper);
  _gaq.push(HL_ga_track90percentScrollWrapper);

  (function () {
    var _adblock = _adblock || false;
    if (!_adblock) {   //load dc.js unless user has AdBlock
      var ga = document.createElement('script');
      ga.type = 'text/javascript';
      ga.async = true;
      ga.src = ('https:' == document.location.protocol ? 'https://' : 'http://') + 'stats.g.doubleclick.net/dc.js';
      var s = document.getElementsByTagName('script')[0];
      s.parentNode.insertBefore(ga, s);
    } else { //otherwise load ga.js
      var ga = document.createElement('script');
      ga.type = 'text/javascript';
      ga.async = true;
      ga.src = ('https:' == document.location.protocol ? 'https://ssl' : 'http://www') + '.google-analytics.com/ga.js';
      var s = document.getElementsByTagName('script')[0];
      s.parentNode.insertBefore(ga, s);
    }
  })();

  <!-- Google Tag Manager -->
  (function (w, d, s, l, i) {
    w[l] = w[l] || [];
    w[l].push({'gtm.start': new Date().getTime(), event: 'gtm.js'});
    var f = d.getElementsByTagName(s)[0],
      j = d.createElement(s), dl = l != 'dataLayer' ? '&l=' + l : '';
    j.async = true;
    j.src =
      '//www.googletagmanager.com/gtm.js?id=' + i + dl;
    f.parentNode.insertBefore(j, f);
  })(window, document, 'script', 'dataLayer', 'GTM-WSXMS6');
  <!-- End Google Tag Manager -->
  


}); // require module





  var hlnord = Math.random() * 10000000000000000;
  var ord = parseInt(hlnord, 10);
  var dfpTileIdx = 1;
  var gadc = 0;
  var igadc = 0;
  var tadc = 0;
  var dadc = 0;
  var cadc = 0;
  var erpm = 0;
  /*var unicaEvents = new Array();
   var unicaEventIdx = 0;*/
  
  var g_cfn = "Health";
  var g_cfn_bold = "Health";
  var g_encoded_uri = encodeURI("\u002fprivacy\u002dpolicy");
  document.write('<input id="ordName" name="ordName" type="hidden" value="' + ord + '">');
  document.write('<input id="ordCount" name="ordCount" type="hidden" value="1">');
  document.write('<input id="pv" name="pv" type="hidden" value="22">');

  // qualaroo survey
  var _kiq = _kiq || [];
  (function () {
    setTimeout(function () {
      var d = document, f = d.getElementsByTagName('script')[0], s = d.createElement('script');
      s.type = 'text/javascript';
      s.async = true;
      s.src = '//s3.amazonaws.com/ki.js/55482/cd9.js';
      f.parentNode.insertBefore(s, f);
    }, 1);
  })();

  // qualaroo survey custom vars
  require([ 'base/util/ga-custom-vars' ], function () {

    

    var HL_GA_dfpSite = 'hn.us.hl.x.x.x.x',
    // page type info is the third and possibly fourth elements of dfpAdSite
      dfpSiteArray = HL_GA_dfpSite.split('.'),
      platformPageType = '',
      hcSubPage = '',
      isErrorPage = true,
      hlPageType = '',
      micrositeId = '';

    if (false) {
      micrositeId = '';
    } else if (false) {
      micrositeId = 'diabetesmine';
    } else {
      micrositeId = '';
    }

    if (platformPageType == 'slideshowV3') {
      window.isSlideshow = true;
    }

    hlPageType = HL_getPageContentType({
      dfpSiteArray: dfpSiteArray,
      platformPageType: platformPageType,
      hcSubPage: hcSubPage,
      isErrorPage: isErrorPage
    });

    _kiq.push(['set', {
      'msite_yes': micrositeId ? 'yes' : 'no',
      'k1': 'otherhealthsystems',
      'msite': micrositeId,
      'content_type': hlPageType
    }]);

  }); // require module



















Topics & Tools 


 Health Topics

All topics A-Z
Acid Reflux
ADHD
Allergies
Alzheimer's & Dementia
Bipolar Disorder
Cancer
Chronic Pain


CIC
Cold & Flu
COPD
Crohn's Disease
Depression
Fibromyalgia
Health Insurance Exchanges
Heart Disease


High Cholesterol
HIV
Hypertension
IBS
IPF
Menopause
Multiple Sclerosis (MS)
Osteoarthritis


Pregnancy
Psoriasis
Rheumatoid Arthritis
Skin Disorders and Care
STDs
Type 2 Diabetes



 Health Tools

Symptom Checker
BodyMaps


Clinical Trials
Pill Identifier


Find a Doctor
Health News


Newsletters
Diabetes Mine












X
























    Topics & Tools
    




 Health Topics



All topics A-Z
Acid Reflux
ADHD
Allergies
Alzheimer's & Dementia
Bipolar Disorder
Cancer
Chronic Pain




CIC
Cold & Flu
COPD
Crohn's Disease
Depression
Fibromyalgia
Health Insurance Exchanges
Heart Disease




High Cholesterol
HIV
Hypertension
IBS
IPF
Menopause
Multiple Sclerosis (MS)
Osteoarthritis




Pregnancy
Psoriasis
Rheumatoid Arthritis
Skin Disorders and Care
STDs
Type 2 Diabetes




 Health Tools



Symptom Checker
BodyMaps




Clinical Trials
Pill Identifier




Find a Doctor
Health News




Newsletters
Diabetes Mine









Newsletter



















.hl .hl-nw-form-block em { font-style: italic; font-weight: 600;}
.hl #overlayToptocPopup { position:absolute;left:0;top:0;overflow:hidden}
.hl a.hl-bottom-text{bottom:0;position:absolute;right:0}
.hl a#hl-toptocPopupLink{font-size:24px;right:0;position:absolute;padding:20px 20px 0 0;color:#333}
.hl a#hl-toptocPopupLink:hover{text-decoration:none}
.hl-toptocpopup-block .hl-email-toptoc-field{margin-top:0;width:auto;float:left;margin-right:10px}
.hl-toptocpopup-block #hl-response-block{margin:125px 0 0;display:none}
.hl .hl-toptocpopup-block .hl-nw-form-block{width:100%;padding:0 23px;box-sizing:border-box;width:100%;padding-top:0px}
.hl .hl-toptoc-signup-error{display:none;color:red;font-size:14px;margin-bottom:4px}
.hl .hl-toptocpopup-block{display:block}
.hl .hl-bottom-text{margin-bottom:20px;color:#007da4;font-size:18px;font-family:Open Sans,sans-serif;font-weight:400;float:right;width:auto;display:none;margin-right:20px;margin-top:-33px}
div#exposeMask{background-color:#000;opacity:.66}
.hl #overlayToptocPopup { padding: 0px 20px 0px 20px; width: 500px; height: 350px; box-sizing: border-box;}
.hl #overlayToptocPopup .hl-overlay .hl-icon-close{ padding:20px 20px 0 0;}

.hl .hl-toptocpopup-block .hl-signup-button{margin-top:0}
.hl .overlay-container{width:100%;height:100%}
.hl .overlay-container .overlay-content{display:inline}
.hl .hl-toptocpopup-block{width:90%;float:left;margin:72px 43px 103px}
.hl .hl-toptocpopup-block .hl-nw-form-block{width:100%}
#hl-response-block .hl-res-text{font-size:32px;font-family:Open Sans,Sans-serif;font-weight:600;color:#007da4;line-height:34px;padding: 0 0px 0 27px;}
.hl #overlayToptocPopup{background-color:#fff;padding:0 20px;width:500px;height:350px;box-sizing:border-box}
#hl-response-block .hl-res-text b{font-size:20px;line-height:24px;display:inline-block;color:#333;padding-top:8px;clear:both;font-weight:400;padding-right:30px}
.hl-toptocpopup-block .hl-nw-form-block p{/*color:#007da4;*/font-size:32px;font-weight:600;font-family:Open Sans,Sans-serif;line-height:34px;display:inline-block;padding-bottom:0;margin-bottom:34px;width:100%;margin-top: 1em;}
.hl-toptocpopup-block .hl-nw-form-block p b{font-size:20px;line-height:24px;color:#333;padding-top:8px;clear:both;font-weight:400}
.hl-toptocpopup-block .hl-signup-block{width:100%;float:left;position:relative;padding-top:0}
.hl-toptocpopup-block .hl-email-block{padding-left:0;width:auto;padding-right:0}
.overlay-close .overlay-close{display:none}
.hl-toptocpopup-block .hl-email-toptoc-field{margin-top:0;width:auto}
.hl-toptocpopup-block input.hl-email{width:262px;height:37px;text-align:center;color:#99a4ac;font-size:14px;font-weight:400;background:none repeat scroll 0 0 #e3e3e3;border:1px solid #C9C9C9;border-radius:0}
.hl-toptocpopup-block button.hl-nw-emailsubmit-tmp:hover{-webkit-box-shadow:none;-moz-box-shadow:none;box-shadow:none;background-color:#0396ae;background-image:none;border:1px solid #0396ae;-webkit-border-radius:3px;-moz-border-radius:3px;border-radius:0;behavior:url(/resources/base/css/PIE.htc);position:relative;display:inline-block;color:#fff;font-weight:400;padding:6px 34px;text-decoration:none}
.hl-toptocpopup-block button.hl-nw-emailsubmit-tmp{-webkit-box-shadow:none;-moz-box-shadow:none;box-shadow:none;background-color:#00ABC7;background-image:none;border:1px solid #00ABC7;-webkit-border-radius:3px;-moz-border-radius:3px;border-radius:0;behavior:url(/resources/base/css/PIE.htc);position:relative;display:inline-block;color:#fff;font-weight:400;padding:6px 34px;text-decoration:none;height:40px;font-size:14px}
.hl-toptocpopup-block button.hl-nw-emailsubmit:hover{-webkit-box-shadow:none;-moz-box-shadow:none;box-shadow:none;background-color:#0396ae;background-image:none;border:1px solid #0396ae;-webkit-border-radius:3px;-moz-border-radius:3px;border-radius:0;behavior:url(/resources/base/css/PIE.htc);position:relative;display:inline-block;color:#fff;font-weight:400;padding:6px 34px;text-decoration:none}
.hl-toptocpopup-block button.hl-nw-emailsubmit{-webkit-box-shadow:none;-moz-box-shadow:none;box-shadow:none;background-color:#00ABC7;background-image:none;border:1px solid #00ABC7;-webkit-border-radius:3px;-moz-border-radius:3px;border-radius:0;behavior:url(/resources/base/css/PIE.htc);position:relative;display:inline-block;color:#fff;font-weight:400;padding:6px 34px;text-decoration:none;height:40px;font-size:14px}
.hl #overlayToptocPopup .overlay-close.hl-icon-X.hl-icon-close {float: right;font-size: 2em;color: #555;cursor: pointer;padding: 20px 0px 0 0;}
.hl #overlayToptocPopup .overlay-close-container { height: 0px; padding-bottom: 0px;}

.hl #overlayToptocPopup .overlay-close.hl-icon-X.hl-icon-close{font-weight:400;margin-right:0px;}
.hl-toptocpopup-block .hl-nw-form-block .overlay-rd-title {
    color: #007da4;
    display: inline-block;
    font-family: Open Sans,sans-serif;
    font-size: 32px;
    font-weight: 600;
    line-height: 34px;
    margin-top: 0.5em;
    padding-bottom: 0;
    width: 100%;
}


.hl-toptocpopup-block .hl-nw-form-block .overlay-rd-copy {
    clear: both;
    color: #333;
    font-size: 20px;
    font-weight: 400;
    line-height: 24px;
    padding-top: 8px;
    margin-bottom:34px;
	}

@media only screen and (max-width:1024px){

}

@media only screen and (max-width:768px) {
.hl-toptocpopup-block .hl-nw-form-block{width:590px;float:left;position:relative;padding-top:0}
.hl-toptocpopup-block .hl-nw-form-block p{font-size:26px;line-height:28px;padding-bottom:0}
.hl-toptocpopup-block .hl-nw-form-block p b{font-size:16px;line-height:18px;display:inline-block}
#hl-response-block .hl-res-text { font-size: 26px;  line-height: 28px;}
#hl-response-block .hl-res-text b { font-size: 16px;  line-height: 18px;}
.hl-toptocpopup-block .hl-nw-form-block .overlay-rd-title{font-size:26px;line-height:28px;padding-bottom:0}
.hl-toptocpopup-block .hl-nw-form-block .overlay-rd-copy {
    clear: both;
    color: #333;
    font-size: 16px;
    font-weight: 400;
    line-height: 18px;
    padding-top: 8px;
    margin-bottom:24px;
	display:inline-block;
	}
}

@media only screen and (max-width:767px) {
.hl-toptocpopup-block #hl-response-block { padding-top: 42px;}
.hl-toptocpopup-block #hl-response-block { margin: 0px 0 0;}


}

@media only screen and (max-width:736px) {
.hl .hl-toptocpopup-block .hl-nw-form-block{padding:0px 10px 0;width:100%}
.hl-toptocpopup-block #hl-response-block{padding-top:72px}
.hl a.hl-bottom-text{bottom:10px;right:10px}
.hl #overlayToptocPopup{position:fixed;z-index:10000000;max-width:94vw;max-height:72vh}
#hl-response-block .hl-res-text{padding:60px 0 0 10px}
#hl-response-block .hl-res-text b{padding-right:15px}
}

@media only screen and (max-width:600px) {
.hl #overlayToptocPopup { max-height: 90vh;}
.hl-toptocpopup-block #hl-response-block { padding-top: 42px;}
.hl-toptocpopup-block #hl-response-block { margin: 0px 0 0;}
#hl-response-block .hl-res-text{padding:50px 0 0 10px}
.hl-toptocpopup-block input.hl-email{box-sizing:border-box}
.hl .hl-bottom-text{margin-bottom:0;color:#007da4;font-size:14px;font-family:Open Sans,sans-serif;font-weight:400;float:right;width:auto;display:none;margin-right:0;position:absolute;bottom:20px;right:20px;margin-top:0}
#hl-response-block .hl-res-text b{font-size:16px;line-height:18px}
#hl-response-block .hl-res-text{font-size:26px;line-height:28px}
.hl-toptocpopup-block .hl-email-block{width:100%}
.hl-toptocpopup-block .hl-nw-form-block p{margin-bottom:24px; margin-top: 0;}
.hl-toptocpopup-block .hl-nw-form-block .overlay-rd-title{margin-bottom:0px; margin-top: 0;}
.hl-toptocpopup-block{width:100%;margin:auto;position:relative}
.hl-toptocpopup-block .hl-email-toptoc-field{width:100%;height:auto;margin-bottom:10px}
.hl-toptocpopup-block .hl-nw-form-block{width:100%;float:left;position:relative;padding-top:0;padding-left:0}
.hl-toptocpopup-block #hl-response-block{display:none;margin:0;font-size:24px;font-family:Arial-Bold;color:#bd81b4;font-weight:700;line-height:24px;width:90%}
.hl-toptocpopup-block input.hl-email{width:100%;padding:0;}
.hl-toptocpopup-block button.hl-nw-emailsubmit{width:100%}
.hl-toptocpopup-block .hl-signup-button{margin-left:0;width:100%}
.hl-toptocpopup-block button.hl-nw-emailsubmit-tmp{width:100%}
}

@media only screen and (max-width:480px) {
.hl .hl-toptocpopup-block .hl-nw-form-block{padding:0px 10px 0}
.hl .toptocpopup-block{width:auto;float:left;margin:28px 30px 67px}
.hl-toptocpopup-block{width:100%;margin:auto}
.hl-toptocpopup-block #hl-response-block{ width:100%}
}
@media only screen and (max-width:439px) {
.hl .hl-toptocpopup-block .hl-nw-form-block{padding:0px 0px 0}
}

@media only screen and (max-width:375px){

.hl-toptocpopup-block .hl-nw-form-block sapn { margin-bottom: 24px;}

}
@media only screen and (max-width:320px) {
.hl-toptocpopup-block button.hl-nw-emailsubmit{height:37px}
.hl-toptocpopup-block button.hl-nw-emailsubmit-tmp{height:37px}
}







Looking to lead a stronger, healthier life?Sign up for our Wellness Wire newsletter for all sorts of nutrition, fitness, and wellness wisdom.





Please enter a valid email.










Subscribe





Now we’re in this together.Thanks for subscribing and having us along on your health and wellness journey.

See all Healthline's newsletters »





require( [ 'jquery', 'base/overlay'], function( $, AppOverlay ) {


	$(document).ready( function() {
	
	$("#overlayToptocPopup .overlay-close").html("<div class='overlay-close'>X</div>");

 	var idToptocPopupLink = $( '#hl-toptocPopupLink' );


 	var overlayPageURI = encodeURI( "${hl:javaScriptEscape(requestScope['healthline-original-uri'])}" );


	$(".hl #hl-nw-toptocpopup-email").focus(function() {
		$(".erro-sailthru").remove();
	});	
	
 	idToptocPopupLink.click( function() {
      dataLayer.push({
        'event': 'hlCustomEvent',
        'hlCustomEventCategory': 'Any Page',
        'hlCustomEventAction': 'Global Header',
        'hlCustomEventLabel': 'Subscribe Overlay',
        'hlCustomEventInteraction': false
      });
	//HL_ga_sendTrackEvent({ gaEventCategory : 'Any Page', gaEventAction : 'Global Header', gaEventLabel : 'Subscribe Overlay' });
 	});
    
	$newsletterSingupForm = $('#hl-toptocNewsletterForm'); 
	


	// reassign form submit button
	$newsletterSingupForm.submit( function( evt ){
   	evt.preventDefault();
 	});


   	$( '#hl-toptocFormSubmission' ).click(function( evt ){
   	evt.preventDefault();
	$( '.hl-toptocpopup-block input.hl-email' ).css( 'border', '1px solid #C9C9C9' );
   	var emailValue = $( '#hl-nw-toptocpopup-email' ).val();
   	if( isValidEmailAddress( emailValue ) ) {
	    var url = 'http://prodigyinfosoft.com/sailthru/sailthru-client/examples/checkemail.php?email='+$("#hl-nw-toptocpopup-email").val() +'&callback=?';	
	$.ajax({
        url: url,
        dataType: 'jsonp',
        error: function(xhr, status, error) {
            //alert(error);
        },
		success: function(response) {
        if(response=="[]"){
		
		     	//var dataString = 'liame=' + $( '#hl-nw-toptocpopup-email' ).val() + '&k1=' + $( '#hl-nw-toptocpopup-k1' ).val();

	$newsletterSingupForm.find('#hl-nw-toptocpopup-k1').val(window.HL_ga_customVars.k1);
	$newsletterSingupForm.find("[name='pageLink']").val(HLSHAREBAR.email_page_url);
        $newsletterSingupForm.find("[name='pageTitle']").val(HLSHAREBAR.email_page_title);

     	$.ajax({
       	url: '/v2/comm-reg',
       	type: 'GET',
       	data: $newsletterSingupForm.serialize(),
       	dataType: 'json',
       	success: function(data) {

          $.ajax({
                       url: '//prodigyinfosoft.com/sailthru/sailthru-client/examples/headeroverlay.php?email=' + $("#hl-nw-toptocpopup-email").val(),
                       dataType: "jsonp",
                       success: function(response) {

                       },
                       error: function(response) {

                       }
                   });
       	},
       	error: function(e) {


       	}
     	});

        localStorage.nwletter_email =  $("#hl-nw-toptocpopup-email").val();
     	$( '.hl-nw-form-block' ).hide();
     	$( '#hl-response-block' ).show();
     	// GA track submit button click
		
//HL_ga_sendTrackEvent({ gaEventCategory : 'Any Page', gaEventAction : 'Global Header', gaEventLabel: 'Subscribe Overlay' });
      dataLayer.push({
        'event': 'hlCustomEvent',
        'hlCustomEventCategory': 'Any Page',
        'hlCustomEventAction': 'Global Header',
        'hlCustomEventLabel': 'Subscribe Overlay',
        'hlCustomEventInteraction': false
      });

		}else{
		$("#hl-nw-toptocpopup-email").addClass("error");
$(".erro-sailthru").remove();
		$( '<div class="erro-sailthru" style="font-size:13px;color:red;text-align:left;padding:0px 5px">Invalid email address</div>' ).insertAfter( "#hl-nw-toptocpopup-email" );
		 err_1 = 1;
		 return false;
		}
	}

});
	
	

     	} else {
		$( '.hl-toptocpopup-block input.hl-email' ).css( 'border', '1px solid red' );
     	}
 	});


 	$( '.hl-email-toptoc-field' ).on( 'click', function( evt ){


   	$( '#hl-nw-toptocpopup-email' ).val('');




 	});
	
 	// showNewsletterOverlay( 1000 );

	}); // dom ready


	var isDesktopBreakpoint = function() {
  	//return matchMedia( 'only screen and ( min-width: 1100px )' ).matches;
	return matchMedia( 'only screen and ( min-width: 320px )' ).matches;
	};


	function HL_checkVariable() {
 	if( HL_ga_showNewsletterSignup == '' ){
   	alert( HL_ga_showNewsletterSignup );
 	}
	}


	// show overlay after x secs
	// popup visible only if there is no cookie (user's first visit)
	function showNewsletterOverlay( HL_time ) {


$( '#hl-toptocPopupLink' ).trigger( 'click' );

	}


	// fabulousness
	setInterval(function(){ $('blink').each( function(){ $(this).css('visibility' , $(this).css('visibility') === 'hidden' ? '' : 'hidden') } ); }, 250);


	// sets cookie upon user's first visit
	function setCookie( c_name, value, exdays ) {
 	var exdate = new Date();
 	exdate.setDate( exdate.getDate() + exdays );
 	var c_value = escape(value) + ((exdays==null) ? '' : '; expires='+exdate.toUTCString());
 	document.cookie = c_name + '=' + c_value;
	}


	// looks for cookie
	function getCookie( c_name ) {
 	var c_value = document.cookie;
 	var c_start = c_value.indexOf( ' ' + c_name + '=' );
 	if ( c_start == -1 ) {
   	c_start = c_value.indexOf( c_name + '=' );
 	}
 	if ( c_start == -1 ) {
   	c_value = null;
 	} else {
   	c_start = c_value.indexOf( '=', c_start ) + 1;
   	var c_end = c_value.indexOf( ';', c_start );
   	if ( c_end == -1 ) {
     	c_end = c_value.length;
   	}
   	c_value = unescape( c_value.substring( c_start,c_end ));
 	}
 	return c_value;
	}


	function isValidEmailAddress( emailAddress ) {
 	var pattern = new RegExp( '[a-zA-Z0-9._%+-]+@[a-zA-Z0-9.-]+.[a-zA-Z]{2,4}' );
 	return pattern.test( emailAddress );
	}


 }); // end of requirejs




var err_1 = 0;
var sailThruValidate=0;
var getUrlParameter = function getUrlParameter(sParam) {
    var sPageURL = decodeURIComponent(window.location.search.substring(1)),
        sURLVariables = sPageURL.split('&'),
        sParameterName, i;
    for (i = 0; i < sURLVariables.length; i++) {
        sParameterName = sURLVariables[i].split('=');
        if (sParameterName[0] === sParam) {
            return sParameterName[1] === undefined ? true : sParameterName[1];
        }
    }
};

var parseRequest = function parseRequest(response)
			{
				try // try to output this to the javascript console
				{
				if(response=="[]"){
                $(".hl #hl-nw-toptocpopup-email").removeClass("error");
				$("#hl-nw-toptocpopup-email").removeClass("errorsailthru");
                }else{
                $(".hl #hl-nw-toptocpopup-email").addClass("error");
				$("#hl-nw-toptocpopup-email").addClass("errorsailthru");
            sailThruValidate = 1;
			err_1 = 1;
                }				

				}
				catch(an_exception) // alert for the users that don't have a javascript console
				{}
			};

function searchExcel(sheetname) {
    var result = false;
    $.ajax({
        type: "GET",
        url: 'http://www.healthline.com/hlcmsresource/images/' + sheetname + '.csv',
        dataType: "text",
        success: function(data) {
            result = processData(data);
        }
    });
    return result;
}

function ValidateEmail(email) {
    var expr = /^([\w-\.]+)@((\[[0-9]{1,3}\.[0-9]{1,3}\.[0-9]{1,3}\.)|(([\w-]+\.)+))([a-zA-Z]{2,4}|[0-9]{1,3})(\]?)$/;
    return expr.test(email);
};



 




  require(['jquery'], function ($) {
    var $backdrop, $modal = $('div.search-modal'), searchConfig = false, $searchTitle = $('.hl-title-serp');

    function closeSearchOverlay() {
      $modal.hide();
      $backdrop.remove();
      $backdrop = null;
    }

    function resetMenuDropdowns() {
      $('.dropdown').hide();
      $('.hl-click-menu').removeClass('menuOpen');
      if( $('#headMenuMask').length ) {
        $('#headMenuMask').remove();
      }
    }

    $('li.hl-click-menu').children('a').click(function (event) {
      event.preventDefault();

      var parentMenu = $(this).parent('.hl-click-menu'),
        dropMenu = parentMenu.find('.dropdown');

      if( dropMenu.is(":visible") ) {
        resetMenuDropdowns();
        parentMenu.removeClass('menuOpen');
      } else {
        resetMenuDropdowns();
        dropMenu.show();
        parentMenu.addClass('menuOpen');
        $('body').append('<div id="headMenuMask" class="mask"></div>');
        $('#headMenuMask').click(function () {
          dropMenu.hide();
          $('#headMenuMask').remove();
          parentMenu.removeClass('menuOpen');
        });
      }
    });

    var stopPropagation = function (e) {
      e.stopPropagation();
    };
    $('div.form-group', $modal).click(stopPropagation).focus(stopPropagation);

    $(document).on('mouseup', ".gsc-completion-selected", function () {
      $searchTitle.text($('#gsc-i-id1').val());
      closeSearchOverlay();
    });

    $(document).on('keyup', 'td.gsc-input input', function (e) {
      var keycode = (e.keyCode ? e.keyCode : e.which);
      if (keycode == 13) { // the enter key code
        $searchTitle.text($('#gsc-i-id1').val());
        closeSearchOverlay();
      }
    });

    if ('ontouchstart' in document.documentElement) {
      $('#subnav-link, #mainnav-link').attr('href', 'javascript:void(0)')
    }

    $('.hl-click-menu', $('#topic_center')).click(function () {
      dataLayer.push({
        'event': 'hlCustomEvent',
        'hlCustomEventCategory': 'Any Page',
        'hlCustomEventAction': 'Global Header',
        'hlCustomEventLabel': 'Click:' + ($(this).hasClass('topics') ? 'Topics - Tools Menu' : 'Condition Menu'),
        'hlCustomEventInteraction': false
      });
    }, function () {
    });

    $(".newsletterLink div").click(function() {
      dataLayer.push({
        'event': 'hlCustomEvent',
        'hlCustomEventCategory': 'Any Page',
        'hlCustomEventAction': 'Global Header',
        'hlCustomEventLabel': 'Newsletter Button',
        'hlCustomEventInteraction': false
      });
    });

    window.hl_fireSearchEvent = function () {
      dataLayer.push({
        'event': 'hlCustomEvent',
        'hlCustomEventCategory': 'Any Page',
        'hlCustomEventAction': 'Global Header',
        'hlCustomEventLabel': 'Search Submit',
        'hlCustomEventInteraction': false
      });
    }
    $('.search-box form.gsc-search-box').submit(function () {

//      HL_GA_dataLayer({
//        'event': 'hlCustomEvent',
//        'hlCustomEventCategory': 'Click:Navigation',
//        'hlCustomEventAction': 'Global Header Input - Field Search Enter',
//        'hlNonInteraction': false
//      });
    });
  });























              Achoo!
            

                We're sorry — looks like that page is under the weather.
            

              Error code: 404
            




Health Tools:

Symptom Checker
Drug Search
Pill Identifier
Body Maps



Health Directories:

Health Topics
Videos
Symptoms
Slideshows
Health Blogs
Reference Library














  require(["base/rwd/common"], function(AppCommonResponsive){
    AppCommonResponsive.initialize();
  });



  document.write(unescape("%3Cscript src='" + (document.location.protocol == "https:" ? "https://sb" : "http://b") + ".scorecardresearch.com/beacon.js' %3E%3C/script%3E"));


  COMSCORE.beacon({
    c1:2,
    c2:6035868,
    c3:"",
    c4:"",
    c5:"",
    c6:"",
    c15:""
  });











As the fastest growing consumer health information site — with 65 million monthly visitors — Healthline’s mission is to be your most trusted ally in your pursuit of health and well-being.
You can depend on us to provide expert content along with genuine caring. Both of which will support, guide, and inspire you toward the best possible health outcomes for you and your family.





Sign up for our newsletter
Thank you!

A confirmation email has been sent, and you will receive our next newsletter soon!

See all Healthline's newsletters »
We'll help you live each day to the healthiest.

X









 Subscribe 



  Your privacy is important to us






Find us on:
Facebook
Twitter
Google Plus
Pinterest







About Us
Health Topics
Health News
FDA



Contact Us
Advertise With Us
Advertising Policy
Newsletters



Careers
Privacy Policy
Terms of Use
Find a Doctor








This website is certified by Health On The Net.
Click here to verify
















Copyright © 2005 - 2017 Healthline Media. All rights reserved. Our content does not constitute a medical consultation. See a certified medical professional for diagnosis. Privacy Policy
(function() {
  var _fbq = window._fbq || (window._fbq = []);
  if (!_fbq.loaded) {
    var fbds = document.createElement('script');
    fbds.async = true;
    fbds.src = '//connect.facebook.net/en_US/fbds.js';
    var s = document.getElementsByTagName('script')[0];
    s.parentNode.insertBefore(fbds, s);
    _fbq.loaded = true;
  }
  _fbq.push(['addPixelId', '341638689366170']);
})();
window._fbq = window._fbq || [];
window._fbq.push(['track', 'PixelInitialized', {}]);















            (function(global) {
                var universalPixelApi = new TTDUniversalPixelApi();
                universalPixelApi.init("fcovtha", ["ihyjpsl"], "https://insight.adsrvr.org/track/up", "ttdUniversalPixelTagab5d2702cb4346dfbe31c5c61e126b4a");
            })(this);
        





            (function(global) {
                if (typeof TTDUniversalPixelApi === 'function') {
                    var universalPixelApi = new TTDUniversalPixelApi();
                    universalPixelApi.init("fcovtha", ["hs35qam"], "https://insight.adsrvr.org/track/up", "ttdUniversalPixelTag14bfa4e467dd468e81c8d738550a6046");
                }
            })(this);
        




(function(){function t(){for(var a=[8],e=1;2>=e;e++)a.push(8+e),a.push(8-e);a=a[Math.floor(Math.random()*a.length)];return{b:a,a:0==Math.floor(Math.random()*a)}}function k(a){var e=a=a.replace(":","");try{for(var b=0;100>b&&(a=decodeURIComponent(a),e!=a)&&!a.match(/^http(s)?\:/);b++)e=a}catch(c){}return a.replace(/(^\s+|\s+$)/g,"")}try{if(!location||!location.hostname||!location.pathname)return!1;var c=document.location.hostname.replace(/^www\./,""),u=function(){for(var a,b=document.getElementsByTagName("meta"),
c,d=0,f=b.length;d<f;d++)if(c=b[d],"og:title"===c.getAttribute("property")){a=c.getAttribute("content");break}a||(a=document.title||"Untitled");return a}(),b={},b=function(a,b,c){a.l1=b;a.l2=c;a.l3="__page__";a.l4="-";return a}(b,c,u),l=(new Date).getTime(),m=Math.floor(Math.random()*Math.pow(10,12)),d,f;f=t();f.a?d=0:d=f.b;b.zmoatab_cm=d;b.t=l;b.de=m;b.zMoatAB_SNPT=!0;var g;d?g=d:g=1;var n;n=f?f.a?!1:!0:!0;var c=[],p=[k(b.l1),k(b.l2),k(b.l3),k(b.l4)].join(":"),v="https://wve3oiypgri4-a.akamaihd.net/z.gif?e=17&d="+
encodeURIComponent(p)+"&de="+m+"&t="+l+"&i=HEALTHLINECONTENT1&cm="+g+"&mp=1&ac=1&pl=1&bq=10&cs=0",w="https://px.moatads.com/pixel.gif?e=17&d="+encodeURIComponent(p)+"&de="+m+"&t="+l+"&i=HEALTHLINECONTENT1&cm="+g+"&mp=0&ac=1&pl=1&bq=10&ad_type=img&cs=0",x="https://px.moatads.com/pixel.gif?e=17&d="+encodeURIComponent(p)+"&de="+m+"&t="+l+"&i=HEALTHLINECONTENT1&cm="+g+"&ku=1&ac=1&pl=1&bq=10&ad_type=img&cs=0";n&&((new Image).src=v,(new Image).src=w);for(var q in b)c.push(q+"="+encodeURIComponent(b[q]));
var c=c.join("&"),h=document.createElement("script");h.type="text/javascript";h.async=!0;n&&(h.onerror=function(){(new Image).src=x});var r=document.getElementsByTagName("script")[0];r.parentNode.insertBefore(h,r);h.src="https://z.moatads.com/healthlinecontent451781663455/moatcontent.js#"+c}catch(a){try{var y="//pixel.moatads.com/pixel.gif?e=24&d=data%3Adata%3Adata%3Adata&i=MOATCONTENTABSNIPPET1&ac=1&k="+encodeURIComponent(a)+"&j="+encodeURIComponent(document.referrer)+"&cs="+(new Date).getTime();
(new Image).src=y}catch(e){}}})();





  require(["healthline/header"], function(header){
  header.setOptions({
  isNews: false,
  isNewsChecked: false
  });


  });
  



  require(["jquery"], function( $ ){
  $(document).ready(function() {
  $( '#box-health-tools' ).on( 'click', 'a', function(){
  if( $( this ).text() == 'Doctor Search' ){
  _gaq.push( [ 'hl._link', $( this ).attr( 'href' ) ] );
  return !window._gat;
  }
  return true;
  });
  });
  });




      require(["jquery"], function( $ ){
      $(document).ready(function(){
      var placeholderInput = setInterval(function(){
      if($('#gsc-i-id1').length){
      clearInterval(placeholderInput);
      } else {
      return;
      }

      var $_gsc = $('#gsc-i-id1');

      if($_gsc.length){
      $_gsc.attr('placeholder', 'How can we help you?');

      $_gsc.data('placeholder', $_gsc.attr('placeholder'))
      .focus(function(){$_gsc.removeAttr('placeholder');})
      .blur(function(){$_gsc.attr('placeholder', $_gsc.data('placeholder'));});
      }
      }, 500);
      });
      });
    



  require(["jquery","base/overlay"],function($,AppOverlay){

    var onBeforeLoadFunc = function() {
      $('.hl-main-content').css('z-index','auto');
    };

    var cfgOverlay = {
      selectorValue: 'overlayToptocPopup',
      maskColor: '#555555',
      maskLoadSpeed: 200,
      maskOpacity: 0.8,
      maskZindex: 9999999,
      top: "center",
      left: "center",
      close: ".hl-icon-close",
      onBeforeLoad: onBeforeLoadFunc
    };

    AppOverlay.initialize(cfgOverlay);
  });





  var HL_adBlankMonitor = function(cfg) {
    if(cfg.adBlankCodes.length > 0) {
      for(var i = 0; i < cfg.adBlankCodes.length; i++) {
        if (typeof HL_ga_sendTrackEvent === 'function') {
          HL_ga_sendTrackEvent({
          gaEventCategory : 'Ad Display',
          gaEventAction : 'Blank Ad',
          gaEventLabel : 'adBlankCode=' + cfg.adBlankCodes[i] + '&adspot=' + cfg.adPosition + '&pageUrl=' + window.location.pathname
          });
        }
      }
    }
  };




              require([
                'healthline/newsletter-signup'
              ], function( newsletterSignup ){
                newsletterSignup.setConfig({
                  newsletterHost: 'newsletter.healthline.com'
                });
              });
            



      /* load module */
      require(["healthline/footer"]);
    



      require([
      'jquery'
      ], function( $ ) {
        


        arrayPromiseFunctions.push( function() {
          var defer = $.Deferred();

          googletag.cmd.push( function() {
            require([
              'jquery',
              'base/util/header-bidder'
            ], function( $, headerBidder ) {

                window.HL_OutOfPageSlot = googletag.defineOutOfPageSlot( window.slotName + '/Out-of-Page', 'div-gpt-ad-out-of-page' )
                .addService( googletag.pubads() );

                headerBidder.adsOnPageLoad( window.HL_OutOfPageSlot );

                googletag.display( 'div-gpt-ad-out-of-page' );


              log.debug( 'GPT Promise - OOP expected - slot object passed - DESKTOP' );
              defer.resolve( { slotObj: window.HL_OutOfPageSlot, slotName: "OOP" });

            }); // require func

          }); // googletag

          return defer.promise();

        }); // arrayPromiseFunctions

      }); // require func


    


  var fireOnce = false;
  window.hlLbLoaded = false;
  window.hlMr1Loaded = false;
  window.hlMr2Loaded = false;
  window.hlMr3Loaded = false;
  window.hlWslLoaded = false;
  window.hlAdsenseLoaded = false;
  window.ispromisesResolved = false;

  function adLoadGATimer(adPosition, dfpAdSite, adLoadTimeRounded) {
    dataLayer.push({
      'event': 'hlAdLoad',
      'hlAdLoadCategory': 'Ad Display',
      'hlAdLoadAction': 'Ad Load Post Page Load',
      'hlAdLoadInteraction': true,
      'hlAdLoadLabel': adPosition.toLowerCase() + ':' + dfpAdSite,
      'hlAdLoadValue': adLoadTimeRounded
    });
  }

  require(['base/async'], function (Async) {

    var waitForSignal = false;
    window.HL_Fire_RefreshAllAds = function () {
      GPTRefreshAllAds();
    }

    function GPTRefreshAllAds() {
      // KIMPS

      for (var i = 0; i < adsArrayForKIMP.length; i++) {
        if (window.HL_ga_sendTrackEvent && adsArrayForKIMP[i]) {
          var adLoadStart = new Date().getTime();
          var adLoadDiff = adLoadStart - window.PageLoadTime;
          var adLoadTime = adLoadDiff/1000;
          var adLoadTimeRounded = Math.round(adLoadTime*10)/10;
          
          log.info("Ad Type: " + adsArrayForKIMP[i] + "Ad Load Start: " + adLoadStart + " Ad Load Diff: " + adLoadDiff + " Ad Load Time: " + adLoadTime);
          
          try {

            dataLayer.push({
              'event': 'hlKeyImpression',
              'hlKeyImpressionCategory': 'Ad Impression',
              'hlKeyImpressionAction': adsArrayForKIMP[i] + " Impression",
              'hlKeyImpressionLabel': "hn.us.hl.x.x.x.x",
              'hlKeyImpressionInteraction': true
            });
            
            

            if (!hlLbLoaded && adsArrayForKIMP[i] === "LB") {
              hlLbLoaded = true;
              adLoadGATimer(adsArrayForKIMP[i], 'hn.us.hl.x.x.x.x', adLoadTimeRounded);
            } else if (!hlMr1Loaded && adsArrayForKIMP[i] === "MR1") {
              hlMr1Loaded = true;
              adLoadGATimer(adsArrayForKIMP[i], 'hn.us.hl.x.x.x.x', adLoadTimeRounded);
            } else if (!hlMr2Loaded && adsArrayForKIMP[i] === "MR2") {
              hlMr2Loaded = true;
              adLoadGATimer(adsArrayForKIMP[i], 'hn.us.hl.x.x.x.x', adLoadTimeRounded);
            } else if (!hlMr3Loaded && adsArrayForKIMP[i] === "MR3") {
              hlMr3Loaded = true;
              adLoadGATimer(adsArrayForKIMP[i], 'hn.us.hl.x.x.x.x', adLoadTimeRounded);
            } else if (!hlWslLoaded && adsArrayForKIMP[i] === "WSL") {
              hlWslLoaded = true;
              adLoadGATimer(adsArrayForKIMP[i], 'hn.us.hl.x.x.x.x', adLoadTimeRounded);
            } else if (!hlAdsenseLoaded && adsArrayForKIMP[i] === "AdSense") {
              hlAdsenseLoaded = true;
              adLoadGATimer(adsArrayForKIMP[i], 'hn.us.hl.x.x.x.x', adLoadTimeRounded);
            }

            log.info('gpt-common-ad-load-script.jsp - KIMP called: ' + adsArrayForKIMP[i] + ': hn.us.hl.x.x.x.x');
          } catch (e) {
            // if an undefined value in array exists, do no log in GA
            // this does not affect ad refresh
          }
        }
      }
      // THIS IS THE ONE CALL FOR ENTIRE SITE
      googletag.cmd.push(function () {
        

        window.adTimerStart = new Date().getTime();

        
            googletag.pubads().refresh(adsArrayToRefresh, {changeCorrelator: false});
          
      });
    }

    Async(arrayPromiseFunctions, function (PromiseFunction, callback) {
      PromiseFunction().then(function (dataObj) {
        log.debug('gpt-common-ad-load-script.jsp - PromiseFunction callback');

        if (dataObj) {
          log.debug('gpt-common-ad-load-script.jsp - PromiseFunction callback - dataObj true');

          adsArrayToRefresh.push(dataObj.slotObj);
          adsArrayForKIMP.push(dataObj.slotName);
        } else {
          log.debug('gpt-common-ad-load-script.jsp - PromiseFunction callback - dataObj false');

          waitForSignal = true;
        }
        callback();
      }, function () {
        callback();
      });
    }, function () {
      log.trace('gpt-common-ad-load-script.jsp - callback');

      if (waitForSignal) {
        log.debug('gpt-common-ad-load-script.jsp - callback - waitForSignal true');

        $(document).on('wslAdNotShow', function () {
          log.info('gpt-common-ad-load-script.jsp - wslAdNotShow triggered');

          if (!fireOnce) {
            GPTRefreshAllAds();
            fireOnce = true;
          }
        });
        $(document).trigger('promisesResolved');
        window.ispromisesResolved = true;
      } else {
        log.debug('gpt-common-ad-load-script.jsp - callback - waitForSignal false');

        GPTRefreshAllAds();
      }
    });
  });


  (function()
  {
    function loadHorizon()
    {
      var s = document.createElement('script');
      s.type = 'text/javascript';
      s.async = true;
      s.src = location.protocol + '//ak.sail-horizon.com/horizon/v1.js';
      var x = document.getElementsByTagName('script')[0];
      x.parentNode.insertBefore(s, x);
    }
    loadHorizon();
    var oldOnLoad = window.onload;
    window.onload = function()
    {
      if (typeof oldOnLoad === 'function')
      {
        oldOnLoad();
      }
      Sailthru.setup({
        domain: 'horizon.healthline.com',
        useStoredTags: false
      });
    };
  })();


