













    window.dataLayer = window.dataLayer || [];
    
window.dataLayer.push({"visitorType":"guest"});
window.dataLayer.push({"locale":"en"});


    (function (w, d, s, l, i) {
        w[l] = w[l] || [];
        w[l].push({
            'gtm.start':
                new Date().getTime(), event: 'gtm.js'
        });
        var f = d.getElementsByTagName(s)[0],
            j = d.createElement(s), dl = l !== 'dataLayer' ? '&l=' + l : '';
        j.async = true;
        j.src = 'https://www.googletagmanager.com/gtm.js?id=' + i + dl;
        f.parentNode.insertBefore(j, f);
    })(window, document, 'script', 'dataLayer', 'GTM-TCQX9DJ');

Slotty Vegas - The online casino where Supercharged wins pay more!






















































All Games









Sign up


Log in






Welcome back!












   

Forgot password?



 













Sign up & Get€/£350 + 135 Free Spins






Sign Up




Login





















Or



 
1
2
3















   

Forgot password?



 





















Welcome Package


First Deposit
100% up to €100 + 25FS on Book of Dead


Second Deposit
100% up to €50 + 25FS on Book of Dead


Third Deposit
50% up to €100 + 35FS on Book of Dead


Fourth Deposit
200% up to €100 + 50FS on Book of Dead

Terms & Conditions apply















SuperchargedWins are here



Your browser does not support the video tag.










Over 1000 Games


Playngo


Big time gaming


Scientific games


Yggdrasil


Betsoft


Netent


Microgaming


Pragmatic play


Elk studios


Jftw


High5


2by2


Triple edge





View All










Our Payments


























































































































Max Ent Limited is a Limited Liability company registered under the laws of Malta in the European Union with
registration number C47261 and a registered address "JPR Buildings, Level 2, Triq Taz-Zwejt, San Gwann, SGN3000,
MALTA". Max Ent Limited holds a Gaming Service license with number MGA/B2C/210/2011 granted by the Malta Gaming
Authority on the 1st August 2018 under the Gaming Authorisations Regulations (L.N. 243 of 2018) of the
Laws of Malta.
This is a real money gambling app. Please gamble responsibly and only bet what you can afford. For gambling addiction
help and support, please contact Gamble Aware at (0808 8020 133) or visit https://www.begambleaware.org/.

Licensed in the U.K by the Gambling Commission.
Gambling can become addictive and underage gambling is an offence, please Bet Responsibly.
Filtering software can be used by adults (such as parents or within schools) in order to restrict access to the
relevant pages of our website.
Slotty Vegas incorporates the most advanced security and encryption technologies on the market to ensure that all
your financial details are entirely secure at all times.




Our Games


Responsible Gaming


Terms of service


General Bonus Terms


Privacy Policy


Complaints


Facebook


Affiliates



















5.0/5.0 - 357 ratings







Verified by LiveChat



Jan. 2018



EXCELLENT SERVICE




































































































This website uses cookies to ensure you get the best experience on our website.
Learn more




Got it!













    window.ginspOptions = {
        captchaSiteKey: "",
        player: null,
        async: {
            authToken: "null"
        },
        translation: {
            levels: {
                __novice: 'Novice',
                __amateur: 'Amateur',
                __specialist: 'Specialist',
                __expert: 'Expert',
                __professional: 'Professional',
                __vip_bronze: 'VIP\x20Bronze',
                __vip_silver: 'VIP\x20Silver',
                __vip_gold: 'VIP\x20Gold',
                __vip_platinum: 'VIP\x20Platinum',
                __vip_diamond: 'VIP\x20Diamond'
            },
            multiplier: {
                'player.widgets.multiplier_messages.congrats': 'Congratulations\x21',
                'player.widgets.multiplier_messages.text': 'Points\x20multiplier\x20is\x20activated'
            },
            loyalty: {
                'loyalty.new_level.title': 'gincms.loyalty.new_level.title',
                'loyalty.new_level.text': 'gincms.loyalty.new_level.text'
            },
            wheel_of_fortune: {
                emptySectorStr1: 'GINCMS.WHEEL_OF_FORTUNE.POPUPS.WHEEL.EMPTY_SECTOR_STR1',
                emptySectorStr2: 'GINCMS.WHEEL_OF_FORTUNE.POPUPS.WHEEL.EMPTY_SECTOR_STR2',
                respinSector: 'GINCMS.WHEEL_OF_FORTUNE.POPUPS.WHEEL.RESPIN_SECTOR',
                pointsSector: 'gincms.wheel_of_fortune.popups.wheel.points_sector',
                multiplierSector: 'gincms.wheel_of_fortune.popups.wheel.multiplier_sector'
            }
        },
        context: {"locale":"en","allowed_locales":["en","de","ru","fi"],"brand_id":"13","session_name":"gfrcoid","asyncservice_url":"\/\/async.slottyvegas.com\/client.js?ver=4.0.10","reportservice_url":"\/\/stat.slottyvegas.com\/track.js?brandId=13&ref=","currencies":[{"id":2,"title":"US Dollar","code":"USD","iso_code":"USD","symbol":"$","precision":2,"exponent":2,"multiplier":100},{"id":3,"title":"Euro","code":"EUR","iso_code":"EUR","symbol":"\u20ac","precision":2,"exponent":2,"multiplier":100},{"id":82,"title":"Pound Sterling","code":"GBP","iso_code":"GBP","symbol":"\u00a3","precision":2,"exponent":2,"multiplier":100},{"id":4,"title":"Russian Ruble","code":"RUB","iso_code":"RUB","symbol":"RUB","precision":2,"exponent":2,"multiplier":100},{"id":29,"title":"Canadian Dollar","code":"CAD","iso_code":"CAD","symbol":"CA$","precision":2,"exponent":2,"multiplier":100},{"id":12,"title":"Australian Dollar","code":"AUD","iso_code":"AUD","symbol":"A$","precision":2,"exponent":2,"multiplier":100},{"id":115,"title":"Swedish Krona","code":"SEK","iso_code":"SEK","symbol":"SEK","precision":2,"exponent":2,"multiplier":100},{"id":62,"title":"Norwegian Krone","code":"NOK","iso_code":"NOK","symbol":"NOK","precision":2,"exponent":2,"multiplier":100}]},
        balanceGroup: 'casino'
            };

    var ginsp = window.ginsp || {};

    ginsp.asyncOptions = ginsp.asyncOptions || {};
    ginsp.asyncOptions.authToken = ginspOptions.async.authToken;

    window.paceOptions = {
        ajax: {
            trackWebSockets: false
        }
    };




    window.top.__lc = window.top.__lc || {};
            window.top.__lc.group = 3;
    
    window.top.__lc.chat_between_groups = false;
    window.top.__lc.license = 7249321;
    (function () {

        if (typeof window.top.LC_API !== typeof undefined &&
            typeof window.top.LC_API.set_custom_variables === 'function') {
            window.top.LC_API.set_custom_variables([
                {name: 'PageUrl', value: '/en'}
            ]);
        }

        var lc = window.top.document.createElement('script');
        var att = window.top.document.createAttribute('data-cfasync');

        att.value = 'false';
        lc.type = 'text/javascript';
        lc.async = true;
        lc.src = ('https:' === window.top.document.location.protocol
            ? 'https://'
            : 'http://') + 'cdn.livechatinc.com/tracking.js';

        var s = window.top.document.getElementsByTagName('script')[0];
        s.setAttributeNode(att);
        s.parentNode.insertBefore(lc, s);
    })();





