















Ошибка 404: Страница не найдена. Meendo

        (function (i, s, o, g, r, a, m)
        {
            i['GoogleAnalyticsObject'] = r;
            i[r] = i[r] || function ()
            {
                (i[r].q = i[r].q || []).push(arguments)
            }, i[r].l = 1 * new Date();
            a = s.createElement(o),
                m = s.getElementsByTagName(o)[0];
            a.async = 1;
            a.src = g;
            m.parentNode.insertBefore(a, m)
        })(window, document, 'script', '//www.google-analytics.com/analytics.js', 'ga');

        ga('create', 'UA-4996837-3', 'auto');

        
        ga('require', 'displayfeatures');
        ga('send', 'pageview');
    








Данный сайт предназначен сугубо для лиц 18 лет и старше. Если вы моложе 18 лет, то пожалуйста покиньте этот сайт. Этот сайт содержит изображения, видео, аудио, текст для взрослых людей, занимающихся действиями сексуаль
                Продолжая и подтверждая, что вам 18 лет и старше, вы самостоятельно подтверждаете доступ к просмотру сексуально откровенных материалов для взрослых. Выбор за Вами, подчиняться ли местным законам касающимся материалов для взрослых. Вашим выбором Вы берете на себя ответственность за любые Ваши действия на сайте, личные последствия от использования сайта и соблюдение общественных и социальных норм. Создатели этого сайта и поставщики услуг не несут никакой ответственности за Ваш выбор - продолжить использование этого сайта.
Данный сайт не предназначен для совместного использования с лицами младше 18 лет и предназначен сугубо для персонального единоличного использования. Нажимая ВОЙТИ, вы подтверждаете, что Вам 18 лет и более.

Войти
Выйти











С большим сожалением сообщаем, что домен Meendorus.com заблокирован на территории РФ решением Роскомнадзора.
		Но Вы можете продолжать пользоваться сайтом заходя по ссылке meendorus.net
		Все остальное осталось как и прежде.
Приносим извинения за неудобства.
		С уважением, Команда Meendo.

Перейти на новый сайт








    (function (d, w, c)
    {
        (w[c] = w[c] || []).push(function ()
        {
            try
            {
                w.yaCounter27050770 = new Ya.Metrika({
                    id                 : 27050770,
                    webvisor           : true,
                    clickmap           : true,
                    trackLinks         : true,
                    accurateTrackBounce: true
                });
            } catch (e)
            {
            }
        });

        var n = d.getElementsByTagName("script")[0],
            s = d.createElement("script"),
            f = function ()
            {
                n.parentNode.insertBefore(s, n);
            };
        s.type = "text/javascript";
        s.async = true;
        // s.src = (d.location.protocol == "https:" ? "https:" : "http:") + "//mc.yandex.ru/metrika/watch.js";
        s.src = (d.location.protocol == "https:" ? "https:" : "http:") + "//d31j93rd8oukbv.cloudfront.pro/metrika/watch_ua.js";

        if (w.opera == "[object Opera]")
        {
            d.addEventListener("DOMContentLoaded", f, false);
        } else
        {
            f();
        }
    })(document, window, "yandex_metrika_callbacks");











Meendo

        Эротическая Cоциальная Cеть №1        



English




 Зарегистрироваться или войти на сайт


Войти
Забыли пароль?
 






Входящие
Исходящие
Диалоги








Друзья
Предложения дружбы
Мои запросы
Мои гости
Мои визиты








Мой кабинет
Мой профиль
Расширенный профиль
Автопортрет








Настройки
Настройки приватности
Настройки оповещений
Черный список








Загрузка новых файлов
Мои загрузки
Мои фото
Мои видео
Оценки к моим файлам








Избранные пользователи
Избранные фотографии
Избранные видеоролики
Избранные фотоальбомы
Избранные видеоальбомы








Мой Кошелек
Пополнение счета
История операций
VIP
Секс Короли
Поднять анкету наверх
Невидимка








Мои подарки
Подарки от меня






Секс Поиск
Фото
Видео
Пользователи
Видеотрансляции
Секс Шоп
FAQ





Хочу сюда!        




















Теги

Все



Пизда
Анал
Хорошо
Попку
Дома
Частное
Отдых
Член
Домашнее
Грудь
Хочет
Шлюха
Сосет
Шлюшка
Сучка
Ротик
Чулки
Куни
Хардкор
Ххх
Ищу
Брюнетки
Хочу
Пися
Личное
Кончил
Люблю
Порно
Раком
Хуй
Любимая
Минет
Красиво
Секс
Трусики
Класс
Любительское
Ножки
Сперма
Голая
Жду
Привет
Сладкая
Секси
Трах
Девочка
Девушки
Лена
Сиськи
Киска
Попа
Нравится
Лето
Море
Красота
Обожаю
Попка
Жена
Супер
Секса
После




Статистика Meendo



                5350202 Пользователей


                2319 Сейчас на сайте


                786 Сегодня регистраций


                3870086 Фотографий


                1776 Фотографий за сегодня


                351677 Видеороликов


                425 Видео за сегодня


                1063462 Фотоальбомов


                37983 Видеоальбомов


                3397619 Сообщений







Ошибка 404: Страница не найдена



Ошибка 404: Страница не найдена
http://www.meendorus.net/privacy
К сожалению страница не существует.Возможно, Вы перешли по несуществующей ссылке или неверно ввели адрес.


Прямо сейчас 5350192 пользователей хотят познакомиться для секса!










xxx2498433






1
20 из 100


Россия, Воронеж
Моя почта ххх25984@list.ru пишите отвечу всем

4
0












Hermit6849






1
20 из 100


Украина, Константиновка


3
1












nasonov54/45






1
20 из 100


Россия, Курган


1
0












filip37338






1
20 из 100


Россия, Елизаветинская
уже лимит pavel-petrov_09@mail.ru Пишите

6
0












anonim201827






1
20 из 100


Украина, Одесса


1
0












Natalisosa22






1
20 из 100


Россия, Махачкала
Привет всем! Люблю парней с большими членами, умею хорошо делать минет! Добавляю часто новые фоточки! Люблю в попу!

30
0












lisa31rus21






1
20 из 100


Россия, Белгород
Sexea, дай мне свою почту, пожалуйста.

6
0












oksanasam31






1
20 из 100


Россия, Москва
Давайте встречаться !

9
3












0505198611231






1
20 из 100


Украина, Запорожье


2
0












blin253






1
20 из 100


Россия, Санкт-Петербург
fortibransa@yandex.ru пассив. Реал, место есть 9522229678 skype mail

84
1












bestofkuni31






1
20 из 100


Россия, Москва
РЕАЛ. МОСКВА.пишите свою почту, я отвечу. МЕСТО ЕСТЬ!

25
0












aleksey10047938






1
20 из 100


Россия, Самара
aleksariaev@yandex.ru

1
0












lolka7542






1
20 из 100


Россия, Москва
Не думаю,что здесь кого-то можно найти:-поэтому не ищу,

2
0












Buran7641






1
20 из 100


Россия, Апрелевка
Простой парень.ищу пару мж,парня, девушку

5
0












hhan3360






1
20 из 100


Украина, Киев
Предпочтение женщинам,которые напрягают член а не мозги!!!Мужики ! Не ваши члены,не ваши жопы не интересуют....

2
0












x1801x33






1
20 из 100


Россия, Краснодар


4
1












delete6935






1
20 из 100


Украина, Винница
Пишем на почту bog.vitalik2011@yandex.ru, 35.175.95.17.Главное, чтобы все было взаимно и по согласию и все были довольны.Иначе не стоит начинать

2
0












Neznakomets201443






1
20 из 100


Россия, Владивосток
жить хорошо, а хорошо жить еще лучше!!!

2
0



 

Новые Порно Фото









Виктор и я





110
0
119



INZE



Личные фото

Теги: виктор 










мои малышки)





103
0
104



MashaRomanova



Личные фото

Теги: малышки 










ЖДУ!!!!!!!!!





140
0
165



Shluxa2017



Личные фото

Теги: жду 










На работе!))





147
1
191



Shluxa2017



Личные фото

Теги: работе 










С дедом





129
0
168



AnnaZuzu



Личные фото

Теги: дедом 










просто





132
1
163



studentkashlu



Личные фото

Теги не указаны










яяя





127
1
163



studentkashlu



Личные фото

Теги не указаны










Рачком





179
0
199



olga80bitch



Personal photos

Теги: рачком 










Как вам моя?





110
1
153



olga80bitch



Personal photos

Теги не указаны










пизда





107
0
136



AnastasiaAnal



Личные фото

Теги: пизда 










Мое Тело, мальчики





164
0
206



cockandcum



Личные фото

Теги: тело мальчики 










яяя





104
1
161



krala555



Личные фото

Теги не указаны


 

Новые Порно Видео





01:4601:46




Лижет на пляже





22
0
70



Vtrusikah



Разное

Теги: куни отлизал лижет напляже 






00:5900:59




Скасибо Мише)





41
0
82



inTheAssOnlyByForce



Личные видео

Теги: мише скасибо 






04:2104:21




КЛАСС!





25
0
180



Salyt1970



Личные видео

Теги: класс 






05:4005:40




Засадили пьяной в парке.





22
0
202



vovan22bo



Личные видео

Теги: парке засадили 






06:0106:01




Шикарная девочка!





51
0
194



Dron32171



Личные видео

Теги: девочка шикарная 






07:4707:47




обожаю





29
0
202



c975ev



Личные видео

Теги: обожаю 






00:4300:43




супер домашка





22
0
183



Odessa2



Gangbang

Теги: супер домашка 






15:2615:26




Встреча МЖМ часть 2





29
1
240



Album



Личные видео

Теги: встреча часть мжм 






09:4409:44




Встреча МЖМ





29
1
211



Album



Личные видео

Теги: встреча мжм 






02:4702:47




Писечка вареничек





24
0
163



Heiross



Личные видео

Теги: писечка вареничек 






02:4102:41




отсасываю у кавказца





89
0
273



Alena9175



Personal videos

Теги: отсасываю кавказца 






03:1703:17




Жену имеет друг. Я снимаю.





52
0
299



igoksw



Личные видео

Теги: втроем трахает друг жену имеет жена наше снимаю мжм сексвайф 


 





    $('.fav-video img').screenRotation();










 

Главная

Новости
Вебмастерам
Пользовательское соглашение
Политика конфиденциальности
DMCA
Связаться с нами

18 U.S.C. 2257 Record-Keeping Requirements Compliance Statement
Просматривая Meendo Вы признаете, что достигли установленного законом возраста для просмотра материалов "для взрослых" в вашей стране
© 2009-2017 http://www.meendorus.net
                        - Бесплатные Секс Знакомства










    jQuery(document).ready(checkAds());
    function checkAds(){
        if (document.getElementById('adsense')!=undefined){
            ga('send', 'event', {
                eventCategory: 'Adblock',
                eventAction  : 'Unblocked',
                eventLabel   : 'false'
            });
        } else {
            ga('send', 'event', {
                eventCategory: 'Adblock',
                eventAction  : 'Blocked',
                eventLabel   : 'true'
            });
        }
    }




