



Page not found –  Releaselog | RLSLOG.net







<!-- @import url( http://www.rlslog.net/wp-content/themes/ftiny/style.css ); -->














Sorry, no posts matched your criteria.










Search







Categories

Anime (RSS)

Applications (RSS)

Android (RSS)

iOS (RSS)

MAC (RSS)

Tutorials (RSS)

Windows (RSS)



Ebooks (RSS)

Comics (RSS)

eBook (RSS)

Magazines (RSS)



Games (RSS)

Linux (RSS)

MAC (RSS)

PC (RSS)

PS3 (RSS)

PSP (RSS)

Wii (RSS)

XBOX360 (RSS)



Offtopic (RSS)

Site news (RSS)

Tech News (RSS)

MViD (RSS)

Staff Picks (RSS)



PagesAbout Releaselog
Advertise on RLSLOG!
FAQ
How-To Help
Link eXchange
Movie formats
Movie sources
RLSLOG Nuke Dictionary
Torrent sites

Archives


Select Month
 July 2016  (63)
 June 2016  (1251)
 May 2016  (707)
 April 2016  (584)
 March 2016  (669)
 February 2016  (460)
 January 2016  (674)
 December 2015  (920)
 November 2015  (831)
 October 2015  (729)
 September 2015  (810)
 August 2015  (824)
 July 2015  (878)
 June 2015  (728)
 May 2015  (602)
 April 2015  (724)
 March 2015  (887)
 February 2015  (837)
 January 2015  (1576)
 December 2014  (1304)
 November 2014  (907)
 October 2014  (855)
 September 2014  (848)
 August 2014  (688)
 July 2014  (885)
 June 2014  (920)
 May 2014  (909)
 April 2014  (1074)
 March 2014  (1058)
 February 2014  (855)
 January 2014  (607)
 December 2013  (722)
 November 2013  (720)
 October 2013  (779)
 September 2013  (669)
 August 2013  (511)
 July 2013  (505)
 June 2013  (593)
 May 2013  (603)
 April 2013  (676)
 March 2013  (677)
 February 2013  (514)
 January 2013  (367)
 December 2012  (348)
 November 2012  (403)
 October 2012  (333)
 September 2012  (409)
 August 2012  (387)
 July 2012  (356)
 June 2012  (393)
 May 2012  (540)
 April 2012  (569)
 March 2012  (593)
 February 2012  (389)
 January 2012  (422)
 December 2011  (602)
 November 2011  (569)
 October 2011  (711)
 September 2011  (606)
 August 2011  (518)
 July 2011  (222)
 June 2011  (393)
 May 2011  (370)
 April 2011  (438)
 March 2011  (456)
 February 2011  (439)
 January 2011  (443)
 December 2010  (533)
 November 2010  (463)
 October 2010  (373)
 September 2010  (322)
 August 2010  (216)
 July 2010  (329)
 June 2010  (302)
 May 2010  (288)
 April 2010  (305)
 March 2010  (322)
 February 2010  (287)
 January 2010  (310)
 December 2009  (293)
 November 2009  (272)
 October 2009  (231)
 September 2009  (354)
 August 2009  (280)
 July 2009  (318)
 June 2009  (380)
 May 2009  (272)
 April 2009  (211)
 March 2009  (236)
 February 2009  (117)
 January 2009  (164)
 December 2008  (143)
 November 2008  (174)
 October 2008  (219)
 September 2008  (254)
 August 2008  (203)
 July 2008  (176)
 June 2008  (209)
 May 2008  (234)
 April 2008  (166)
 March 2008  (190)
 February 2008  (153)
 January 2008  (169)
 December 2007  (180)
 November 2007  (229)
 October 2007  (210)
 September 2007  (134)
 August 2007  (155)
 July 2007  (139)
 June 2007  (145)
 May 2007  (171)
 April 2007  (127)
 March 2007  (137)
 February 2007  (76)
 January 2007  (68)
 December 2006  (88)
 November 2006  (69)
 October 2006  (46)
 September 2006  (39)
 August 2006  (26)
 July 2006  (52)
 June 2006  (33)
 May 2006  (62)
 April 2006  (53)
 March 2006  (51)
 February 2006  (22)
 January 2006  (25)



Links

RSS | IRC | Contact
New releases | posts
NewTorrents.info
Leecher's Lair
Rapidshare King
PREKiNG
RushFlights


Most rated

Fast and Furious 3: Tokyo Drift soundtrack
Russian eBay and Paypal cheaters busted
Piracy isn't THAT bad and they know it
UK: tougher piracy laws, blacklists of pirates


Most popular

Mass Effect-DETONATiON
Alone In The Dark-iND
Grand Theft Auto IV-Razor1911
The Forbidden Kingdom R5 XViD-PUKKA
Wanted R5 LiNE XviD-iVE


Link exchange

Subtitles
SoftArchive
Dl4all
Download GFX
EPDM Pond Liner
Gaaks
Whiskey Decanters
more links...

Rapidshare King
Season 1 Complete 720p HDTV x264-DIMENSIONAmerican Crime Story Season 1 Complete 720p HDTV x264-MiXEDMob Wives Seasons (1-6) Complete 720p WEBRip H264-MiXEDMTV Movie Awards 2016 720p HDTV x264-ALTEREGOOnce Upon a Time S05E17 720p HDTV x264-SVA




Releaselog © RLSLOG.net 2006-2016



	(function() {
	  var _script = document.createElement('script');
	  _script.type = 'text/javascript';
	  _script.async = true;
	  _script.id = 'init_ad_402543';
	  _script.src = 'http://adrunnr.com/?placement=402543&async';

	  _script.onload = _script.onreadystatechange = function() {
	    var rs = this.readyState;
	    if(this.readyState && this.readyState != 'complete' && this.readyState != 'loaded')
	    	return;

	    if(typeof load_ad_402543 == 'function')
	    	load_ad_402543(_script);

	  };

	  var _s = document.getElementById('load_ad_402543');
	  _s.parentNode.insertBefore(_script, _s)
	})();
	



var sc_project=5303824; 
var sc_invisible=1; 
var sc_partition=59; 
var sc_click_stat=1; 
var sc_security="72c03e4a"; 





  var _gaq = _gaq || [];
  _gaq.push(['_setAccount', 'UA-268231-3']);
  _gaq.push(['_trackPageview']);

  (function() {
    var ga = document.createElement('script'); ga.type = 'text/javascript'; ga.async = true;
    ga.src = ('https:' == document.location.protocol ? 'https://ssl' : 'http://www') + '.google-analytics.com/ga.js';
    var s = document.getElementsByTagName('script')[0]; s.parentNode.insertBefore(ga, s);
  })();









