



	Trimble - Transforming the Way the World Works














































    $(function () {
        $('.mega-1').dcVerticalMegaMenu({
            rowItems: '3',
            speed: 'fast',
            effect: 'show',
            direction: 'right'
        });
        // $('.drop').masonry({ itemSelector: 'div.drop div.left' });      
        $("#click").click(function () {
            $('#click').css({ "background-color": "#f00", "color": "#fff", "cursor": "inherit" }).text("Open this window again and this message will still be here.");
            return false;
        });
        setTimeout(setMinHeightForContainer, 1000);
        if (typeof Sitecore == 'object') {
            var fileref = document.createElement("link")
            fileref.setAttribute("rel", "stylesheet");
            fileref.setAttribute("type", "text/css");
            fileref.setAttribute("href", "/html/styles/custom_sitecore.css");
            document.getElementsByTagName("head")[0].appendChild(fileref);
        }

        if ($(".mainHeadContainer span").html() != null) {
            if ($.trim($(".mainHeadContainer span").html()) == "")
                $(".custLoginContainer").css("margin-top", "-15px");
        } else if ($(".mainHeadContainer span").html() == null && !$(".mainHeadContainer div").hasClass("productfamily_title")) {
            $(".custLoginContainer").css("margin-top", "-15px");
        }
    });
    function checkSideBarLoaded() {
        if ($('.sidebar-container').length == 0) {
            console.log('not ready');
            $jquery.error('not ready');
        }
    }
    function setMinHeightForContainer() {
        try {
            checkSideBarLoaded();
            console.log($('.sidebar-container').css("height"));
            $('#container_body').css('min-height', $('.sidebar-container').css("height"));
            console.log($('.sidebar-container').css("height"));
            $(".container_footer").css('display', "block");
        } catch (err) {
            // debugger;
            setTimeout(setMinHeightForContainer, 500);
            $(".container_footer").css('display', "block");
        }

        $(".fsmAboutVideo").colorbox({ iframe: true, innerWidth: 750, innerHeight: 510 });
    }
  


//<![CDATA[
    function fnTrapKD(event, caller) {
        if (event.keyCode == 13) {
            event.returnValue = false;
            event.cancel = true;
            SliSearch(caller);
            return false;
        }
        return true;
    }
    function SliSearchById(id) {
        SliSearch(document.getElementById(id));
    }
    function SliSearch(caller) {
        var lsQueryString;
        if (caller.value != 'enter keywords') {
            lsQueryString = "w=" + encodeURIComponent(caller.value);
        }
        if (caller.value != '') {
            document.location.href = 'http://trimble.resultspage.com/search?' + lsQueryString;
        }
    }
//]]>


    $(document).ready(function () {
        $(".colorboxImage").colorbox();
        $(".colorboxVideo").colorbox({ iframe: true, innerWidth: 730, innerHeight: 430 });
        $(".colorboxPDF").colorbox({ iframe: true, innerWidth: 800, innerHeight: 600 });
        $(".colorboxDocushare").colorbox({ iframe: true, innerWidth: 750, innerHeight: 510 });
    });






(function(w,d,s,l,i){w[l]=w[l]||[];w[l].push({'gtm.start':
new Date().getTime(),event:'gtm.js'});var f=d.getElementsByTagName(s)[0],
j=d.createElement(s),dl=l!='dataLayer'?'&l='+l:'';j.async=true;j.src=
'//www.googletagmanager.com/gtm.js?id='+i+dl;f.parentNode.insertBefore(j,f);
})(window,document,'script','dataLayer','GTM-NJQQSG');



(function(i,s,o,g,r,a,m){i['GoogleAnalyticsObject']=r;i[r]=i[r]||function(){
(i[r].q=i[r].q||[]).push(arguments)},i[r].l=1*new Date();a=s.createElement(o),
m=s.getElementsByTagName(o)[0];a.async=1;a.src=g;m.parentNode.insertBefore(a,m)
})(window,document,'script','//www.google-analytics.com/analytics.js','ga');

ga('create', 'UA-12575170-1', 'auto');
ga('send', 'pageview');


















Partners
Trimble Worldwide

Service Provider Locator

Dealer Locator








		jQuery(function() {
			$('.topsearch .search').focus(function () {
			    if (this.value == 'Search...') {
			      this.value = '';
			    }
		    });
			$('.topsearch .search').blur(function () {
			    if (this.value == '') {
			      this.value = 'Search...';
			    }
			});
			$('.topsearch .search').on('keydown',function(e){
			    if( e.which == 13)
			        startSearch();
			});
			$('.topsearch input[name="Submit"]').click(function () {
			    startSearch();
			});
			$('.menuTemplate1 .dropimg img').hover( swapImage, restoreImage);
		});
		function startSearch(){
		  window.location.href = 'http://trimble.resultspage.com/search?p=Q&ts=custom&Submit=Submit+Query&w='+ $('.topsearch .search').val();
		}
		function swapImage(){
		  $(this).attr('src', $(this).parent().data('hover-icon'));
		}
		
		function restoreImage(){
		  $(this).attr('src', $(this).parent().data('icon'));
		}












Transforming the way the world works



Industries


Agriculture



Construction & Operations



Geospatial



Natural Resources,Utilities & Government



Transportation & Logistics



All Industries &Applications


Products

Products by Industry

Products by Applications

Investors

Investor Relations

Financial Releases

Events & Presentations

Corporate Governance

Stock Information

Financial Information

Contact Us

Support & Training

Global Support

Trimble Protected

Get Help

Global Training

Support A-Z

Order Fulfillment

Product Registration

Careers

Trimble Careers

Search Jobs

Students & Graduates

FAQ

About

About Trimble

At a Glance

News Room

Locations

Compliances

Company History

Events

Leadership

Small Business

Technology

Contacts













    var images = Array();
    
            images.push('/-/media/Images/Home/Banner/About_new.ashx');
        
            images.push('/-/media/Images/Home/Banner/Geo_new.ashx');
        
            images.push('/-/media/Images/Home/Banner/ag_banner_4.ashx');
        
            images.push('/-/media/Images/Home/Banner/ConstructionBanner_new.ashx');
        
            images.push('/-/media/Images/Home/Banner/Transportation_new.ashx');
        
            images.push('/-/media/Images/Home/Banner/nat_new.ashx');
        
            images.push('/-/media/Images/Home/Banner/all_new.ashx');
        
    MM_preloadImages(images);

    jQuery(function () {
        $('#allinone_thumbnailsBanner_simple').allinone_thumbnailsBanner({
            skin: 'simple',
            width: 1250,
            height: 450,
            width100Proc: false,
            thumbsReflection: 0,
            responsive: true,
            thumbsWrapperMarginTop: -125,
            defaultEffect: 'fade',
            resizeImages: true,
            showPreviewThumbs: true,
            enableTouchScreen: 0
        });
    });  
  





























                            Transforming
                        


                            Worldwide Solutions
                        


                            Learn More
                        





                            Geospatial
                        


                            Helping organizations incorporate spatial information into their operations for increased productivity, greater safety, and value.
                        


                            Explore Geospatial Solutions
                        





                            Agriculture
                        


                            From the office to the field, transforming farming through total farm management solutions.
                        


                            Explore Agriculture Solutions
                        





                            Construction & Operations
                        


                            Boost productivity with innovative technology for planning, design, construction and operation, from the office to the jobsite.
                        


                            Explore Construction Solutions
                        





                            Transportation & Logistics
                        


                            Solutions for long haul trucking, field service management, rail and construction logistics.
                        


                            Explore Transportation & Logistic Solutions
                        





                            Natural Resources, Utilities & Government
                        


                            Innovative technologies designed to improve efficiency, increase productivity and enable informed decision making.
                        


                            Learn More
                        





                            All Industries and Applications
                        


                            Explore our innovative solutions for a wide variety of applications and technologies.
                        


                            Learn More
                        












            Trimble News 
         

View All



May 01, 2017
Trimble and Brookfield Global Integrated Solutions Launch World's First Mixed-Reality Program for Property and Facilities Management


Apr 27, 2017
Trimble Reports First Quarter 2017 Results






Trimble worldwide 





















Service Centers

Trimble Worldwide

Where to Buy
















    Trimble Events

























                About Trimble
            







Trimble at a Glance


Executive Team


History


Trimble Companies


Events










                Investors
            







Investor Relations


Financial Releases


Annual Reports














                Support
            







Support A-Z


Get Help


Trimble Protected


Product Registration


Terms of Sale










                News Room
            







News Releases


News Room
















                Contact Us
            







Technical Support


Public Relations


Investor Relations


Product Training


Trimble Locations


Sales









Privacy Statement
Terms Of Use
Contacts
































© Copyright 2017, Trimble Inc.






















