




Legal Disclosure | DIY-Time













{"@context":"http:\/\/schema.org","@type":"WebSite","@id":"#website","url":"http:\/\/www.diy-time.com\/","name":"DIY-Time","potentialAction":{"@type":"SearchAction","target":"http:\/\/www.diy-time.com\/?s={search_term_string}","query-input":"required name=search_term_string"}}







			window._wpemojiSettings = {"baseUrl":"https:\/\/s.w.org\/images\/core\/emoji\/2.4\/72x72\/","ext":".png","svgUrl":"https:\/\/s.w.org\/images\/core\/emoji\/2.4\/svg\/","svgExt":".svg","source":{"concatemoji":"http:\/\/www.diy-time.com\/wp-includes\/js\/wp-emoji-release.min.js?ver=4.9.5"}};
			!function(a,b,c){function d(a,b){var c=String.fromCharCode;l.clearRect(0,0,k.width,k.height),l.fillText(c.apply(this,a),0,0);var d=k.toDataURL();l.clearRect(0,0,k.width,k.height),l.fillText(c.apply(this,b),0,0);var e=k.toDataURL();return d===e}function e(a){var b;if(!l||!l.fillText)return!1;switch(l.textBaseline="top",l.font="600 32px Arial",a){case"flag":return!(b=d([55356,56826,55356,56819],[55356,56826,8203,55356,56819]))&&(b=d([55356,57332,56128,56423,56128,56418,56128,56421,56128,56430,56128,56423,56128,56447],[55356,57332,8203,56128,56423,8203,56128,56418,8203,56128,56421,8203,56128,56430,8203,56128,56423,8203,56128,56447]),!b);case"emoji":return b=d([55357,56692,8205,9792,65039],[55357,56692,8203,9792,65039]),!b}return!1}function f(a){var c=b.createElement("script");c.src=a,c.defer=c.type="text/javascript",b.getElementsByTagName("head")[0].appendChild(c)}var g,h,i,j,k=b.createElement("canvas"),l=k.getContext&&k.getContext("2d");for(j=Array("flag","emoji"),c.supports={everything:!0,everythingExceptFlag:!0},i=0;i<j.length;i++)c.supports[j[i]]=e(j[i]),c.supports.everything=c.supports.everything&&c.supports[j[i]],"flag"!==j[i]&&(c.supports.everythingExceptFlag=c.supports.everythingExceptFlag&&c.supports[j[i]]);c.supports.everythingExceptFlag=c.supports.everythingExceptFlag&&!c.supports.flag,c.DOMReady=!1,c.readyCallback=function(){c.DOMReady=!0},c.supports.everything||(h=function(){c.readyCallback()},b.addEventListener?(b.addEventListener("DOMContentLoaded",h,!1),a.addEventListener("load",h,!1)):(a.attachEvent("onload",h),b.attachEvent("onreadystatechange",function(){"complete"===b.readyState&&c.readyCallback()})),g=c.source||{},g.concatemoji?f(g.concatemoji):g.wpemoji&&g.twemoji&&(f(g.twemoji),f(g.wpemoji)))}(window,document,window._wpemojiSettings);
		

img.wp-smiley,
img.emoji {
	display: inline !important;
	border: none !important;
	box-shadow: none !important;
	height: 1em !important;
	width: 1em !important;
	margin: 0 .07em !important;
	vertical-align: -0.1em !important;
	background: none !important;
	padding: 0 !important;
}





















#masthead h1{
							color: #000000;
							font-size: 40px;
							font-family: 'Lato';font-weight: 900;

						 }
.homepage-static-image h1{
							color: #000000;
							font-size: 40px;
							font-family: 'Lato';font-weight: 900;

						 }
.intro-right h1{
							color: #000000;
							font-size: 40px;
							font-family: 'Lato';font-weight: 900;

						 }
.intro-left h1{
							color: #000000;
							font-size: 40px;
							font-family: 'Lato';font-weight: 900;

						 }
.intro-center h1{
							color: #000000;
							font-size: 40px;
							font-family: 'Lato';font-weight: 900;

						 }
.primary-navigation .mega-menu h1{
							color: #000000;
							font-size: 40px;
							font-family: 'Lato';font-weight: 900;

						 }
.primary-navigation .mega-col h1{
							color: #000000;
							font-size: 40px;
							font-family: 'Lato';font-weight: 900;

						 }
.primary-navigation .mega-row h1{
							color: #000000;
							font-size: 40px;
							font-family: 'Lato';font-weight: 900;

						 }
#masthead h2{
							color: #000000;
							font-size: 30px;
							font-family: 'Lora';font-weight: 400;

						 }
.homepage-static-image h2{
							color: #000000;
							font-size: 30px;
							font-family: 'Lora';font-weight: 400;

						 }
.intro-right h2{
							color: #000000;
							font-size: 30px;
							font-family: 'Lora';font-weight: 400;

						 }
.intro-left h2{
							color: #000000;
							font-size: 30px;
							font-family: 'Lora';font-weight: 400;

						 }
.intro-center h2{
							color: #000000;
							font-size: 30px;
							font-family: 'Lora';font-weight: 400;

						 }
.primary-navigation .mega-menu h2{
							color: #000000;
							font-size: 30px;
							font-family: 'Lora';font-weight: 400;

						 }
.primary-navigation .mega-col h2{
							color: #000000;
							font-size: 30px;
							font-family: 'Lora';font-weight: 400;

						 }
.primary-navigation .mega-row h2{
							color: #000000;
							font-size: 30px;
							font-family: 'Lora';font-weight: 400;

						 }
#masthead a:hover{ color: #000000;}
.homepage-static-image a:hover{ color: #000000;}
.intro-right a:hover{ color: #000000;}
.intro-left a:hover{ color: #000000;}
.intro-center a:hover{ color: #000000;}
.primary-navigation .mega-menu a:hover{ color: #000000;}
.primary-navigation .mega-col a:hover{ color: #000000;}
.primary-navigation .mega-row a:hover{ color: #000000;}
#masthead {
						 /* fallback  */
						 background-color: #ffffff;background-image: none;
						  /* Safari 4-5, Chrome 1-9 */
						  background: none, -webkit-gradient(linear, left top, right top, from(#ffffff), to(#ffffff));

						  /* Safari 5.1, Chrome 10+ */
						  background: none, -webkit-linear-gradient(left, #ffffff, #ffffff);

						  /* Firefox 3.6+ */
						  background: none, -moz-linear-gradient(left, #ffffff, #ffffff);

						  /* IE 10 */
						  background: none, -ms-linear-gradient(left, #ffffff, #ffffff);

						  /* Opera 11.10+ */
						  background: none, -o-linear-gradient(left, #ffffff, #ffffff);
					}.homepage-static-image {
						 /* fallback  */
						 background-color: #ffffff;background-image: none;
						  /* Safari 4-5, Chrome 1-9 */
						  background: none, -webkit-gradient(linear, left top, right top, from(#ffffff), to(#ffffff));

						  /* Safari 5.1, Chrome 10+ */
						  background: none, -webkit-linear-gradient(left, #ffffff, #ffffff);

						  /* Firefox 3.6+ */
						  background: none, -moz-linear-gradient(left, #ffffff, #ffffff);

						  /* IE 10 */
						  background: none, -ms-linear-gradient(left, #ffffff, #ffffff);

						  /* Opera 11.10+ */
						  background: none, -o-linear-gradient(left, #ffffff, #ffffff);
					}.intro-right {
						 /* fallback  */
						 background-color: #ffffff;background-image: none;
						  /* Safari 4-5, Chrome 1-9 */
						  background: none, -webkit-gradient(linear, left top, right top, from(#ffffff), to(#ffffff));

						  /* Safari 5.1, Chrome 10+ */
						  background: none, -webkit-linear-gradient(left, #ffffff, #ffffff);

						  /* Firefox 3.6+ */
						  background: none, -moz-linear-gradient(left, #ffffff, #ffffff);

						  /* IE 10 */
						  background: none, -ms-linear-gradient(left, #ffffff, #ffffff);

						  /* Opera 11.10+ */
						  background: none, -o-linear-gradient(left, #ffffff, #ffffff);
					}.intro-left {
						 /* fallback  */
						 background-color: #ffffff;background-image: none;
						  /* Safari 4-5, Chrome 1-9 */
						  background: none, -webkit-gradient(linear, left top, right top, from(#ffffff), to(#ffffff));

						  /* Safari 5.1, Chrome 10+ */
						  background: none, -webkit-linear-gradient(left, #ffffff, #ffffff);

						  /* Firefox 3.6+ */
						  background: none, -moz-linear-gradient(left, #ffffff, #ffffff);

						  /* IE 10 */
						  background: none, -ms-linear-gradient(left, #ffffff, #ffffff);

						  /* Opera 11.10+ */
						  background: none, -o-linear-gradient(left, #ffffff, #ffffff);
					}.intro-center {
						 /* fallback  */
						 background-color: #ffffff;background-image: none;
						  /* Safari 4-5, Chrome 1-9 */
						  background: none, -webkit-gradient(linear, left top, right top, from(#ffffff), to(#ffffff));

						  /* Safari 5.1, Chrome 10+ */
						  background: none, -webkit-linear-gradient(left, #ffffff, #ffffff);

						  /* Firefox 3.6+ */
						  background: none, -moz-linear-gradient(left, #ffffff, #ffffff);

						  /* IE 10 */
						  background: none, -ms-linear-gradient(left, #ffffff, #ffffff);

						  /* Opera 11.10+ */
						  background: none, -o-linear-gradient(left, #ffffff, #ffffff);
					}.primary-navigation .mega-menu {
						 /* fallback  */
						 background-color: #ffffff;background-image: none;
						  /* Safari 4-5, Chrome 1-9 */
						  background: none, -webkit-gradient(linear, left top, right top, from(#ffffff), to(#ffffff));

						  /* Safari 5.1, Chrome 10+ */
						  background: none, -webkit-linear-gradient(left, #ffffff, #ffffff);

						  /* Firefox 3.6+ */
						  background: none, -moz-linear-gradient(left, #ffffff, #ffffff);

						  /* IE 10 */
						  background: none, -ms-linear-gradient(left, #ffffff, #ffffff);

						  /* Opera 11.10+ */
						  background: none, -o-linear-gradient(left, #ffffff, #ffffff);
					}.primary-navigation .mega-col {
						 /* fallback  */
						 background-color: #ffffff;background-image: none;
						  /* Safari 4-5, Chrome 1-9 */
						  background: none, -webkit-gradient(linear, left top, right top, from(#ffffff), to(#ffffff));

						  /* Safari 5.1, Chrome 10+ */
						  background: none, -webkit-linear-gradient(left, #ffffff, #ffffff);

						  /* Firefox 3.6+ */
						  background: none, -moz-linear-gradient(left, #ffffff, #ffffff);

						  /* IE 10 */
						  background: none, -ms-linear-gradient(left, #ffffff, #ffffff);

						  /* Opera 11.10+ */
						  background: none, -o-linear-gradient(left, #ffffff, #ffffff);
					}.primary-navigation .mega-row {
						 /* fallback  */
						 background-color: #ffffff;background-image: none;
						  /* Safari 4-5, Chrome 1-9 */
						  background: none, -webkit-gradient(linear, left top, right top, from(#ffffff), to(#ffffff));

						  /* Safari 5.1, Chrome 10+ */
						  background: none, -webkit-linear-gradient(left, #ffffff, #ffffff);

						  /* Firefox 3.6+ */
						  background: none, -moz-linear-gradient(left, #ffffff, #ffffff);

						  /* IE 10 */
						  background: none, -ms-linear-gradient(left, #ffffff, #ffffff);

						  /* Opera 11.10+ */
						  background: none, -o-linear-gradient(left, #ffffff, #ffffff);
					}#primary.content-area h1{
							color: #000000;
							font-size: 40px;
							font-family: 'Lato';font-weight: 900;

						 }
#primary.portfolio-content h1{
							color: #000000;
							font-size: 40px;
							font-family: 'Lato';font-weight: 900;

						 }
#content header h1{
							color: #000000;
							font-size: 40px;
							font-family: 'Lato';font-weight: 900;

						 }
#content article .entry-content h1{
							color: #000000;
							font-size: 40px;
							font-family: 'Lato';font-weight: 900;

						 }
#content article .entry-meta h1{
							color: #000000;
							font-size: 40px;
							font-family: 'Lato';font-weight: 900;

						 }
#primary.content-area h2{
							color: #000000;
							font-size: 30px;
							font-family: 'Lora';font-weight: 400;

						 }
#primary.portfolio-content h2{
							color: #000000;
							font-size: 30px;
							font-family: 'Lora';font-weight: 400;

						 }
#content header h2{
							color: #000000;
							font-size: 30px;
							font-family: 'Lora';font-weight: 400;

						 }
#content article .entry-content h2{
							color: #000000;
							font-size: 30px;
							font-family: 'Lora';font-weight: 400;

						 }
#content article .entry-meta h2{
							color: #000000;
							font-size: 30px;
							font-family: 'Lora';font-weight: 400;

						 }
#primary.content-area h3{
							color: #000000;
							font-size: 28px;
							font-family: 'Lora';font-weight: 400;

						 }
#primary.portfolio-content h3{
							color: #000000;
							font-size: 28px;
							font-family: 'Lora';font-weight: 400;

						 }
#content header h3{
							color: #000000;
							font-size: 28px;
							font-family: 'Lora';font-weight: 400;

						 }
#content article .entry-content h3{
							color: #000000;
							font-size: 28px;
							font-family: 'Lora';font-weight: 400;

						 }
#content article .entry-meta h3{
							color: #000000;
							font-size: 28px;
							font-family: 'Lora';font-weight: 400;

						 }
#primary.content-area h4{
							color: #000000;
							font-size: 23px;
							font-family: 'Lato';font-weight: 100;

						 }
#primary.portfolio-content h4{
							color: #000000;
							font-size: 23px;
							font-family: 'Lato';font-weight: 100;

						 }
#content header h4{
							color: #000000;
							font-size: 23px;
							font-family: 'Lato';font-weight: 100;

						 }
#content article .entry-content h4{
							color: #000000;
							font-size: 23px;
							font-family: 'Lato';font-weight: 100;

						 }
#content article .entry-meta h4{
							color: #000000;
							font-size: 23px;
							font-family: 'Lato';font-weight: 100;

						 }
#primary.content-area h5{
							color: #000000;
							font-size: 20px;
							font-family: 'Lato';font-weight: 100;

						 }
#primary.portfolio-content h5{
							color: #000000;
							font-size: 20px;
							font-family: 'Lato';font-weight: 100;

						 }
#content header h5{
							color: #000000;
							font-size: 20px;
							font-family: 'Lato';font-weight: 100;

						 }
#content article .entry-content h5{
							color: #000000;
							font-size: 20px;
							font-family: 'Lato';font-weight: 100;

						 }
#content article .entry-meta h5{
							color: #000000;
							font-size: 20px;
							font-family: 'Lato';font-weight: 100;

						 }
#primary.content-area h6{
							color: #000000;
							font-size: 11px;
							font-family: 'Arial';font-weight: 400;

						 }
#primary.portfolio-content h6{
							color: #000000;
							font-size: 11px;
							font-family: 'Arial';font-weight: 400;

						 }
#content header h6{
							color: #000000;
							font-size: 11px;
							font-family: 'Arial';font-weight: 400;

						 }
#content article .entry-content h6{
							color: #000000;
							font-size: 11px;
							font-family: 'Arial';font-weight: 400;

						 }
#content article .entry-meta h6{
							color: #000000;
							font-size: 11px;
							font-family: 'Arial';font-weight: 400;

						 }
#primary.content-area p{
							color: #000000;
							font-size: 18px;
							font-family: 'Lora';font-weight: 400;

						 }
#primary.portfolio-content p{
							color: #000000;
							font-size: 18px;
							font-family: 'Lora';font-weight: 400;

						 }
#content header p{
							color: #000000;
							font-size: 18px;
							font-family: 'Lora';font-weight: 400;

						 }
#content article .entry-content p{
							color: #000000;
							font-size: 18px;
							font-family: 'Lora';font-weight: 400;

						 }
#content article .entry-meta p{
							color: #000000;
							font-size: 18px;
							font-family: 'Lora';font-weight: 400;

						 }
#primary.content-area a{ color: #2cafd2;}
#primary.portfolio-content a{ color: #2cafd2;}
#content header a{ color: #2cafd2;}
#content article .entry-content a{ color: #2cafd2;}
#content article .entry-meta a{ color: #2cafd2;}
#primary.content-area a:hover{ color: #2cafd2;}
#primary.portfolio-content a:hover{ color: #2cafd2;}
#content header a:hover{ color: #2cafd2;}
#content article .entry-content a:hover{ color: #2cafd2;}
#content article .entry-meta a:hover{ color: #2cafd2;}
#secondary h4{
							color: #ffffff;
							font-size: 11px;
							font-family: 'Lato';font-weight: 900;

						 }
.site:before h4{
							color: #ffffff;
							font-size: 11px;
							font-family: 'Lato';font-weight: 900;

						 }
#secondary a{ color: #2cafd2;}
.site:before a{ color: #2cafd2;}
#secondary a:hover{ color: #2cafd2;}
.site:before a:hover{ color: #2cafd2;}
#colophon a{ color: #666666;}
#colophon a:hover{ color: #000000;}
#colophon {
						 /* fallback  */
						 background-color: #e9f1f2;background-image: none;
						  /* Safari 4-5, Chrome 1-9 */
						  background: none, -webkit-gradient(linear, left top, right top, from(#e9f1f2), to(#e9f1f2));

						  /* Safari 5.1, Chrome 10+ */
						  background: none, -webkit-linear-gradient(left, #e9f1f2, #e9f1f2);

						  /* Firefox 3.6+ */
						  background: none, -moz-linear-gradient(left, #e9f1f2, #e9f1f2);

						  /* IE 10 */
						  background: none, -ms-linear-gradient(left, #e9f1f2, #e9f1f2);

						  /* Opera 11.10+ */
						  background: none, -o-linear-gradient(left, #e9f1f2, #e9f1f2);
					}

#masthead h1{
							color: #000000;
							font-size: 40px;
							font-family: 'Lato';font-weight: 900;

						 }
.homepage-static-image h1{
							color: #000000;
							font-size: 40px;
							font-family: 'Lato';font-weight: 900;

						 }
.intro-right h1{
							color: #000000;
							font-size: 40px;
							font-family: 'Lato';font-weight: 900;

						 }
.intro-left h1{
							color: #000000;
							font-size: 40px;
							font-family: 'Lato';font-weight: 900;

						 }
.intro-center h1{
							color: #000000;
							font-size: 40px;
							font-family: 'Lato';font-weight: 900;

						 }
.primary-navigation .mega-menu h1{
							color: #000000;
							font-size: 40px;
							font-family: 'Lato';font-weight: 900;

						 }
.primary-navigation .mega-col h1{
							color: #000000;
							font-size: 40px;
							font-family: 'Lato';font-weight: 900;

						 }
.primary-navigation .mega-row h1{
							color: #000000;
							font-size: 40px;
							font-family: 'Lato';font-weight: 900;

						 }
#masthead h2{
							color: #000000;
							font-size: 30px;
							font-family: 'Lora';font-weight: 400;

						 }
.homepage-static-image h2{
							color: #000000;
							font-size: 30px;
							font-family: 'Lora';font-weight: 400;

						 }
.intro-right h2{
							color: #000000;
							font-size: 30px;
							font-family: 'Lora';font-weight: 400;

						 }
.intro-left h2{
							color: #000000;
							font-size: 30px;
							font-family: 'Lora';font-weight: 400;

						 }
.intro-center h2{
							color: #000000;
							font-size: 30px;
							font-family: 'Lora';font-weight: 400;

						 }
.primary-navigation .mega-menu h2{
							color: #000000;
							font-size: 30px;
							font-family: 'Lora';font-weight: 400;

						 }
.primary-navigation .mega-col h2{
							color: #000000;
							font-size: 30px;
							font-family: 'Lora';font-weight: 400;

						 }
.primary-navigation .mega-row h2{
							color: #000000;
							font-size: 30px;
							font-family: 'Lora';font-weight: 400;

						 }
#masthead a:hover{ color: #000000;}
.homepage-static-image a:hover{ color: #000000;}
.intro-right a:hover{ color: #000000;}
.intro-left a:hover{ color: #000000;}
.intro-center a:hover{ color: #000000;}
.primary-navigation .mega-menu a:hover{ color: #000000;}
.primary-navigation .mega-col a:hover{ color: #000000;}
.primary-navigation .mega-row a:hover{ color: #000000;}
#masthead {
						 /* fallback  */
						 background-color: #ffffff;background-image: none;
						  /* Safari 4-5, Chrome 1-9 */
						  background: none, -webkit-gradient(linear, left top, right top, from(#ffffff), to(#ffffff));

						  /* Safari 5.1, Chrome 10+ */
						  background: none, -webkit-linear-gradient(left, #ffffff, #ffffff);

						  /* Firefox 3.6+ */
						  background: none, -moz-linear-gradient(left, #ffffff, #ffffff);

						  /* IE 10 */
						  background: none, -ms-linear-gradient(left, #ffffff, #ffffff);

						  /* Opera 11.10+ */
						  background: none, -o-linear-gradient(left, #ffffff, #ffffff);
					}.homepage-static-image {
						 /* fallback  */
						 background-color: #ffffff;background-image: none;
						  /* Safari 4-5, Chrome 1-9 */
						  background: none, -webkit-gradient(linear, left top, right top, from(#ffffff), to(#ffffff));

						  /* Safari 5.1, Chrome 10+ */
						  background: none, -webkit-linear-gradient(left, #ffffff, #ffffff);

						  /* Firefox 3.6+ */
						  background: none, -moz-linear-gradient(left, #ffffff, #ffffff);

						  /* IE 10 */
						  background: none, -ms-linear-gradient(left, #ffffff, #ffffff);

						  /* Opera 11.10+ */
						  background: none, -o-linear-gradient(left, #ffffff, #ffffff);
					}.intro-right {
						 /* fallback  */
						 background-color: #ffffff;background-image: none;
						  /* Safari 4-5, Chrome 1-9 */
						  background: none, -webkit-gradient(linear, left top, right top, from(#ffffff), to(#ffffff));

						  /* Safari 5.1, Chrome 10+ */
						  background: none, -webkit-linear-gradient(left, #ffffff, #ffffff);

						  /* Firefox 3.6+ */
						  background: none, -moz-linear-gradient(left, #ffffff, #ffffff);

						  /* IE 10 */
						  background: none, -ms-linear-gradient(left, #ffffff, #ffffff);

						  /* Opera 11.10+ */
						  background: none, -o-linear-gradient(left, #ffffff, #ffffff);
					}.intro-left {
						 /* fallback  */
						 background-color: #ffffff;background-image: none;
						  /* Safari 4-5, Chrome 1-9 */
						  background: none, -webkit-gradient(linear, left top, right top, from(#ffffff), to(#ffffff));

						  /* Safari 5.1, Chrome 10+ */
						  background: none, -webkit-linear-gradient(left, #ffffff, #ffffff);

						  /* Firefox 3.6+ */
						  background: none, -moz-linear-gradient(left, #ffffff, #ffffff);

						  /* IE 10 */
						  background: none, -ms-linear-gradient(left, #ffffff, #ffffff);

						  /* Opera 11.10+ */
						  background: none, -o-linear-gradient(left, #ffffff, #ffffff);
					}.intro-center {
						 /* fallback  */
						 background-color: #ffffff;background-image: none;
						  /* Safari 4-5, Chrome 1-9 */
						  background: none, -webkit-gradient(linear, left top, right top, from(#ffffff), to(#ffffff));

						  /* Safari 5.1, Chrome 10+ */
						  background: none, -webkit-linear-gradient(left, #ffffff, #ffffff);

						  /* Firefox 3.6+ */
						  background: none, -moz-linear-gradient(left, #ffffff, #ffffff);

						  /* IE 10 */
						  background: none, -ms-linear-gradient(left, #ffffff, #ffffff);

						  /* Opera 11.10+ */
						  background: none, -o-linear-gradient(left, #ffffff, #ffffff);
					}.primary-navigation .mega-menu {
						 /* fallback  */
						 background-color: #ffffff;background-image: none;
						  /* Safari 4-5, Chrome 1-9 */
						  background: none, -webkit-gradient(linear, left top, right top, from(#ffffff), to(#ffffff));

						  /* Safari 5.1, Chrome 10+ */
						  background: none, -webkit-linear-gradient(left, #ffffff, #ffffff);

						  /* Firefox 3.6+ */
						  background: none, -moz-linear-gradient(left, #ffffff, #ffffff);

						  /* IE 10 */
						  background: none, -ms-linear-gradient(left, #ffffff, #ffffff);

						  /* Opera 11.10+ */
						  background: none, -o-linear-gradient(left, #ffffff, #ffffff);
					}.primary-navigation .mega-col {
						 /* fallback  */
						 background-color: #ffffff;background-image: none;
						  /* Safari 4-5, Chrome 1-9 */
						  background: none, -webkit-gradient(linear, left top, right top, from(#ffffff), to(#ffffff));

						  /* Safari 5.1, Chrome 10+ */
						  background: none, -webkit-linear-gradient(left, #ffffff, #ffffff);

						  /* Firefox 3.6+ */
						  background: none, -moz-linear-gradient(left, #ffffff, #ffffff);

						  /* IE 10 */
						  background: none, -ms-linear-gradient(left, #ffffff, #ffffff);

						  /* Opera 11.10+ */
						  background: none, -o-linear-gradient(left, #ffffff, #ffffff);
					}.primary-navigation .mega-row {
						 /* fallback  */
						 background-color: #ffffff;background-image: none;
						  /* Safari 4-5, Chrome 1-9 */
						  background: none, -webkit-gradient(linear, left top, right top, from(#ffffff), to(#ffffff));

						  /* Safari 5.1, Chrome 10+ */
						  background: none, -webkit-linear-gradient(left, #ffffff, #ffffff);

						  /* Firefox 3.6+ */
						  background: none, -moz-linear-gradient(left, #ffffff, #ffffff);

						  /* IE 10 */
						  background: none, -ms-linear-gradient(left, #ffffff, #ffffff);

						  /* Opera 11.10+ */
						  background: none, -o-linear-gradient(left, #ffffff, #ffffff);
					}#primary.content-area h1{
							color: #000000;
							font-size: 40px;
							font-family: 'Lato';font-weight: 900;

						 }
#primary.portfolio-content h1{
							color: #000000;
							font-size: 40px;
							font-family: 'Lato';font-weight: 900;

						 }
#content header h1{
							color: #000000;
							font-size: 40px;
							font-family: 'Lato';font-weight: 900;

						 }
#content article .entry-content h1{
							color: #000000;
							font-size: 40px;
							font-family: 'Lato';font-weight: 900;

						 }
#content article .entry-meta h1{
							color: #000000;
							font-size: 40px;
							font-family: 'Lato';font-weight: 900;

						 }
#primary.content-area h2{
							color: #000000;
							font-size: 30px;
							font-family: 'Lora';font-weight: 400;

						 }
#primary.portfolio-content h2{
							color: #000000;
							font-size: 30px;
							font-family: 'Lora';font-weight: 400;

						 }
#content header h2{
							color: #000000;
							font-size: 30px;
							font-family: 'Lora';font-weight: 400;

						 }
#content article .entry-content h2{
							color: #000000;
							font-size: 30px;
							font-family: 'Lora';font-weight: 400;

						 }
#content article .entry-meta h2{
							color: #000000;
							font-size: 30px;
							font-family: 'Lora';font-weight: 400;

						 }
#primary.content-area h3{
							color: #000000;
							font-size: 28px;
							font-family: 'Lora';font-weight: 400;

						 }
#primary.portfolio-content h3{
							color: #000000;
							font-size: 28px;
							font-family: 'Lora';font-weight: 400;

						 }
#content header h3{
							color: #000000;
							font-size: 28px;
							font-family: 'Lora';font-weight: 400;

						 }
#content article .entry-content h3{
							color: #000000;
							font-size: 28px;
							font-family: 'Lora';font-weight: 400;

						 }
#content article .entry-meta h3{
							color: #000000;
							font-size: 28px;
							font-family: 'Lora';font-weight: 400;

						 }
#primary.content-area h4{
							color: #000000;
							font-size: 23px;
							font-family: 'Lato';font-weight: 100;

						 }
#primary.portfolio-content h4{
							color: #000000;
							font-size: 23px;
							font-family: 'Lato';font-weight: 100;

						 }
#content header h4{
							color: #000000;
							font-size: 23px;
							font-family: 'Lato';font-weight: 100;

						 }
#content article .entry-content h4{
							color: #000000;
							font-size: 23px;
							font-family: 'Lato';font-weight: 100;

						 }
#content article .entry-meta h4{
							color: #000000;
							font-size: 23px;
							font-family: 'Lato';font-weight: 100;

						 }
#primary.content-area h5{
							color: #000000;
							font-size: 20px;
							font-family: 'Lato';font-weight: 100;

						 }
#primary.portfolio-content h5{
							color: #000000;
							font-size: 20px;
							font-family: 'Lato';font-weight: 100;

						 }
#content header h5{
							color: #000000;
							font-size: 20px;
							font-family: 'Lato';font-weight: 100;

						 }
#content article .entry-content h5{
							color: #000000;
							font-size: 20px;
							font-family: 'Lato';font-weight: 100;

						 }
#content article .entry-meta h5{
							color: #000000;
							font-size: 20px;
							font-family: 'Lato';font-weight: 100;

						 }
#primary.content-area h6{
							color: #000000;
							font-size: 11px;
							font-family: 'Arial';font-weight: 400;

						 }
#primary.portfolio-content h6{
							color: #000000;
							font-size: 11px;
							font-family: 'Arial';font-weight: 400;

						 }
#content header h6{
							color: #000000;
							font-size: 11px;
							font-family: 'Arial';font-weight: 400;

						 }
#content article .entry-content h6{
							color: #000000;
							font-size: 11px;
							font-family: 'Arial';font-weight: 400;

						 }
#content article .entry-meta h6{
							color: #000000;
							font-size: 11px;
							font-family: 'Arial';font-weight: 400;

						 }
#primary.content-area p{
							color: #000000;
							font-size: 18px;
							font-family: 'Lora';font-weight: 400;

						 }
#primary.portfolio-content p{
							color: #000000;
							font-size: 18px;
							font-family: 'Lora';font-weight: 400;

						 }
#content header p{
							color: #000000;
							font-size: 18px;
							font-family: 'Lora';font-weight: 400;

						 }
#content article .entry-content p{
							color: #000000;
							font-size: 18px;
							font-family: 'Lora';font-weight: 400;

						 }
#content article .entry-meta p{
							color: #000000;
							font-size: 18px;
							font-family: 'Lora';font-weight: 400;

						 }
#primary.content-area a{ color: #2cafd2;}
#primary.portfolio-content a{ color: #2cafd2;}
#content header a{ color: #2cafd2;}
#content article .entry-content a{ color: #2cafd2;}
#content article .entry-meta a{ color: #2cafd2;}
#primary.content-area a:hover{ color: #2cafd2;}
#primary.portfolio-content a:hover{ color: #2cafd2;}
#content header a:hover{ color: #2cafd2;}
#content article .entry-content a:hover{ color: #2cafd2;}
#content article .entry-meta a:hover{ color: #2cafd2;}
#secondary h4{
							color: #ffffff;
							font-size: 11px;
							font-family: 'Lato';font-weight: 900;

						 }
.site:before h4{
							color: #ffffff;
							font-size: 11px;
							font-family: 'Lato';font-weight: 900;

						 }
#secondary a{ color: #2cafd2;}
.site:before a{ color: #2cafd2;}
#secondary a:hover{ color: #2cafd2;}
.site:before a:hover{ color: #2cafd2;}
#colophon a{ color: #666666;}
#colophon a:hover{ color: #000000;}
#colophon {
						 /* fallback  */
						 background-color: #e9f1f2;background-image: none;
						  /* Safari 4-5, Chrome 1-9 */
						  background: none, -webkit-gradient(linear, left top, right top, from(#e9f1f2), to(#e9f1f2));

						  /* Safari 5.1, Chrome 10+ */
						  background: none, -webkit-linear-gradient(left, #e9f1f2, #e9f1f2);

						  /* Firefox 3.6+ */
						  background: none, -moz-linear-gradient(left, #e9f1f2, #e9f1f2);

						  /* IE 10 */
						  background: none, -ms-linear-gradient(left, #e9f1f2, #e9f1f2);

						  /* Opera 11.10+ */
						  background: none, -o-linear-gradient(left, #e9f1f2, #e9f1f2);
					}


(function(i,s,o,g,r,a,m){i['GoogleAnalyticsObject']=r;i[r]=i[r]||function(){
	(i[r].q=i[r].q||[]).push(arguments)},i[r].l=1*new Date();a=s.createElement(o),
	m=s.getElementsByTagName(o)[0];a.async=1;a.src=g;m.parentNode.insertBefore(a,m)
})(window,document,'script','https://www.google-analytics.com/analytics.js','ga');
  ga('create', 'UA-102438652-1', 'auto');
  ga('send', 'pageview');


.widget_recent_entries span.post-date,.ui-tabs-active a,.widget_archive a:after,.widget_categories li,.widget_categories li:after,.widget_meta a:after,.widget_pages a:after,.widget_nav_menu a:after,.widget-latest-posts span.date,.widget_about .about-name h5,.primary-color {color: #2cafd2!important;}.post-filter .latest-articles:before,.ui-accordion-header-active,.ui-accordion-header-active:hover.primary-background {background: #2cafd2!important;}.ui-accordion-header-active,.ui-accordion-header.ui-accordion-header:hover.primary-background {border-color: #2cafd2!important;}.blog_ver2 i,.category-filter ul li a,.page-head .breadcrumbs a,.secondary-color {color: #8eb7cb!important;}.secondary-background {background: #8eb7cb!important;}.accent-color {color: #f2f6f8!important;}.accent-background {background: #f2f6f8!important;} 
			/*
You can add your own CSS here.

Click the help icon above to learn more.
*/

/*
.content .box {
min-width: 1500px;
width: 1500px;
}
*/		




Skip to content























Home
Automotive

Mazda
Nissan
Toyota
Scion


Computers & Technology

Smartphones
iPods


Home & Garden
Deals

Gift Ideas Under $50


Contact
 

Primary Menu
Home
Automotive

Mazda
Nissan
Toyota
Scion


Computers & Technology

Smartphones
iPods


Home & Garden
Deals

Gift Ideas Under $50


Contact
 













Home / Legal Disclosure 



 




Legal Disclosure 

All content provided on this website is intended for informational purposes only and cannot be held liable for any injury, damage, or problems that arise when trying to duplicate steps described here. Performing repairs on your car by yourself may void vehicle warranty. This information is provided “as is” without any representations or warranties and should not be treated as advice. All information is subject to change without notice at any time. This information is not guaranteed to be accurate. Do it at your own risk.










Home
Automotive

Mazda
Nissan
Toyota
Scion


Computers & Technology

Smartphones
iPods


Home & Garden
Deals

Gift Ideas Under $50


Contact
 










Back to Top





		  (function(i,s,o,g,r,a,m){i['GoogleAnalyticsObject']=r;i[r]=i[r]||function(){
  (i[r].q=i[r].q||[]).push(arguments)},i[r].l=1*new Date();a=s.createElement(o),
  m=s.getElementsByTagName(o)[0];a.async=1;a.src=g;m.parentNode.insertBefore(a,m)
  })(window,document,'script','https://www.google-analytics.com/analytics.js','ga');

  ga('create', 'UA-102592389-1', 'auto');
  ga('send', 'pageview');

	


Choose a style:

Black




	(function ($) {
		$('.wrap-style-panel.close ul.list-style li a').each(function () {
			$(this).data('settings', JSON.parse($(this).attr('data-settings')));
			$(this).removeAttr('data-settings');
		});
	})(jQuery);











/* <![CDATA[ */
var fwGoogleFonts = {"ABeeZee":{"family":"ABeeZee","variants":["regular","italic"],"position":0},"Abel":{"family":"Abel","variants":["regular"],"position":28},"Abril Fatface":{"family":"Abril Fatface","variants":["regular"],"position":58},"Aclonica":{"family":"Aclonica","variants":["regular"],"position":88},"Acme":{"family":"Acme","variants":["regular"],"position":118},"Actor":{"family":"Actor","variants":["regular"],"position":148},"Adamina":{"family":"Adamina","variants":["regular"],"position":178},"Advent Pro":{"family":"Advent Pro","variants":["100","200","300","regular","500","600","700"],"position":208},"Aguafina Script":{"family":"Aguafina Script","variants":["regular"],"position":238},"Akronim":{"family":"Akronim","variants":["regular"],"position":268},"Aladin":{"family":"Aladin","variants":["regular"],"position":298},"Aldrich":{"family":"Aldrich","variants":["regular"],"position":328},"Alegreya":{"family":"Alegreya","variants":["regular","italic","700","700italic","900","900italic"],"position":358},"Alegreya SC":{"family":"Alegreya SC","variants":["regular","italic","700","700italic","900","900italic"],"position":388},"Alex Brush":{"family":"Alex Brush","variants":["regular"],"position":418},"Alfa Slab One":{"family":"Alfa Slab One","variants":["regular"],"position":448},"Alice":{"family":"Alice","variants":["regular"],"position":478},"Alike":{"family":"Alike","variants":["regular"],"position":508},"Alike Angular":{"family":"Alike Angular","variants":["regular"],"position":538},"Allan":{"family":"Allan","variants":["regular","700"],"position":568},"Allerta":{"family":"Allerta","variants":["regular"],"position":598},"Allerta Stencil":{"family":"Allerta Stencil","variants":["regular"],"position":628},"Allura":{"family":"Allura","variants":["regular"],"position":658},"Almendra":{"family":"Almendra","variants":["regular","italic","700","700italic"],"position":688},"Almendra Display":{"family":"Almendra Display","variants":["regular"],"position":718},"Almendra SC":{"family":"Almendra SC","variants":["regular"],"position":748},"Amarante":{"family":"Amarante","variants":["regular"],"position":778},"Amaranth":{"family":"Amaranth","variants":["regular","italic","700","700italic"],"position":808},"Amatic SC":{"family":"Amatic SC","variants":["regular","700"],"position":838},"Amethysta":{"family":"Amethysta","variants":["regular"],"position":868},"Anaheim":{"family":"Anaheim","variants":["regular"],"position":898},"Andada":{"family":"Andada","variants":["regular"],"position":928},"Andika":{"family":"Andika","variants":["regular"],"position":958},"Angkor":{"family":"Angkor","variants":["regular"],"position":988},"Annie Use Your Telescope":{"family":"Annie Use Your Telescope","variants":["regular"],"position":1018},"Anonymous Pro":{"family":"Anonymous Pro","variants":["regular","italic","700","700italic"],"position":1048},"Antic":{"family":"Antic","variants":["regular"],"position":1078},"Antic Didone":{"family":"Antic Didone","variants":["regular"],"position":1108},"Antic Slab":{"family":"Antic Slab","variants":["regular"],"position":1138},"Anton":{"family":"Anton","variants":["regular"],"position":1168},"Arapey":{"family":"Arapey","variants":["regular","italic"],"position":1198},"Arbutus":{"family":"Arbutus","variants":["regular"],"position":1228},"Arbutus Slab":{"family":"Arbutus Slab","variants":["regular"],"position":1258},"Architects Daughter":{"family":"Architects Daughter","variants":["regular"],"position":1288},"Archivo Black":{"family":"Archivo Black","variants":["regular"],"position":1318},"Archivo Narrow":{"family":"Archivo Narrow","variants":["regular","italic","700","700italic"],"position":1348},"Arimo":{"family":"Arimo","variants":["regular","italic","700","700italic"],"position":1378},"Arizonia":{"family":"Arizonia","variants":["regular"],"position":1408},"Armata":{"family":"Armata","variants":["regular"],"position":1438},"Artifika":{"family":"Artifika","variants":["regular"],"position":1468},"Arvo":{"family":"Arvo","variants":["regular","italic","700","700italic"],"position":1498},"Asap":{"family":"Asap","variants":["regular","italic","700","700italic"],"position":1528},"Asset":{"family":"Asset","variants":["regular"],"position":1558},"Astloch":{"family":"Astloch","variants":["regular","700"],"position":1588},"Asul":{"family":"Asul","variants":["regular","700"],"position":1618},"Atomic Age":{"family":"Atomic Age","variants":["regular"],"position":1648},"Aubrey":{"family":"Aubrey","variants":["regular"],"position":1678},"Audiowide":{"family":"Audiowide","variants":["regular"],"position":1708},"Autour One":{"family":"Autour One","variants":["regular"],"position":1738},"Average":{"family":"Average","variants":["regular"],"position":1768},"Average Sans":{"family":"Average Sans","variants":["regular"],"position":1798},"Averia Gruesa Libre":{"family":"Averia Gruesa Libre","variants":["regular"],"position":1828},"Averia Libre":{"family":"Averia Libre","variants":["300","300italic","regular","italic","700","700italic"],"position":1858},"Averia Sans Libre":{"family":"Averia Sans Libre","variants":["300","300italic","regular","italic","700","700italic"],"position":1888},"Averia Serif Libre":{"family":"Averia Serif Libre","variants":["300","300italic","regular","italic","700","700italic"],"position":1918},"Bad Script":{"family":"Bad Script","variants":["regular"],"position":1948},"Balthazar":{"family":"Balthazar","variants":["regular"],"position":1978},"Bangers":{"family":"Bangers","variants":["regular"],"position":2008},"Basic":{"family":"Basic","variants":["regular"],"position":2038},"Battambang":{"family":"Battambang","variants":["regular","700"],"position":2068},"Baumans":{"family":"Baumans","variants":["regular"],"position":2098},"Bayon":{"family":"Bayon","variants":["regular"],"position":2128},"Belgrano":{"family":"Belgrano","variants":["regular"],"position":2158},"Belleza":{"family":"Belleza","variants":["regular"],"position":2188},"BenchNine":{"family":"BenchNine","variants":["300","regular","700"],"position":2218},"Bentham":{"family":"Bentham","variants":["regular"],"position":2248},"Berkshire Swash":{"family":"Berkshire Swash","variants":["regular"],"position":2278},"Bevan":{"family":"Bevan","variants":["regular"],"position":2308},"Bigelow Rules":{"family":"Bigelow Rules","variants":["regular"],"position":2338},"Bigshot One":{"family":"Bigshot One","variants":["regular"],"position":2368},"Bilbo":{"family":"Bilbo","variants":["regular"],"position":2398},"Bilbo Swash Caps":{"family":"Bilbo Swash Caps","variants":["regular"],"position":2428},"Bitter":{"family":"Bitter","variants":["regular","italic","700"],"position":2458},"Black Ops One":{"family":"Black Ops One","variants":["regular"],"position":2488},"Bokor":{"family":"Bokor","variants":["regular"],"position":2518},"Bonbon":{"family":"Bonbon","variants":["regular"],"position":2548},"Boogaloo":{"family":"Boogaloo","variants":["regular"],"position":2578},"Bowlby One":{"family":"Bowlby One","variants":["regular"],"position":2608},"Bowlby One SC":{"family":"Bowlby One SC","variants":["regular"],"position":2638},"Brawler":{"family":"Brawler","variants":["regular"],"position":2668},"Bree Serif":{"family":"Bree Serif","variants":["regular"],"position":2698},"Bubblegum Sans":{"family":"Bubblegum Sans","variants":["regular"],"position":2728},"Bubbler One":{"family":"Bubbler One","variants":["regular"],"position":2758},"Buda":{"family":"Buda","variants":["300"],"position":2788},"Buenard":{"family":"Buenard","variants":["regular","700"],"position":2818},"Butcherman":{"family":"Butcherman","variants":["regular"],"position":2848},"Butterfly Kids":{"family":"Butterfly Kids","variants":["regular"],"position":2878},"Cabin":{"family":"Cabin","variants":["regular","italic","500","500italic","600","600italic","700","700italic"],"position":2908},"Cabin Condensed":{"family":"Cabin Condensed","variants":["regular","500","600","700"],"position":2938},"Cabin Sketch":{"family":"Cabin Sketch","variants":["regular","700"],"position":2968},"Caesar Dressing":{"family":"Caesar Dressing","variants":["regular"],"position":2998},"Cagliostro":{"family":"Cagliostro","variants":["regular"],"position":3028},"Calligraffitti":{"family":"Calligraffitti","variants":["regular"],"position":3058},"Cambo":{"family":"Cambo","variants":["regular"],"position":3088},"Candal":{"family":"Candal","variants":["regular"],"position":3118},"Cantarell":{"family":"Cantarell","variants":["regular","italic","700","700italic"],"position":3148},"Cantata One":{"family":"Cantata One","variants":["regular"],"position":3178},"Cantora One":{"family":"Cantora One","variants":["regular"],"position":3208},"Capriola":{"family":"Capriola","variants":["regular"],"position":3238},"Cardo":{"family":"Cardo","variants":["regular","italic","700"],"position":3268},"Carme":{"family":"Carme","variants":["regular"],"position":3298},"Carrois Gothic":{"family":"Carrois Gothic","variants":["regular"],"position":3328},"Carrois Gothic SC":{"family":"Carrois Gothic SC","variants":["regular"],"position":3358},"Carter One":{"family":"Carter One","variants":["regular"],"position":3388},"Caudex":{"family":"Caudex","variants":["regular","italic","700","700italic"],"position":3418},"Cedarville Cursive":{"family":"Cedarville Cursive","variants":["regular"],"position":3448},"Ceviche One":{"family":"Ceviche One","variants":["regular"],"position":3478},"Changa One":{"family":"Changa One","variants":["regular","italic"],"position":3508},"Chango":{"family":"Chango","variants":["regular"],"position":3538},"Chau Philomene One":{"family":"Chau Philomene One","variants":["regular","italic"],"position":3568},"Chela One":{"family":"Chela One","variants":["regular"],"position":3598},"Chelsea Market":{"family":"Chelsea Market","variants":["regular"],"position":3628},"Chenla":{"family":"Chenla","variants":["regular"],"position":3658},"Cherry Cream Soda":{"family":"Cherry Cream Soda","variants":["regular"],"position":3688},"Cherry Swash":{"family":"Cherry Swash","variants":["regular","700"],"position":3718},"Chewy":{"family":"Chewy","variants":["regular"],"position":3748},"Chicle":{"family":"Chicle","variants":["regular"],"position":3778},"Chivo":{"family":"Chivo","variants":["regular","italic","900","900italic"],"position":3808},"Cinzel":{"family":"Cinzel","variants":["regular","700","900"],"position":3838},"Cinzel Decorative":{"family":"Cinzel Decorative","variants":["regular","700","900"],"position":3868},"Clicker Script":{"family":"Clicker Script","variants":["regular"],"position":3898},"Coda":{"family":"Coda","variants":["regular","800"],"position":3928},"Coda Caption":{"family":"Coda Caption","variants":["800"],"position":3958},"Codystar":{"family":"Codystar","variants":["300","regular"],"position":3988},"Combo":{"family":"Combo","variants":["regular"],"position":4018},"Comfortaa":{"family":"Comfortaa","variants":["300","regular","700"],"position":4048},"Coming Soon":{"family":"Coming Soon","variants":["regular"],"position":4078},"Concert One":{"family":"Concert One","variants":["regular"],"position":4108},"Condiment":{"family":"Condiment","variants":["regular"],"position":4138},"Content":{"family":"Content","variants":["regular","700"],"position":4168},"Contrail One":{"family":"Contrail One","variants":["regular"],"position":4198},"Convergence":{"family":"Convergence","variants":["regular"],"position":4228},"Cookie":{"family":"Cookie","variants":["regular"],"position":4258},"Copse":{"family":"Copse","variants":["regular"],"position":4288},"Corben":{"family":"Corben","variants":["regular","700"],"position":4318},"Courgette":{"family":"Courgette","variants":["regular"],"position":4348},"Cousine":{"family":"Cousine","variants":["regular","italic","700","700italic"],"position":4378},"Coustard":{"family":"Coustard","variants":["regular","900"],"position":4408},"Covered By Your Grace":{"family":"Covered By Your Grace","variants":["regular"],"position":4438},"Crafty Girls":{"family":"Crafty Girls","variants":["regular"],"position":4468},"Creepster":{"family":"Creepster","variants":["regular"],"position":4498},"Crete Round":{"family":"Crete Round","variants":["regular","italic"],"position":4528},"Crimson Text":{"family":"Crimson Text","variants":["regular","italic","600","600italic","700","700italic"],"position":4558},"Croissant One":{"family":"Croissant One","variants":["regular"],"position":4588},"Crushed":{"family":"Crushed","variants":["regular"],"position":4618},"Cuprum":{"family":"Cuprum","variants":["regular","italic","700","700italic"],"position":4648},"Cutive":{"family":"Cutive","variants":["regular"],"position":4678},"Cutive Mono":{"family":"Cutive Mono","variants":["regular"],"position":4708},"Damion":{"family":"Damion","variants":["regular"],"position":4738},"Dancing Script":{"family":"Dancing Script","variants":["regular","700"],"position":4768},"Dangrek":{"family":"Dangrek","variants":["regular"],"position":4798},"Dawning of a New Day":{"family":"Dawning of a New Day","variants":["regular"],"position":4828},"Days One":{"family":"Days One","variants":["regular"],"position":4858},"Delius":{"family":"Delius","variants":["regular"],"position":4888},"Delius Swash Caps":{"family":"Delius Swash Caps","variants":["regular"],"position":4918},"Delius Unicase":{"family":"Delius Unicase","variants":["regular","700"],"position":4948},"Della Respira":{"family":"Della Respira","variants":["regular"],"position":4978},"Devonshire":{"family":"Devonshire","variants":["regular"],"position":5008},"Didact Gothic":{"family":"Didact Gothic","variants":["regular"],"position":5038},"Diplomata":{"family":"Diplomata","variants":["regular"],"position":5068},"Diplomata SC":{"family":"Diplomata SC","variants":["regular"],"position":5098},"Doppio One":{"family":"Doppio One","variants":["regular"],"position":5128},"Dorsa":{"family":"Dorsa","variants":["regular"],"position":5158},"Dosis":{"family":"Dosis","variants":["200","300","regular","500","600","700","800"],"position":5188},"Dr Sugiyama":{"family":"Dr Sugiyama","variants":["regular"],"position":5218},"Droid Sans":{"family":"Droid Sans","variants":["regular","700"],"position":5248},"Droid Sans Mono":{"family":"Droid Sans Mono","variants":["regular"],"position":5278},"Droid Serif":{"family":"Droid Serif","variants":["regular","italic","700","700italic"],"position":5308},"Duru Sans":{"family":"Duru Sans","variants":["regular"],"position":5338},"Dynalight":{"family":"Dynalight","variants":["regular"],"position":5368},"EB Garamond":{"family":"EB Garamond","variants":["regular"],"position":5398},"Eagle Lake":{"family":"Eagle Lake","variants":["regular"],"position":5428},"Eater":{"family":"Eater","variants":["regular"],"position":5458},"Economica":{"family":"Economica","variants":["regular","italic","700","700italic"],"position":5488},"Electrolize":{"family":"Electrolize","variants":["regular"],"position":5518},"Emblema One":{"family":"Emblema One","variants":["regular"],"position":5548},"Emilys Candy":{"family":"Emilys Candy","variants":["regular"],"position":5578},"Engagement":{"family":"Engagement","variants":["regular"],"position":5608},"Englebert":{"family":"Englebert","variants":["regular"],"position":5638},"Enriqueta":{"family":"Enriqueta","variants":["regular","700"],"position":5668},"Erica One":{"family":"Erica One","variants":["regular"],"position":5698},"Esteban":{"family":"Esteban","variants":["regular"],"position":5728},"Euphoria Script":{"family":"Euphoria Script","variants":["regular"],"position":5758},"Ewert":{"family":"Ewert","variants":["regular"],"position":5788},"Exo":{"family":"Exo","variants":["100","100italic","200","200italic","300","300italic","regular","italic","500","500italic","600","600italic","700","700italic","800","800italic","900","900italic"],"position":5818},"Expletus Sans":{"family":"Expletus Sans","variants":["regular","italic","500","500italic","600","600italic","700","700italic"],"position":5848},"Fanwood Text":{"family":"Fanwood Text","variants":["regular","italic"],"position":5878},"Fascinate":{"family":"Fascinate","variants":["regular"],"position":5908},"Fascinate Inline":{"family":"Fascinate Inline","variants":["regular"],"position":5938},"Faster One":{"family":"Faster One","variants":["regular"],"position":5968},"Fasthand":{"family":"Fasthand","variants":["regular"],"position":5998},"Federant":{"family":"Federant","variants":["regular"],"position":6028},"Federo":{"family":"Federo","variants":["regular"],"position":6058},"Felipa":{"family":"Felipa","variants":["regular"],"position":6088},"Fenix":{"family":"Fenix","variants":["regular"],"position":6118},"Finger Paint":{"family":"Finger Paint","variants":["regular"],"position":6148},"Fjord One":{"family":"Fjord One","variants":["regular"],"position":6178},"Flamenco":{"family":"Flamenco","variants":["300","regular"],"position":6208},"Flavors":{"family":"Flavors","variants":["regular"],"position":6238},"Fondamento":{"family":"Fondamento","variants":["regular","italic"],"position":6268},"Fontdiner Swanky":{"family":"Fontdiner Swanky","variants":["regular"],"position":6298},"Forum":{"family":"Forum","variants":["regular"],"position":6328},"Francois One":{"family":"Francois One","variants":["regular"],"position":6358},"Freckle Face":{"family":"Freckle Face","variants":["regular"],"position":6388},"Fredericka the Great":{"family":"Fredericka the Great","variants":["regular"],"position":6418},"Fredoka One":{"family":"Fredoka One","variants":["regular"],"position":6448},"Freehand":{"family":"Freehand","variants":["regular"],"position":6478},"Fresca":{"family":"Fresca","variants":["regular"],"position":6508},"Frijole":{"family":"Frijole","variants":["regular"],"position":6538},"Fugaz One":{"family":"Fugaz One","variants":["regular"],"position":6568},"GFS Didot":{"family":"GFS Didot","variants":["regular"],"position":6598},"GFS Neohellenic":{"family":"GFS Neohellenic","variants":["regular","italic","700","700italic"],"position":6628},"Gafata":{"family":"Gafata","variants":["regular"],"position":6658},"Galdeano":{"family":"Galdeano","variants":["regular"],"position":6688},"Galindo":{"family":"Galindo","variants":["regular"],"position":6718},"Gentium Basic":{"family":"Gentium Basic","variants":["regular","italic","700","700italic"],"position":6748},"Gentium Book Basic":{"family":"Gentium Book Basic","variants":["regular","italic","700","700italic"],"position":6778},"Geo":{"family":"Geo","variants":["regular","italic"],"position":6808},"Geostar":{"family":"Geostar","variants":["regular"],"position":6838},"Geostar Fill":{"family":"Geostar Fill","variants":["regular"],"position":6868},"Germania One":{"family":"Germania One","variants":["regular"],"position":6898},"Gilda Display":{"family":"Gilda Display","variants":["regular"],"position":6928},"Give You Glory":{"family":"Give You Glory","variants":["regular"],"position":6958},"Glass Antiqua":{"family":"Glass Antiqua","variants":["regular"],"position":6988},"Glegoo":{"family":"Glegoo","variants":["regular"],"position":7018},"Gloria Hallelujah":{"family":"Gloria Hallelujah","variants":["regular"],"position":7048},"Goblin One":{"family":"Goblin One","variants":["regular"],"position":7078},"Gochi Hand":{"family":"Gochi Hand","variants":["regular"],"position":7108},"Gorditas":{"family":"Gorditas","variants":["regular","700"],"position":7138},"Goudy Bookletter 1911":{"family":"Goudy Bookletter 1911","variants":["regular"],"position":7168},"Graduate":{"family":"Graduate","variants":["regular"],"position":7198},"Gravitas One":{"family":"Gravitas One","variants":["regular"],"position":7228},"Great Vibes":{"family":"Great Vibes","variants":["regular"],"position":7258},"Griffy":{"family":"Griffy","variants":["regular"],"position":7288},"Gruppo":{"family":"Gruppo","variants":["regular"],"position":7318},"Gudea":{"family":"Gudea","variants":["regular","italic","700"],"position":7348},"Habibi":{"family":"Habibi","variants":["regular"],"position":7378},"Hammersmith One":{"family":"Hammersmith One","variants":["regular"],"position":7408},"Hanalei":{"family":"Hanalei","variants":["regular"],"position":7438},"Hanalei Fill":{"family":"Hanalei Fill","variants":["regular"],"position":7468},"Handlee":{"family":"Handlee","variants":["regular"],"position":7498},"Hanuman":{"family":"Hanuman","variants":["regular","700"],"position":7528},"Happy Monkey":{"family":"Happy Monkey","variants":["regular"],"position":7558},"Headland One":{"family":"Headland One","variants":["regular"],"position":7588},"Henny Penny":{"family":"Henny Penny","variants":["regular"],"position":7618},"Herr Von Muellerhoff":{"family":"Herr Von Muellerhoff","variants":["regular"],"position":7648},"Holtwood One SC":{"family":"Holtwood One SC","variants":["regular"],"position":7678},"Homemade Apple":{"family":"Homemade Apple","variants":["regular"],"position":7708},"Homenaje":{"family":"Homenaje","variants":["regular"],"position":7738},"IM Fell DW Pica":{"family":"IM Fell DW Pica","variants":["regular","italic"],"position":7768},"IM Fell DW Pica SC":{"family":"IM Fell DW Pica SC","variants":["regular"],"position":7798},"IM Fell Double Pica":{"family":"IM Fell Double Pica","variants":["regular","italic"],"position":7828},"IM Fell Double Pica SC":{"family":"IM Fell Double Pica SC","variants":["regular"],"position":7858},"IM Fell English":{"family":"IM Fell English","variants":["regular","italic"],"position":7888},"IM Fell English SC":{"family":"IM Fell English SC","variants":["regular"],"position":7918},"IM Fell French Canon":{"family":"IM Fell French Canon","variants":["regular","italic"],"position":7948},"IM Fell French Canon SC":{"family":"IM Fell French Canon SC","variants":["regular"],"position":7978},"IM Fell Great Primer":{"family":"IM Fell Great Primer","variants":["regular","italic"],"position":8008},"IM Fell Great Primer SC":{"family":"IM Fell Great Primer SC","variants":["regular"],"position":8038},"Iceberg":{"family":"Iceberg","variants":["regular"],"position":8068},"Iceland":{"family":"Iceland","variants":["regular"],"position":8098},"Imprima":{"family":"Imprima","variants":["regular"],"position":8128},"Inconsolata":{"family":"Inconsolata","variants":["regular","700"],"position":8158},"Inder":{"family":"Inder","variants":["regular"],"position":8188},"Indie Flower":{"family":"Indie Flower","variants":["regular"],"position":8218},"Inika":{"family":"Inika","variants":["regular","700"],"position":8248},"Irish Grover":{"family":"Irish Grover","variants":["regular"],"position":8278},"Istok Web":{"family":"Istok Web","variants":["regular","italic","700","700italic"],"position":8308},"Italiana":{"family":"Italiana","variants":["regular"],"position":8338},"Italianno":{"family":"Italianno","variants":["regular"],"position":8368},"Jacques Francois":{"family":"Jacques Francois","variants":["regular"],"position":8398},"Jacques Francois Shadow":{"family":"Jacques Francois Shadow","variants":["regular"],"position":8428},"Jim Nightshade":{"family":"Jim Nightshade","variants":["regular"],"position":8458},"Jockey One":{"family":"Jockey One","variants":["regular"],"position":8488},"Jolly Lodger":{"family":"Jolly Lodger","variants":["regular"],"position":8518},"Josefin Sans":{"family":"Josefin Sans","variants":["100","100italic","300","300italic","regular","italic","600","600italic","700","700italic"],"position":8548},"Josefin Slab":{"family":"Josefin Slab","variants":["100","100italic","300","300italic","regular","italic","600","600italic","700","700italic"],"position":8578},"Joti One":{"family":"Joti One","variants":["regular"],"position":8608},"Judson":{"family":"Judson","variants":["regular","italic","700"],"position":8638},"Julee":{"family":"Julee","variants":["regular"],"position":8668},"Julius Sans One":{"family":"Julius Sans One","variants":["regular"],"position":8698},"Junge":{"family":"Junge","variants":["regular"],"position":8728},"Jura":{"family":"Jura","variants":["300","regular","500","600"],"position":8758},"Just Another Hand":{"family":"Just Another Hand","variants":["regular"],"position":8788},"Just Me Again Down Here":{"family":"Just Me Again Down Here","variants":["regular"],"position":8818},"Kameron":{"family":"Kameron","variants":["regular","700"],"position":8848},"Karla":{"family":"Karla","variants":["regular","italic","700","700italic"],"position":8878},"Kaushan Script":{"family":"Kaushan Script","variants":["regular"],"position":8908},"Keania One":{"family":"Keania One","variants":["regular"],"position":8938},"Kelly Slab":{"family":"Kelly Slab","variants":["regular"],"position":8968},"Kenia":{"family":"Kenia","variants":["regular"],"position":8998},"Khmer":{"family":"Khmer","variants":["regular"],"position":9028},"Kite One":{"family":"Kite One","variants":["regular"],"position":9058},"Knewave":{"family":"Knewave","variants":["regular"],"position":9088},"Kotta One":{"family":"Kotta One","variants":["regular"],"position":9118},"Koulen":{"family":"Koulen","variants":["regular"],"position":9148},"Kranky":{"family":"Kranky","variants":["regular"],"position":9178},"Kreon":{"family":"Kreon","variants":["300","regular","700"],"position":9208},"Kristi":{"family":"Kristi","variants":["regular"],"position":9238},"Krona One":{"family":"Krona One","variants":["regular"],"position":9268},"La Belle Aurore":{"family":"La Belle Aurore","variants":["regular"],"position":9298},"Lancelot":{"family":"Lancelot","variants":["regular"],"position":9328},"Lato":{"family":"Lato","variants":["100","100italic","300","300italic","regular","italic","700","700italic","900","900italic"],"position":9358},"League Script":{"family":"League Script","variants":["regular"],"position":9388},"Leckerli One":{"family":"Leckerli One","variants":["regular"],"position":9418},"Ledger":{"family":"Ledger","variants":["regular"],"position":9448},"Lekton":{"family":"Lekton","variants":["regular","italic","700"],"position":9478},"Lemon":{"family":"Lemon","variants":["regular"],"position":9508},"Life Savers":{"family":"Life Savers","variants":["regular","700"],"position":9538},"Lilita One":{"family":"Lilita One","variants":["regular"],"position":9568},"Limelight":{"family":"Limelight","variants":["regular"],"position":9598},"Linden Hill":{"family":"Linden Hill","variants":["regular","italic"],"position":9628},"Lobster":{"family":"Lobster","variants":["regular"],"position":9658},"Lobster Two":{"family":"Lobster Two","variants":["regular","italic","700","700italic"],"position":9688},"Londrina Outline":{"family":"Londrina Outline","variants":["regular"],"position":9718},"Londrina Shadow":{"family":"Londrina Shadow","variants":["regular"],"position":9748},"Londrina Sketch":{"family":"Londrina Sketch","variants":["regular"],"position":9778},"Londrina Solid":{"family":"Londrina Solid","variants":["regular"],"position":9808},"Lora":{"family":"Lora","variants":["regular","italic","700","700italic"],"position":9838},"Love Ya Like A Sister":{"family":"Love Ya Like A Sister","variants":["regular"],"position":9868},"Loved by the King":{"family":"Loved by the King","variants":["regular"],"position":9898},"Lovers Quarrel":{"family":"Lovers Quarrel","variants":["regular"],"position":9928},"Luckiest Guy":{"family":"Luckiest Guy","variants":["regular"],"position":9958},"Lusitana":{"family":"Lusitana","variants":["regular","700"],"position":9988},"Lustria":{"family":"Lustria","variants":["regular"],"position":10018},"Macondo":{"family":"Macondo","variants":["regular"],"position":10048},"Macondo Swash Caps":{"family":"Macondo Swash Caps","variants":["regular"],"position":10078},"Magra":{"family":"Magra","variants":["regular","700"],"position":10108},"Maiden Orange":{"family":"Maiden Orange","variants":["regular"],"position":10138},"Mako":{"family":"Mako","variants":["regular"],"position":10168},"Marcellus":{"family":"Marcellus","variants":["regular"],"position":10198},"Marcellus SC":{"family":"Marcellus SC","variants":["regular"],"position":10228},"Marck Script":{"family":"Marck Script","variants":["regular"],"position":10258},"Margarine":{"family":"Margarine","variants":["regular"],"position":10288},"Marko One":{"family":"Marko One","variants":["regular"],"position":10318},"Marmelad":{"family":"Marmelad","variants":["regular"],"position":10348},"Marvel":{"family":"Marvel","variants":["regular","italic","700","700italic"],"position":10378},"Mate":{"family":"Mate","variants":["regular","italic"],"position":10408},"Mate SC":{"family":"Mate SC","variants":["regular"],"position":10438},"Maven Pro":{"family":"Maven Pro","variants":["regular","500","700","900"],"position":10468},"McLaren":{"family":"McLaren","variants":["regular"],"position":10498},"Meddon":{"family":"Meddon","variants":["regular"],"position":10528},"MedievalSharp":{"family":"MedievalSharp","variants":["regular"],"position":10558},"Medula One":{"family":"Medula One","variants":["regular"],"position":10588},"Megrim":{"family":"Megrim","variants":["regular"],"position":10618},"Meie Script":{"family":"Meie Script","variants":["regular"],"position":10648},"Merienda":{"family":"Merienda","variants":["regular","700"],"position":10678},"Merienda One":{"family":"Merienda One","variants":["regular"],"position":10708},"Merriweather":{"family":"Merriweather","variants":["300","300italic","regular","italic","700","700italic","900","900italic"],"position":10738},"Metal":{"family":"Metal","variants":["regular"],"position":10768},"Metal Mania":{"family":"Metal Mania","variants":["regular"],"position":10798},"Metamorphous":{"family":"Metamorphous","variants":["regular"],"position":10828},"Metrophobic":{"family":"Metrophobic","variants":["regular"],"position":10858},"Michroma":{"family":"Michroma","variants":["regular"],"position":10888},"Miltonian":{"family":"Miltonian","variants":["regular"],"position":10918},"Miltonian Tattoo":{"family":"Miltonian Tattoo","variants":["regular"],"position":10948},"Miniver":{"family":"Miniver","variants":["regular"],"position":10978},"Miss Fajardose":{"family":"Miss Fajardose","variants":["regular"],"position":11008},"Modern Antiqua":{"family":"Modern Antiqua","variants":["regular"],"position":11038},"Molengo":{"family":"Molengo","variants":["regular"],"position":11068},"Molle":{"family":"Molle","variants":["italic"],"position":11098},"Monofett":{"family":"Monofett","variants":["regular"],"position":11128},"Monoton":{"family":"Monoton","variants":["regular"],"position":11158},"Monsieur La Doulaise":{"family":"Monsieur La Doulaise","variants":["regular"],"position":11188},"Montaga":{"family":"Montaga","variants":["regular"],"position":11218},"Montez":{"family":"Montez","variants":["regular"],"position":11248},"Montserrat":{"family":"Montserrat","variants":["regular","700"],"position":11278},"Montserrat Alternates":{"family":"Montserrat Alternates","variants":["regular","700"],"position":11308},"Montserrat Subrayada":{"family":"Montserrat Subrayada","variants":["regular","700"],"position":11338},"Moul":{"family":"Moul","variants":["regular"],"position":11368},"Moulpali":{"family":"Moulpali","variants":["regular"],"position":11398},"Mountains of Christmas":{"family":"Mountains of Christmas","variants":["regular","700"],"position":11428},"Mouse Memoirs":{"family":"Mouse Memoirs","variants":["regular"],"position":11458},"Mr Bedfort":{"family":"Mr Bedfort","variants":["regular"],"position":11488},"Mr Dafoe":{"family":"Mr Dafoe","variants":["regular"],"position":11518},"Mr De Haviland":{"family":"Mr De Haviland","variants":["regular"],"position":11548},"Mrs Saint Delafield":{"family":"Mrs Saint Delafield","variants":["regular"],"position":11578},"Mrs Sheppards":{"family":"Mrs Sheppards","variants":["regular"],"position":11608},"Muli":{"family":"Muli","variants":["300","300italic","regular","italic"],"position":11638},"Mystery Quest":{"family":"Mystery Quest","variants":["regular"],"position":11668},"Neucha":{"family":"Neucha","variants":["regular"],"position":11698},"Neuton":{"family":"Neuton","variants":["200","300","regular","italic","700","800"],"position":11728},"News Cycle":{"family":"News Cycle","variants":["regular","700"],"position":11758},"Niconne":{"family":"Niconne","variants":["regular"],"position":11788},"Nixie One":{"family":"Nixie One","variants":["regular"],"position":11818},"Nobile":{"family":"Nobile","variants":["regular","italic","700","700italic"],"position":11848},"Nokora":{"family":"Nokora","variants":["regular","700"],"position":11878},"Norican":{"family":"Norican","variants":["regular"],"position":11908},"Nosifer":{"family":"Nosifer","variants":["regular"],"position":11938},"Nothing You Could Do":{"family":"Nothing You Could Do","variants":["regular"],"position":11968},"Noticia Text":{"family":"Noticia Text","variants":["regular","italic","700","700italic"],"position":11998},"Nova Cut":{"family":"Nova Cut","variants":["regular"],"position":12028},"Nova Flat":{"family":"Nova Flat","variants":["regular"],"position":12058},"Nova Mono":{"family":"Nova Mono","variants":["regular"],"position":12088},"Nova Oval":{"family":"Nova Oval","variants":["regular"],"position":12118},"Nova Round":{"family":"Nova Round","variants":["regular"],"position":12148},"Nova Script":{"family":"Nova Script","variants":["regular"],"position":12178},"Nova Slim":{"family":"Nova Slim","variants":["regular"],"position":12208},"Nova Square":{"family":"Nova Square","variants":["regular"],"position":12238},"Numans":{"family":"Numans","variants":["regular"],"position":12268},"Nunito":{"family":"Nunito","variants":["300","regular","700"],"position":12298},"Odor Mean Chey":{"family":"Odor Mean Chey","variants":["regular"],"position":12328},"Offside":{"family":"Offside","variants":["regular"],"position":12358},"Old Standard TT":{"family":"Old Standard TT","variants":["regular","italic","700"],"position":12388},"Oldenburg":{"family":"Oldenburg","variants":["regular"],"position":12418},"Oleo Script":{"family":"Oleo Script","variants":["regular","700"],"position":12448},"Oleo Script Swash Caps":{"family":"Oleo Script Swash Caps","variants":["regular","700"],"position":12478},"Open Sans":{"family":"Open Sans","variants":["300","300italic","regular","italic","600","600italic","700","700italic","800","800italic"],"position":12508},"Open Sans Condensed":{"family":"Open Sans Condensed","variants":["300","300italic","700"],"position":12538},"Oranienbaum":{"family":"Oranienbaum","variants":["regular"],"position":12568},"Orbitron":{"family":"Orbitron","variants":["regular","500","700","900"],"position":12598},"Oregano":{"family":"Oregano","variants":["regular","italic"],"position":12628},"Orienta":{"family":"Orienta","variants":["regular"],"position":12658},"Original Surfer":{"family":"Original Surfer","variants":["regular"],"position":12688},"Oswald":{"family":"Oswald","variants":["300","regular","700"],"position":12718},"Over the Rainbow":{"family":"Over the Rainbow","variants":["regular"],"position":12748},"Overlock":{"family":"Overlock","variants":["regular","italic","700","700italic","900","900italic"],"position":12778},"Overlock SC":{"family":"Overlock SC","variants":["regular"],"position":12808},"Ovo":{"family":"Ovo","variants":["regular"],"position":12838},"Oxygen":{"family":"Oxygen","variants":["300","regular","700"],"position":12868},"Oxygen Mono":{"family":"Oxygen Mono","variants":["regular"],"position":12898},"PT Mono":{"family":"PT Mono","variants":["regular"],"position":12928},"PT Sans":{"family":"PT Sans","variants":["regular","italic","700","700italic"],"position":12958},"PT Sans Caption":{"family":"PT Sans Caption","variants":["regular","700"],"position":12988},"PT Sans Narrow":{"family":"PT Sans Narrow","variants":["regular","700"],"position":13018},"PT Serif":{"family":"PT Serif","variants":["regular","italic","700","700italic"],"position":13048},"PT Serif Caption":{"family":"PT Serif Caption","variants":["regular","italic"],"position":13078},"Pacifico":{"family":"Pacifico","variants":["regular"],"position":13108},"Paprika":{"family":"Paprika","variants":["regular"],"position":13138},"Parisienne":{"family":"Parisienne","variants":["regular"],"position":13168},"Passero One":{"family":"Passero One","variants":["regular"],"position":13198},"Passion One":{"family":"Passion One","variants":["regular","700","900"],"position":13228},"Patrick Hand":{"family":"Patrick Hand","variants":["regular"],"position":13258},"Patua One":{"family":"Patua One","variants":["regular"],"position":13288},"Paytone One":{"family":"Paytone One","variants":["regular"],"position":13318},"Peralta":{"family":"Peralta","variants":["regular"],"position":13348},"Permanent Marker":{"family":"Permanent Marker","variants":["regular"],"position":13378},"Petit Formal Script":{"family":"Petit Formal Script","variants":["regular"],"position":13408},"Petrona":{"family":"Petrona","variants":["regular"],"position":13438},"Philosopher":{"family":"Philosopher","variants":["regular","italic","700","700italic"],"position":13468},"Piedra":{"family":"Piedra","variants":["regular"],"position":13498},"Pinyon Script":{"family":"Pinyon Script","variants":["regular"],"position":13528},"Pirata One":{"family":"Pirata One","variants":["regular"],"position":13558},"Plaster":{"family":"Plaster","variants":["regular"],"position":13588},"Play":{"family":"Play","variants":["regular","700"],"position":13618},"Playball":{"family":"Playball","variants":["regular"],"position":13648},"Playfair Display":{"family":"Playfair Display","variants":["regular","italic","700","700italic","900","900italic"],"position":13678},"Playfair Display SC":{"family":"Playfair Display SC","variants":["regular","italic","700","700italic","900","900italic"],"position":13708},"Podkova":{"family":"Podkova","variants":["regular","700"],"position":13738},"Poiret One":{"family":"Poiret One","variants":["regular"],"position":13768},"Poller One":{"family":"Poller One","variants":["regular"],"position":13798},"Poly":{"family":"Poly","variants":["regular","italic"],"position":13828},"Pompiere":{"family":"Pompiere","variants":["regular"],"position":13858},"Pontano Sans":{"family":"Pontano Sans","variants":["regular"],"position":13888},"Port Lligat Sans":{"family":"Port Lligat Sans","variants":["regular"],"position":13918},"Port Lligat Slab":{"family":"Port Lligat Slab","variants":["regular"],"position":13948},"Prata":{"family":"Prata","variants":["regular"],"position":13978},"Preahvihear":{"family":"Preahvihear","variants":["regular"],"position":14008},"Press Start 2P":{"family":"Press Start 2P","variants":["regular"],"position":14038},"Princess Sofia":{"family":"Princess Sofia","variants":["regular"],"position":14068},"Prociono":{"family":"Prociono","variants":["regular"],"position":14098},"Prosto One":{"family":"Prosto One","variants":["regular"],"position":14128},"Puritan":{"family":"Puritan","variants":["regular","italic","700","700italic"],"position":14158},"Purple Purse":{"family":"Purple Purse","variants":["regular"],"position":14188},"Quando":{"family":"Quando","variants":["regular"],"position":14218},"Quantico":{"family":"Quantico","variants":["regular","italic","700","700italic"],"position":14248},"Quattrocento":{"family":"Quattrocento","variants":["regular","700"],"position":14278},"Quattrocento Sans":{"family":"Quattrocento Sans","variants":["regular","italic","700","700italic"],"position":14308},"Questrial":{"family":"Questrial","variants":["regular"],"position":14338},"Quicksand":{"family":"Quicksand","variants":["300","regular","700"],"position":14368},"Quintessential":{"family":"Quintessential","variants":["regular"],"position":14398},"Qwigley":{"family":"Qwigley","variants":["regular"],"position":14428},"Racing Sans One":{"family":"Racing Sans One","variants":["regular"],"position":14458},"Radley":{"family":"Radley","variants":["regular","italic"],"position":14488},"Raleway":{"family":"Raleway","variants":["100","200","300","regular","500","600","700","800","900"],"position":14518},"Raleway Dots":{"family":"Raleway Dots","variants":["regular"],"position":14548},"Rambla":{"family":"Rambla","variants":["regular","italic","700","700italic"],"position":14578},"Rammetto One":{"family":"Rammetto One","variants":["regular"],"position":14608},"Ranchers":{"family":"Ranchers","variants":["regular"],"position":14638},"Rancho":{"family":"Rancho","variants":["regular"],"position":14668},"Rationale":{"family":"Rationale","variants":["regular"],"position":14698},"Redressed":{"family":"Redressed","variants":["regular"],"position":14728},"Reenie Beanie":{"family":"Reenie Beanie","variants":["regular"],"position":14758},"Revalia":{"family":"Revalia","variants":["regular"],"position":14788},"Ribeye":{"family":"Ribeye","variants":["regular"],"position":14818},"Ribeye Marrow":{"family":"Ribeye Marrow","variants":["regular"],"position":14848},"Righteous":{"family":"Righteous","variants":["regular"],"position":14878},"Risque":{"family":"Risque","variants":["regular"],"position":14908},"Rochester":{"family":"Rochester","variants":["regular"],"position":14938},"Rock Salt":{"family":"Rock Salt","variants":["regular"],"position":14968},"Rokkitt":{"family":"Rokkitt","variants":["regular","700"],"position":14998},"Romanesco":{"family":"Romanesco","variants":["regular"],"position":15028},"Ropa Sans":{"family":"Ropa Sans","variants":["regular","italic"],"position":15058},"Rosario":{"family":"Rosario","variants":["regular","italic","700","700italic"],"position":15088},"Rosarivo":{"family":"Rosarivo","variants":["regular","italic"],"position":15118},"Rouge Script":{"family":"Rouge Script","variants":["regular"],"position":15148},"Ruda":{"family":"Ruda","variants":["regular","700","900"],"position":15178},"Rufina":{"family":"Rufina","variants":["regular","700"],"position":15208},"Ruge Boogie":{"family":"Ruge Boogie","variants":["regular"],"position":15238},"Ruluko":{"family":"Ruluko","variants":["regular"],"position":15268},"Rum Raisin":{"family":"Rum Raisin","variants":["regular"],"position":15298},"Ruslan Display":{"family":"Ruslan Display","variants":["regular"],"position":15328},"Russo One":{"family":"Russo One","variants":["regular"],"position":15358},"Ruthie":{"family":"Ruthie","variants":["regular"],"position":15388},"Rye":{"family":"Rye","variants":["regular"],"position":15418},"Sacramento":{"family":"Sacramento","variants":["regular"],"position":15448},"Sail":{"family":"Sail","variants":["regular"],"position":15478},"Salsa":{"family":"Salsa","variants":["regular"],"position":15508},"Sanchez":{"family":"Sanchez","variants":["regular","italic"],"position":15538},"Sancreek":{"family":"Sancreek","variants":["regular"],"position":15568},"Sansita One":{"family":"Sansita One","variants":["regular"],"position":15598},"Sarina":{"family":"Sarina","variants":["regular"],"position":15628},"Satisfy":{"family":"Satisfy","variants":["regular"],"position":15658},"Scada":{"family":"Scada","variants":["regular","italic","700","700italic"],"position":15688},"Schoolbell":{"family":"Schoolbell","variants":["regular"],"position":15718},"Seaweed Script":{"family":"Seaweed Script","variants":["regular"],"position":15748},"Sevillana":{"family":"Sevillana","variants":["regular"],"position":15778},"Seymour One":{"family":"Seymour One","variants":["regular"],"position":15808},"Shadows Into Light":{"family":"Shadows Into Light","variants":["regular"],"position":15838},"Shadows Into Light Two":{"family":"Shadows Into Light Two","variants":["regular"],"position":15868},"Shanti":{"family":"Shanti","variants":["regular"],"position":15898},"Share":{"family":"Share","variants":["regular","italic","700","700italic"],"position":15928},"Share Tech":{"family":"Share Tech","variants":["regular"],"position":15958},"Share Tech Mono":{"family":"Share Tech Mono","variants":["regular"],"position":15988},"Shojumaru":{"family":"Shojumaru","variants":["regular"],"position":16018},"Short Stack":{"family":"Short Stack","variants":["regular"],"position":16048},"Siemreap":{"family":"Siemreap","variants":["regular"],"position":16078},"Sigmar One":{"family":"Sigmar One","variants":["regular"],"position":16108},"Signika":{"family":"Signika","variants":["300","regular","600","700"],"position":16138},"Signika Negative":{"family":"Signika Negative","variants":["300","regular","600","700"],"position":16168},"Simonetta":{"family":"Simonetta","variants":["regular","italic","900","900italic"],"position":16198},"Sirin Stencil":{"family":"Sirin Stencil","variants":["regular"],"position":16228},"Six Caps":{"family":"Six Caps","variants":["regular"],"position":16258},"Skranji":{"family":"Skranji","variants":["regular","700"],"position":16288},"Slackey":{"family":"Slackey","variants":["regular"],"position":16318},"Smokum":{"family":"Smokum","variants":["regular"],"position":16348},"Smythe":{"family":"Smythe","variants":["regular"],"position":16378},"Sniglet":{"family":"Sniglet","variants":["regular","800"],"position":16408},"Snippet":{"family":"Snippet","variants":["regular"],"position":16438},"Snowburst One":{"family":"Snowburst One","variants":["regular"],"position":16468},"Sofadi One":{"family":"Sofadi One","variants":["regular"],"position":16498},"Sofia":{"family":"Sofia","variants":["regular"],"position":16528},"Sonsie One":{"family":"Sonsie One","variants":["regular"],"position":16558},"Sorts Mill Goudy":{"family":"Sorts Mill Goudy","variants":["regular","italic"],"position":16588},"Source Code Pro":{"family":"Source Code Pro","variants":["200","300","regular","500","600","700","900"],"position":16618},"Source Sans Pro":{"family":"Source Sans Pro","variants":["200","200italic","300","300italic","regular","italic","600","600italic","700","700italic","900","900italic"],"position":16648},"Special Elite":{"family":"Special Elite","variants":["regular"],"position":16678},"Spicy Rice":{"family":"Spicy Rice","variants":["regular"],"position":16708},"Spinnaker":{"family":"Spinnaker","variants":["regular"],"position":16738},"Spirax":{"family":"Spirax","variants":["regular"],"position":16768},"Squada One":{"family":"Squada One","variants":["regular"],"position":16798},"Stalemate":{"family":"Stalemate","variants":["regular"],"position":16828},"Stalinist One":{"family":"Stalinist One","variants":["regular"],"position":16858},"Stardos Stencil":{"family":"Stardos Stencil","variants":["regular","700"],"position":16888},"Stint Ultra Condensed":{"family":"Stint Ultra Condensed","variants":["regular"],"position":16918},"Stint Ultra Expanded":{"family":"Stint Ultra Expanded","variants":["regular"],"position":16948},"Stoke":{"family":"Stoke","variants":["300","regular"],"position":16978},"Strait":{"family":"Strait","variants":["regular"],"position":17008},"Sue Ellen Francisco":{"family":"Sue Ellen Francisco","variants":["regular"],"position":17038},"Sunshiney":{"family":"Sunshiney","variants":["regular"],"position":17068},"Supermercado One":{"family":"Supermercado One","variants":["regular"],"position":17098},"Suwannaphum":{"family":"Suwannaphum","variants":["regular"],"position":17128},"Swanky and Moo Moo":{"family":"Swanky and Moo Moo","variants":["regular"],"position":17158},"Syncopate":{"family":"Syncopate","variants":["regular","700"],"position":17188},"Tangerine":{"family":"Tangerine","variants":["regular","700"],"position":17218},"Taprom":{"family":"Taprom","variants":["regular"],"position":17248},"Telex":{"family":"Telex","variants":["regular"],"position":17278},"Tenor Sans":{"family":"Tenor Sans","variants":["regular"],"position":17308},"Text Me One":{"family":"Text Me One","variants":["regular"],"position":17338},"The Girl Next Door":{"family":"The Girl Next Door","variants":["regular"],"position":17368},"Tienne":{"family":"Tienne","variants":["regular","700","900"],"position":17398},"Tinos":{"family":"Tinos","variants":["regular","italic","700","700italic"],"position":17428},"Titan One":{"family":"Titan One","variants":["regular"],"position":17458},"Titillium Web":{"family":"Titillium Web","variants":["200","200italic","300","300italic","regular","italic","600","600italic","700","700italic","900"],"position":17488},"Trade Winds":{"family":"Trade Winds","variants":["regular"],"position":17518},"Trocchi":{"family":"Trocchi","variants":["regular"],"position":17548},"Trochut":{"family":"Trochut","variants":["regular","italic","700"],"position":17578},"Trykker":{"family":"Trykker","variants":["regular"],"position":17608},"Tulpen One":{"family":"Tulpen One","variants":["regular"],"position":17638},"Ubuntu":{"family":"Ubuntu","variants":["300","300italic","regular","italic","500","500italic","700","700italic"],"position":17668},"Ubuntu Condensed":{"family":"Ubuntu Condensed","variants":["regular"],"position":17698},"Ubuntu Mono":{"family":"Ubuntu Mono","variants":["regular","italic","700","700italic"],"position":17728},"Ultra":{"family":"Ultra","variants":["regular"],"position":17758},"Uncial Antiqua":{"family":"Uncial Antiqua","variants":["regular"],"position":17788},"Underdog":{"family":"Underdog","variants":["regular"],"position":17818},"Unica One":{"family":"Unica One","variants":["regular"],"position":17848},"UnifrakturCook":{"family":"UnifrakturCook","variants":["700"],"position":17878},"UnifrakturMaguntia":{"family":"UnifrakturMaguntia","variants":["regular"],"position":17908},"Unkempt":{"family":"Unkempt","variants":["regular","700"],"position":17938},"Unlock":{"family":"Unlock","variants":["regular"],"position":17968},"Unna":{"family":"Unna","variants":["regular"],"position":17998},"VT323":{"family":"VT323","variants":["regular"],"position":18028},"Vampiro One":{"family":"Vampiro One","variants":["regular"],"position":18058},"Varela":{"family":"Varela","variants":["regular"],"position":18088},"Varela Round":{"family":"Varela Round","variants":["regular"],"position":18118},"Vast Shadow":{"family":"Vast Shadow","variants":["regular"],"position":18148},"Vibur":{"family":"Vibur","variants":["regular"],"position":18178},"Vidaloka":{"family":"Vidaloka","variants":["regular"],"position":18208},"Viga":{"family":"Viga","variants":["regular"],"position":18238},"Voces":{"family":"Voces","variants":["regular"],"position":18268},"Volkhov":{"family":"Volkhov","variants":["regular","italic","700","700italic"],"position":18298},"Vollkorn":{"family":"Vollkorn","variants":["regular","italic","700","700italic"],"position":18328},"Voltaire":{"family":"Voltaire","variants":["regular"],"position":18358},"Waiting for the Sunrise":{"family":"Waiting for the Sunrise","variants":["regular"],"position":18388},"Wallpoet":{"family":"Wallpoet","variants":["regular"],"position":18418},"Walter Turncoat":{"family":"Walter Turncoat","variants":["regular"],"position":18448},"Warnes":{"family":"Warnes","variants":["regular"],"position":18478},"Wellfleet":{"family":"Wellfleet","variants":["regular"],"position":18508},"Wire One":{"family":"Wire One","variants":["regular"],"position":18538},"Yanone Kaffeesatz":{"family":"Yanone Kaffeesatz","variants":["200","300","regular","700"],"position":18568},"Yellowtail":{"family":"Yellowtail","variants":["regular"],"position":18598},"Yeseva One":{"family":"Yeseva One","variants":["regular"],"position":18628},"Yesteryear":{"family":"Yesteryear","variants":["regular"],"position":18658},"Zeyada":{"family":"Zeyada","variants":["regular"],"position":18688}};
var fwSwitchStylePanel = {"cache_key":"wrap-style-panel"};
/* ]]> */




