




Privacy policy | SpicyMatch







































.iub_footer p + p { display: none; }

















English

 














Privacy policy













(function(i,s,o,g,r,a,m){i['GoogleAnalyticsObject']=r;i[r]=i[r]||function(){
(i[r].q=i[r].q||[]).push(arguments)},i[r].l=1*new Date();a=s.createElement(o),
m=s.getElementsByTagName(o)[0];a.async=1;a.src=g;m.parentNode.insertBefore(a,m)
})(window,document,'script','https://www.google-analytics.com/analytics.js','ga');
ga('create', 'UA-32231537-1', 'auto');
ga('send', 'pageview');


Z = {"V":"sm5043","CDS":".","CGS":",","u":0,"lang":"en","mob":false,"cpt":false,"lcName":"smlc","wcd":"spicymatch.com"};
SM = {"SUPPORT":[27,326,328,29037,39509,83653,83655],"picCid":"00N","miles":1,"wpo":0};
Z.fbConfig = { appId: "853051284772056", scope: "email" };
Z.gpConfig = { 	apiKey: "AIzaSyCfjpdgSiAzfS7VdczhPc57uzvqo3rJQRQ", clientId: "706855495864-eg7tj74nt5l576k45c3cng44pmqoqrut.apps.googleusercontent.com" };


_atrk_opts = { atrk_acct:"+S9Vg1asOv000X", domain:"spicymatch.com",dynamic: true}; (function() { var as = document.createElement('script'); as.type = 'text/javascript'; as.async = true; as.src = "https://d31qbv1cthcecs.cloudfront.net/atrk.js"; var s = document.getElementsByTagName('script')[0];s.parentNode.insertBefore(as, s); })();


HELP_DATA = {"id":481,"ref":"privacy","path":[{"id":481,"ref":"privacy","text":"Privacy policy"},{"id":82,"ref":"terms-and-conditions","text":"Terms and Conditions"},{"id":1,"ref":"1","text":"Help Centre"}],"menu":[{"id":1,"ref":"1","text":"Back","back":1},{"id":106,"ref":"terms","text":"Terms of use","hid":106},{"id":152,"ref":"guidelines","text":"Community guidelines","hid":152},{"id":481,"ref":"privacy","text":"Privacy policy","hid":481},{"id":240,"ref":"eula","text":"Mobile App EULA","hid":240}],"content":[{"id":482,"ref":"482","type":"html","text":"<a href=\"https://www.iubenda.com/privacy-policy/63690271\" class=\"iubenda-white no-brand iubenda-embed iub-body-embed\" title=\"Privacy Policy\"><\/a>\r\n\r\n<script>\r\n\t$(\"#iubendaScript\").remove();\r\n\tZ.injectScript(\"iubendaScript\", \"https://cdn.iubenda.com/iubenda.js\");\r\n<\/script>"}],"engRules":true};




