Privacy{
                "@context": "http://schema.org",
                "@type": "WebSite",
                "url": "https://mangarock.com/",
                "potentialAction": {
                  "@type": "SearchAction",
                  "target": "https://mangarock.com/search?q={search_keywords}",
                  "query-input": "required name=search_keywords"
                }
              }
              window._taboola = window._taboola || [];
              _taboola.push({ article: 'auto' });
              !function (e, f, u, i) {
                  if (!document.getElementById(i)) {
                      e.async = 1;
                      e.src = u;
                      e.id = i;
                      f.parentNode.insertBefore(e, f);
                  }
              }(document.createElement('script'),
                  document.getElementsByTagName('script')[0],
                  '//cdn.taboola.com/libtrc/noizerlimited-network/loader.js',
                  'tb_loader_script');
              if (window.performance && typeof window.performance.mark == 'function') { window.performance.mark('tbl_ic'); }window.APP_STATE={"user":{},"meta":{"data":{}},"genre":[{"eid":100117675,"name":"4-koma","oid":"mrs-genre-100117675"},{"eid":304068,"name":"Action","oid":"mrs-genre-304068"},{"eid":358370,"name":"Adult","oid":"mrs-genre-358370"},{"eid":304087,"name":"Adventure","oid":"mrs-genre-304087"},{"eid":304069,"name":"Comedy","oid":"mrs-genre-304069"},{"eid":304088,"name":"Demons","oid":"mrs-genre-304088"},{"eid":304197,"name":"Doujinshi","oid":"mrs-genre-304197"},{"eid":304177,"name":"Drama","oid":"mrs-genre-304177"},{"eid":304074,"name":"Ecchi","oid":"mrs-genre-304074"},{"eid":304089,"name":"Fantasy","oid":"mrs-genre-304089"},{"eid":304358,"name":"Gender Bender","oid":"mrs-genre-304358"},{"eid":304075,"name":"Harem","oid":"mrs-genre-304075"},{"eid":304306,"name":"Historical","oid":"mrs-genre-304306"},{"eid":304259,"name":"Horror","oid":"mrs-genre-304259"},{"eid":304070,"name":"Josei","oid":"mrs-genre-304070"},{"eid":304846,"name":"Kids","oid":"mrs-genre-304846"},{"eid":304090,"name":"Magic","oid":"mrs-genre-304090"},{"eid":304072,"name":"Martial Arts","oid":"mrs-genre-304072"},{"eid":358371,"name":"Mature","oid":"mrs-genre-358371"},{"eid":304245,"name":"Mecha","oid":"mrs-genre-304245"},{"eid":304091,"name":"Military","oid":"mrs-genre-304091"},{"eid":304589,"name":"Music","oid":"mrs-genre-304589"},{"eid":304178,"name":"Mystery","oid":"mrs-genre-304178"},{"eid":100018505,"name":"One Shot","oid":"mrs-genre-100018505"},{"eid":304786,"name":"Parody","oid":"mrs-genre-304786"},{"eid":304236,"name":"Police","oid":"mrs-genre-304236"},{"eid":304176,"name":"Psychological","oid":"mrs-genre-304176"},{"eid":304073,"name":"Romance","oid":"mrs-genre-304073"},{"eid":304076,"name":"School Life","oid":"mrs-genre-304076"},{"eid":304180,"name":"Sci-Fi","oid":"mrs-genre-304180"},{"eid":304077,"name":"Seinen","oid":"mrs-genre-304077"},{"eid":304175,"name":"Shoujo","oid":"mrs-genre-304175"},{"eid":304695,"name":"Shoujo Ai","oid":"mrs-genre-304695"},{"eid":304164,"name":"Shounen","oid":"mrs-genre-304164"},{"eid":304307,"name":"Shounen Ai","oid":"mrs-genre-304307"},{"eid":304195,"name":"Slice of Life","oid":"mrs-genre-304195"},{"eid":358372,"name":"Smut","oid":"mrs-genre-358372"},{"eid":305814,"name":"Space","oid":"mrs-genre-305814"},{"eid":304367,"name":"Sports","oid":"mrs-genre-304367"},{"eid":305270,"name":"Super Power","oid":"mrs-genre-305270"},{"eid":304067,"name":"Supernatural","oid":"mrs-genre-304067"},{"eid":358379,"name":"Tragedy","oid":"mrs-genre-358379"},{"eid":304765,"name":"Vampire","oid":"mrs-genre-304765"},{"eid":358150,"name":"Webtoons","oid":"mrs-genre-358150"},{"eid":304202,"name":"Yaoi","oid":"mrs-genre-304202"},{"eid":304690,"name":"Yuri","oid":"mrs-genre-304690"}],"runtime":{"host":"https:\u002F\u002Fmangarock.com","initialNow":1521600873911,"country":"Crawler","isMobileDevice":false,"blocker":false,"html_meta":{"metaName":{"twitter:card":"summary_large_image","description":"The best place to read the latest & greatest manga for FREE! From the makers of the popular Manga Rock app, we aim to provide the best-quality manga & be the first one to publish new chapters. Enjoy!","twitter:description":"The best place to read the latest & greatest manga for FREE! From the makers of the popular Manga Rock app, we aim to provide the best-quality manga & be the first one to publish new chapters. Enjoy!","twitter:image":"https:\u002F\u002Fmangarock.com\u002Fimages\u002Fhomeshare.jpg","twitter:url":"https:\u002F\u002Fmangarock.com\u002Fprivacy","twitter:app:id:googleplay":"com.notabasement.mangarock.android.lotus","twitter:app:url:googleplay":"rofmr:\u002F\u002F","twitter:app:id:iphone":"519675128","twitter:app:id:ipad":"519675128","twitter:app:url:iphone":"rofmr:\u002F\u002F","twitter:app:url:ipad":"rofmr:\u002F\u002F","apple-itunes-app":"app-id=519675128, app-argument=rofmr:\u002F\u002F","branch:deeplink:internalURL":"rofmr:\u002F\u002F","twitter:site":"@MangaRockApp","keywords":"manga,reader,manga reader,manga viewer,naruto manga viewer,bleach manga viewer,read manga Android,read manga iPad,read manga iPhone,read manga mobile,best android manga app,manga reader software,android manga reader, iphone manga reader, ipad manga reader,"},"metaProperty":{"og:description":"The best place to read the latest & greatest manga for FREE! From the makers of the popular Manga Rock app, we aim to provide the best-quality manga & be the first one to publish new chapters. Enjoy!","og:image":"https:\u002F\u002Fmangarock.com\u002Fimages\u002Fhomeshare.jpg","og:url":"https:\u002F\u002Fmangarock.com\u002Fprivacy","al:web:url":"https:\u002F\u002Fmangarock.com\u002Fprivacy","og:type":"article","al:android:package":"com.notabasement.mangarock.android.lotus","al:android:url":"rofmr:\u002F\u002F","al:android:app_name":"Manga Rock","al:web:should_fallback":"false","al:ios:app_store_id":"519675128","al:ios:app_name":"Manga Rock","al:ios:url":"rofmr:\u002F\u002F","fb:app_id":"374789612698","article:author":"https:\u002F\u002Fwww.facebook.com\u002Fmangarockapp\u002F","og:site_name":"Manga Rock - Online Manga Reader"},"itemProps":{"description":"The best place to read the latest & greatest manga for FREE! From the makers of the popular Manga Rock app, we aim to provide the best-quality manga & be the first one to publish new chapters. Enjoy!","image":"https:\u002F\u002Fmangarock.com\u002Fimages\u002Fhomeshare.jpg"}}},"HUD":{"image":"","text":"","hudID":""},"snackbar":{"text":"","button":{},"barID":""},"quickSearch":{"lastFetched":null,"isLoading":false,"searchText":"","error":null,"focused":false,"results":{},"code":0}}window.ga=function(){ga.q.push(arguments)};ga.q=[];ga.l=+new Date;ga('create','UA-42208491-3','auto');ga('send','pageview')
                window._taboola = window._taboola || [];
                _taboola.push({ flush: true });
              