









porntube, porn tube, mobile porn, pornotube, you porn, youporn










    @media screen and (max-width: 480px) and (min-width: 320px) {
        .video-thumb {
            width: 100%;
            padding :12px;
        }
        .video-thumb .video-title{
            font-weight: normal;
            white-space: pre-wrap;
            overflow: visible;
            text-overflow: initial;
        }
        .video-thumb .video-title a{
            font-size: 14px !important;
        }
        .video-thumb .time,.views{
            font-size : 12px !important;
        }
        .video-item .rating {
            font-size : 12px !important;
        }
    }


    window.config = {
        app: {
            debug: false,
            bannedWords: 'child|lolita|infant|preteen|pedophile|underage|pedophilia|underaged|raped|raping|rape|children|kids|rapes|lolitas|infants|preteens|pedophiliac|pedo|pedofilia|under age|kid|gangrape'
        },
        api: {
            url: 'https://api.youjizz.com/api/v1.0'
        },
        limit: {
            itemsPerPage: 24,
            recommended: 12
        },
        ads: {
            provider: 'ex',
            neverblock: false,
            interstitial: true,
            interstitialDelayMs: 300,
            mobileRollAd: false,
            mobileIM: false,
            desktopPopunder: true,
            mobilePopunder: true,
            adTowerClose: false,
            desktopPreroll: '//syndication.exoclick.com/splash.php?idzone=2931974',
            mobilePreroll: '//cdn.nsimg.net/cache/landing/pr/20180516/yjmobile-03.xml',
            exoNativeAds: '0'
        },
        features: {
            hls: {
                user_agents: 'iPhone|iPad',
                date_added: '2009-01-01',
                ids: '|32702481|32702721|'
            },
            showMore: false,
            like: true,
            videoResolution: {
                date_added: '2009-01-01',
                date_added_mobile: '2018-12-15'
            },
            notifications: false,
            socialPlaylist: false,
            ratingCaptchaSkip: 0,
            searchHD: false,
            playlist: false,
            notificationPolling: 60,
            fluidPlayer: true,
            fluidPlayerTheater: true,
            freezeVideoAtTop: false,
            videoPreviews: true,
            submitterSubscriptions: false,
            comments: true,
            anonymousComments: true
        },
        cdn: {
            'static': 'https://cdne-static.yjcontentdelivery.com/app/1/'
        }
    };
    











    $(document).ready(function() {
        var documentElem = $(document);
        var mobileHeader = $('.mobile-header');
        var lastScrollTop = 0;
        documentElem.on('scroll', function() {
            var currentScrollTop = $(this).scrollTop();
            if (currentScrollTop > 100 && (currentScrollTop > lastScrollTop + 4)) mobileHeader.addClass('mobile-header-hidden');
            else if (currentScrollTop < 5 || (currentScrollTop < lastScrollTop - 4)) mobileHeader.removeClass('mobile-header-hidden');
            lastScrollTop = currentScrollTop;
        });
    });





Set Home:

Popular
Newest




Filter Content:

Straight
Gay
Shemale
All

  Auto play:

OFF







 English
 語言








Loading...



Logged in: 




 Logout
 History  Favorites
 Upload




 Sign Up Free!
 Login
 Upload
 History  Videos i like 



























Popular





Newest





Top


All
Week
Month





Trending



Random





Tags





Pornstars





Live Sex
Sex Chat
Meet&Fuck;
Porn Games











































Popular
Newest
Top Rated


All
Week
Month


Trending
Random
Tags
Pornstars
Live Sex
Sex Chat
Meet&Fuck;
Porn Games


  Trending Categories 


japanese
mom
milf
asian
creampie
massage
stepmom
layla london
reena sky
adriana chechik
blacked
latina
anal
ebony
sister
pov
forced
hentai
teen
threesome
lesbian
fake taxi
mom and son
step sister
big tits
compilation
angela white
bbw
vixen
interracial
amateur
gangbang
karma rx
big ass
brazzers
kendra lust
pinay
step mom
taboo







Filter Content:

Straight
Gay
Shemale
All






Loading...


Logged in: 
 Logout
 History
 Favorites
 Upload
Video I Like




 Sign Up Free!
 Login
 History  Upload
 Videos i like 



Auto Play :OFF




Switch Language :

 English
 語言



Set Home :

Popular
Newest



Set thumb size:

 Small
 Large



Site Information :

DMCA
Content Protection
Content Partner
Privacy
2257
Terms & Conditions
Help
RTA
Parental Control
Sitemap



































                                                    Privacy Policy:
                                                    
                                                    www.youjizz.com
                                                    
                                                    www.jizzhut.com
                                                    
                                                    www.jizzonline.com
                                                    
                                                    www.moviesguy.com
                                                    
                                                    www.jizzbo.com
                                                    
                                                    www.onlyjizz.com
                                                    
                                                    www.hotfunhouse.com
                                                

                                                Effective Date: December 12, 2011
                                                Last Updated: December 12, 2011
                                            


I. General
A. The operative parties referred to in this policy are Company and you, the user of
                                                this site.
                                                
                                                1.International Media, Ltd., is the publisher and operator of the websites
                                                listed at the beginning of this policy. Hereinafter, International Media,
                                                Ltd. shall be referred to as "Company". When first-person pronouns are
                                                used in this Policy, (us, we, our, ours, etc.) these provisions are referring
                                                to Company. Additionally, when the terms "The Site" or "Site" are used,
                                                these terms refer to the websites listed at the beginning of this policy.
                                                
                                                2.You, the User - As the user of this site, this policy will refer to the user
                                                as "you" or through any second-person pronouns, such as "yours," etc.
                                                Hereinafter, the user of the site shall be referred to in applicable second-
                                                person pronouns.
                                                
B. This Privacy Policy describes how we use information received about you when
                                                you visit our Site or when you subscribe to, or otherwise use our online services.
                                                This Policy does not cover any information that we may receive from or about
                                                you through channels other than through the use of the Site.
                                                
II. Revisions to this Policy
                                                We reserve the right to revise, amend, or modify this policy and our other policies
                                                and agreements at any time and in any manner. You should periodically check for any
                                                modifications of this Policy by re-visiting this web page and using the "refresh" button
                                                on your browser. You should note the date of last revision to this Policy, which appears
                                                at the top of this Policy. If the "last modified" date remains unchanged after you have -1- clicked the "refresh" button on your browser, you may presume that no changes have
                                                been made since the last reading of the policy. A changed "last modified" dates indicates
                                                that this Policy has been updated or edited, and the updated or edited version supersedes
                                                any prior versions immediately upon posting.
                                                
III. Personal information that we collect
                                                Visitors to our site and services will have multiple manners of interactivity with us.
                                                Depending upon your level of interaction, we will collect different information about
                                                you. The type of information collected is as follows:
                                                
A. Members Members are those users who interact with our services in a
                                                way which requires registration, such as by uploading content to the Site.
                                                Members will be prompted to provide their e-mail address in the process
                                                of registering a username.
                                                
B. BrowsersBrowsers are visitors to the site who never enter into any
                                                active data collection pages. Browsers may, however, view content
                                                uploaded by Members. Any information gathered from Browsers is also
                                                gathered from Members. This information is restricted to cookies, IP
                                                Addresses and Referral URLs, and other passive information gathering
                                                devises (explained below).
                                                
IV. How we collect information from you
A. Passive Collection 
                                                We use cookies to collect information about you in
                                                order to enhance your experience on the site. The information collected in our
                                                cookies includes, but is not limited to, your user IP address and other session data.
                                                
B. Active Collection  We collect information from you, such as your e-mail
                                                address and IP address, when you complete registration forms to sign up for your
                                                membership on our Site. Locations for such collection are registration pages, but
                                                we reserve the right to add additional information collection portals.
                                                
V.How we use your information
                                                The primary use for your information is to provide you with services you have requested. We also use your information to deliver customized services to you.
                                                Non-personal and aggregate information, such as that collected passively is used in order
                                                to customize our marketing efforts or to customize the use of our site for an aggregate
                                                group of customers. We additionally may use the personal information of users whose
                                                membership has expired or have been cancelled in order to market our services to these
                                                individuals in the future.
                                                
                                                We generally will use your information for the purposes for which you specifically provide it, for example, to verify membership, if applicable. We -2- also use your information for market research purposes - in order to increase your (and
                                                other users') experience according to tracked interests, to analyze and target potential new markets, and for other marketing purposes.
                                                
                                                    VI. Special Cases. 

                                                It is our policy not to use or share the personal information about Browsers or Members
                                                in ways unrelated to those described in this Policy without also providing you an
                                                opportunity to opt out or otherwise prohibit such unrelated uses. However, we may
                                                disclose personal information about Browsers or Members, or information regarding your
                                                use of the Services or Sites accessible through our Services, for any reason if, in our sole
                                                discretion, we believe that it is reasonable to do so, including:
                                                
                                                1.
                                                To satisfy any laws, such as the Electronic Communications Privacy Act,
                                                regulations, or governmental, or legal requests for such information;
                                                
                                                2.
                                                To disclose information that is necessary to identify, contact, or bring
                                                legal action against someone who may be violating our Terms &
                                                Conditions or other user policies;
                                                
                                                3.
                                                To operate our Services properly;
                                                
                                                4.
                                                To protect ourselves, our Members, and the general public. We
                                                specifically reserve the right to disclose any and all information to law
                                                enforcement in the event that a crime is committed, is suspected, or if we
                                                are compelled to do so by lawful criminal, civil, or administrative process,
                                                discovery requests, subpoenas, court orders, writs, or reasonable request
                                                of authorities or persons with the reasonable power to obtain such process.
                                                
                                                5.
                                                We will always cooperate with law enforcement authorities, private-party
                                                litigants, and others seeking information about our end users to the extent
                                                required by applicable law. Examples of such cooperation include lawful
                                                criminal, civil, or administrative process, discovery requests, subpoenas,
                                                court orders, writs, or reasonable request of authorities or persons with the
                                                reasonable power to obtain such process.
                                                
VII. Transmittals from Us 
                                                We may send you periodic announcements including the details of our existing
                                                and new programs. You may opt out of these announcements by contacting
                                                youjizzadmin@gmail.com or by clicking the opt-out link at the bottom of these emails.
                                                If you opt out of these marketing emails, you may still receive system notices and other
                                                information that is specifically related to your account.
                                                
                                                If you provide your information to us, use the Site, or subscribe to any of our services, you will have created a commercial relationship with us. In having done so, you -3- understand that even unsolicited commercial email sent from us or our affiliates is not SPAM as that term is defined under the law.
                                                
VIII. Public Forums and Other Public Areas:
A. Public Forums  We may offer forums or other interactive features on the Site.
                                                We may also provide services that allow Members or Browsers to post messages or
                                                comments to the public. Any and all information posted to the Site, whether as a
                                                comment to a video or any other post, should immediately be considered to be public
                                                information.
                                                B.  Any information or content you voluntarily provide to Us should be considered
                                                public. You may have the opportunity to provide additional information or content
                                                that is not required for registration to the Site, and your voluntary provision of such
                                                information is solely your decision.
                                                IX. Our Commitment to Data Security.
                                                We take measures to protect the transmission of all sensitive end-user information.
                                                We make every effort to ensure the integrity and security of our network and systems.
                                                Nevertheless, we cannot guarantee that our security measures will prevent third-
                                                party 'hackers' from illegally obtaining this information. We take all reasonable
                                                measures to prevent such breaches of security, but given the resourcefulness of cyber-
                                                criminals we are unable to guarantee that our security is 100% breach-proof. You
                                                assume the risk of such breaches to the extent that they occur despite our reasonable
                                                security measures.
                                                X. How to Access or Modify Your Information.
                                                We may offer our Members the opportunity to access or modify information provided
                                                during registration. To access or modify such information, contact our Customer Service
                                                Department at youjizzadmin(at)gmail.com.
                                                XI. Where to Direct Questions About Our Privacy Policy.
                                                If you have any questions about this Privacy Policy or the practices described herein, you
                                                may contact us at youjizzadmin(at)gmail.com.
                                                
- End -

















Advertisement




Ads by Exoclick.com







Trending Categories

japanese
mom
milf
asian
creampie
massage
stepmom
layla london
reena sky
adriana chechik
blacked
latina
anal
ebony
sister
pov
forced
hentai
teen
threesome
lesbian
fake taxi
mom and son
step sister
big tits
compilation
angela white
bbw
vixen
interracial
amateur
gangbang
karma rx
big ass
brazzers
kendra lust
pinay
step mom
taboo




 Mobile Porn, Free Mobile Porn, Iphone Porn, Phone Porn, Ipad Porn, Android Porn, Mobile Porn Videos,
        Mobile Porn Movies, Mobile Sex Movies, Mobile Sex Videos
    



DMCA
Content Protection
Content Partner
Privacy
2257
Terms & Conditions
Help
RTA
Parental Control
Sitemap



Copyright 2019. YouJizz.com. All Rights Reserved










        (function(i,s,o,g,r,a,m){i['GoogleAnalyticsObject']=r;i[r]=i[r]||function(){
            (i[r].q=i[r].q||[]).push(arguments)},i[r].l=1*new Date();a=s.createElement(o),
                m=s.getElementsByTagName(o)[0];a.async=1;a.src=g;m.parentNode.insertBefore(a,m)
        })(window,document,'script','https://www.google-analytics.com/analytics.js','ga');

        ga('create', 'UA-3428380-25', 'auto');
        ga('send', 'pageview');
    



    //<![CDATA[
    var keywords = document.querySelector("meta[name='keywords']").getAttribute("content").substring(0, 64);

    var owa_baseUrl = 'https://esearch.youjizz.com/';
    var owa_cmds = owa_cmds || [];
    owa_cmds.push(['setSiteId', 'a5709f8530fd3a932c7cb67f11e17270']);
    owa_cmds.push(['setCustomVar', '_keywords', '', keywords, 'page']);

    owa_cmds.push(['trackPageView']);
    var owa_max_count = 2;

    (function() {
    //	let n = 0;
    //	if (sessionStorage.getItem('owa_count')) {
    //		n = parseInt(sessionStorage.getItem('owa_count'));
    //	}
    //	else {
    //		if (Math.floor(Math.random()*owa_max_count) != 1)
    //			return;
    //	}
    //        sessionStorage.setItem('owa_count', n + 1);
        var _owa = document.createElement('script'); _owa.type = 'text/javascript'; _owa.async = true;
        owa_baseUrl = ('https:' == document.location.protocol ? window.owa_baseSecUrl || owa_baseUrl.replace(/http:/, 'https:') : owa_baseUrl );
        _owa.src = owa_baseUrl + 'modules/base/js/owa.tracker-combined-min.js';
        var _owa_s = document.getElementsByTagName('script')[0]; _owa_s.parentNode.insertBefore(_owa, _owa_s);
    }());
    //]]>
    



