









PressTV-Privacy Policy
























Breaking News



×













PressTV




Schedule
Watch Live





 















News


Middle East
Asia-Pacific
Africa
Europe
Americas
Society
Arts
Business
Sports




Iran


Politics
Economy
Energy
Nuclear Energy
Culture
Defence
Sport



US
UK
Videos

Programs


Iran Today
Economic Divide
On The News Line
The Isle
We The People
Press Plus
A Simple Question
Africa Today
The Sun Will Rise
The Big Conversation
Islam And Life
Food For Thought
Face To Face
The Debate
Iran
Opinion
Doc Review
Underreported
Doubling Down
New Chapter
Middle East Papers
Press Release
The Secret
Trending
Inside Israel
Interface
Midstream



Docs
فارسی
French





فارسی


French














Privacy Policy


                                    Tue Feb 20, 2018 05:30PM 
                                     [Updated: Tue Feb 20, 2018 05:38PM ]
                                

HomeOthers






presstv



The Information We Need
You can express an opinion, or subscribe to our online newsletter. The types of information we inquire include: name, e-mail address, and information about your interests in our programs, and services.
How We Use the Information
We may use the information to communicate with you, such as to notify you when we make changes to our subscriber agreements or send you our newsletter upon request.
Our Commitment to Security
We have procedures to safeguard and help prevent unauthorized access to your data.
About Cookies
This site contains cookies. A cookie is a small piece of data sent from a website and stored on the user's computer by the user's web browser while the user is browsing.

















                            var extid = "ptvdefaultdetail553044";
                            _hcwp = window._hcwp || [];
                            _hcwp.push({ widget: "Stream", widget_id: 26215, xid: extid, hc_disable: 1, quote_disable: 1, social: "google, facebook, twitter, openid", comments_level: 2 });
                            (function () {
                                if ("HC_LOAD_INIT" in window) return;
                                HC_LOAD_INIT = true;
                                var lang = (navigator.language || navigator.systemLanguage || navigator.userLanguage || "en").substr(0, 2).toLowerCase();
                                var hcc = document.createElement("script"); hcc.type = "text/javascript"; hcc.async = true;
                                hcc.src = ("https:" == document.location.protocol ? "https" : "http") + "://w.hypercomments.com/widget/hc/26215/" + lang + "/widget.js";
                                var s = document.getElementsByTagName("script")[0];
                                s.parentNode.insertBefore(hcc, s.nextSibling);
                            })();
                        




Loading ...












                         
                    



News




Iran
Middle East
US
UK
Asia-Pacific
Africa




Europe
Americas
Society
Arts
Business
Sports








Video


News Bulletin
Reports
Interviews






TV


Watch Live
Schedule
Shows
Documentaries






PressTV


About PressTV
Frequencies
Privacy Policy
Contact Info
SMS









Subscribe











PressTV


                        © Copyright 2018 PressTV. All rights reserved.
                    




 Top
        





        (function(i,s,o,g,r,a,m){i['GoogleAnalyticsObject']=r;i[r]=i[r]||function(){
            (i[r].q=i[r].q||[]).push(arguments)},i[r].l=1*new Date();a=s.createElement(o),
            m=s.getElementsByTagName(o)[0];a.async=1;a.src=g;m.parentNode.insertBefore(a,m)
        })(window,document,'script','//www.google-analytics.com/analytics.js','ga');

        ga('create', 'UA-39704733-12', 'auto');
        ga('send', 'pageview');


        var upgradeTime = -48468922;
        var seconds = upgradeTime;
        function timer() {
            var days = Math.floor(seconds / 24 / 60 / 60);
            var hoursLeft = Math.floor((seconds) - (days * 86400));
            var hours = Math.floor(hoursLeft / 3600);
            var minutesLeft = Math.floor((hoursLeft) - (hours * 3600));
            var minutes = Math.floor(minutesLeft / 60);
            var remainingSeconds = seconds % 60;
            if (remainingSeconds < 10) {
                remainingSeconds = "0" + remainingSeconds;
            }
            if(location.pathname.toLowerCase().indexOf('section') < 0)
                document.getElementById('countdown').innerHTML = 'VOTING STARTS IN ' + hours + ":" + minutes + ":" + remainingSeconds;
            if (seconds <= 0) {
                clearInterval(countdownTimer);
                //document.getElementById('countdown').innerHTML = "Completed";
            } else {
                seconds--;
            }
        }

    

