


  









Privacy Center | Prudential Financial




 var wcm={
	urls: {
       "services": {
"pru-aprcalculator-fed": {
  "wcmContent": "/wps/wcm/connect/IS_Content_Prudential_EN/SA-Forms/SA-Apr-Calc/CT-Apr?presentationtemplate=IS_Foundational_Design/PT-APRCalc-Service&renderMode=json,xml",
  "fallbackContent": "./json/mock-data/wcm-content.json"
  },
		"pru-forms-fed": {
		  "testService": "./json/mock-data/states.json",
			"execComp":"/co/form/osm/compensation",
		  "execComp1": "https://prudomino-dev.prudential.com/njros1ndv2004.prudential.com/prudential/osmdmz.nsf/eDGSponsorSubmitted",
"language-en": "/cdn/forms/json/mock-data/lang_en.json",
"language-es": "/cdn/forms/json/mock-data/lang_es.json"
		},
		                "life-d2c" : {
                                      "statesList" : "/co/ili/statelist?modelCode=SELF&planCode=FIT&timeStamp=${timeStamp}",
                                      "wcmContent" : "/wps/wcm/connect/IS_Content_Prudential_EN/SA-Life2/SA-Service?presentationtemplate=IS_Foundational_Design/PT-Life-Service&renderMode=json,xml",
                                "fallbackContent" : "/cdn/life2/json/mock-data/wcm-content.json",
                                "calculatePremiumRequestJSON": "/cdn/life2/json/mock-data/calculate-premium-request.json",
                                "calculatePremium": "/co/ili/calculatepremium",
                                      "createCaseRequestJSON" : "/cdn/life2/json/mock-data/create-case-request.json",
                                      "createCase" : "/co/ili/createcase",
                                      "quoteHandOverEndpoint" : "https://myterm.prudential.com/#/handover",
                                "eloquaFormService": "/wps/proxy/MarketingAutomation/formSubmission",
                                "life-home-url": "/personal/life-insurance/buy-life-insurance-online/term-insurance-online",
"myTerm" : {
            "wcmContent": "/wps/wcm/connect/IS_Content_Prudential_EN/SA-Life2/myterm?presentationtemplate=IS_Foundational_Design/PT-MyTerm-Service&renderMode=json,xml",                          
            "fallbackContent": "/cdn/simply-term/quoting-tool/json/myterm/wcm-content.json",
                            "calculatePremiumRequestJSON": "/cdn/simply-term/quoting-tool/json/myterm/calculate-premium-request.json",
                            "calculatePremium": "/co/ili/calculatepremium",
                            "createCaseRequestJSON": "/cdn/simply-term/quoting-tool/json/myterm/create-case-request.json",
                            "createCase": "/co/ili/createcase",
                            "quoteHandOverEndpoint": "https://myterm.prudential.com/#/handover"

},
"simplyTerm": {
                            "wcmContent": "/wps/wcm/connect/IS_Content_Prudential_EN/SA-Life2/simplyterm?presentationtemplate=IS_Foundational_Design/PT-SimplyTerm-Service&renderMode=json,xml",							
							"fallbackContent": "/cdn/simply-term/quoting-tool/json/simply-term/wcm-content.json",
							"statesList": "/co/ili/simplyterm/statelist?types=states",
                            "ratingClassRequestJSON": "/cdn/simply-term/quoting-tool/json/simply-term/rating-class-request.json",
                            "ratingClass": "/co/ili/simplyterm/ratingclass",
                            "calculatePremiumRequestJSON": "/cdn/simply-term/quoting-tool/json/simply-term/calculate-premium-request.json",
                            "calculatePremium": "/co/ili/simplyterm/premium"
                        }

                                    },

            "ffp": {
                "search": "/wps/proxy/financialProfessional/search",
                "annuities" : "/wps/proxy/FindFP/Mongo/search",
                "filters": "/wps/contenthandler/war/PruISThemeStatic/common-resources/scripts/ffp-filters.json",
				"contact": "/wps/proxy/leadInfo/create",
       "fpname":"/wps/wcm/connect/AHP-Content/admin?presentationtemplate=AHP-Design/PT_AHP_FindAnFPForm&subtype=json&siteAreaPath=AHP-Advisor/Producer-Profile-1&reqId=",
      "findFP": "/wps/portal/production/common/findfinancialprofessional/",
      "activeHeader": true
            },
"marketing": {
				"automation": "/wps/proxy/MarketingAutomation/formSubmission"
			},
          "idm": {
             "login": "/wps/proxy/IAM/SelfService/loginPreStep"
          },	
            "login": {
                "idtypes": "/wps/proxy/rest/LoginService/getIDTypes",
				"siteminderloginfcc": "https://ssologin.prudential.com/app/prulogin/Login.fcc",
				"siteminderhostenv" : "prod",
				"siteminderauthjsp" : "/wps/PruResource/PruISLogin"
            },
			"privacy": {
			  "optout": "/wps/proxy/privacyInfo/update"
			},
        "search": {
                "engine": "/prusearchservice/sitesearch/getresult?inputSearchString=${query}&startIndex=${start}&endIndex=${end}",
                "autocomplete": "/prusearchservice/auto/getresult?inputSearchString=${query}&startIndex=${start}&endIndex=${end}"
            },
			"validation" : {
			    "zipcode" : "/wps/proxy/addressValidator/zipCode?zipCode="
			},
			"email": {
				"update":  "/wps/proxy/rest/PrivacyInfo/contactChannel"
			},
                "advisorexperience": {
              "fundtabledata": "/wps/wcm/connect/db845d6d-9682-49a5-a8e1-d4a477c1dbe2/FundSelectorJson.json?MOD=AJPERES&CACHE=NONE&CONTENTCACHE=NONE&CONNECTORCACHE=NONE","formPageSimpleIRAData": "/wps/wcm/connect/c989fd35-f5af-4e2c-9e4f-e98cf2cdb856/ai-form-page-simple-ira-data.json?MOD=AJPERES&CACHE=NONE&CONTENTCACHE=NONE&CONNECTORCACHE=NONE","formPageMutualFundsData": "/wps/wcm/connect/c6cdf226-ecd7-408a-857d-7d562af5fcb0/ai-form-page-mutual-funds-form-data.json?MOD=AJPERES&CACHE=NONE&CONTENTCACHE=NONE&CONNECTORCACHE=NONE","formPageTraditionalFormsData": "/wps/wcm/connect/dfda0a9a-8ce3-4c9e-b8c3-6a7709900296/ai-form-page-traditional-ira-form-data.json?MOD=AJPERES&CACHE=NONE&CONTENTCACHE=NONE&CONNECTORCACHE=NONE","pruviewleadcapture": "/wps/proxy/common/simplestore"
      }
        },
      
        "resources": {
            "images": {
				        "default" : "",
						"wcmsp": {
								  "ffp" : "/wps/PruResource/RenderImage?p=FFPSearch" 	
								 },
						"legacy":"https://www.prudential.com"
					  },
            "json": "/json"
        },
        "mappins": {
            "pins": "/wps/PruResource/RenderImage?p=FFPSearch"
        },
        "pages": {
		        "profilepages":"https://www.prudential.com",
                        "IDMEnrollmentLanding": "https://myaccounts.prudential.com/wps/myportal/dashboard/idm-enroll-landing",
 				"RegistrationPruOnline" :"https://client.prudential.com/retail/portal/PruRDAlias/_NoNavigation/pru.rp.registration?Site=Public",
				"RegistrationPruRetirement" :"https://www.retirement.prudential.com/TRSWeb/registration.do?sourceName=RSO",
				"RetirementRegistrationNeedHelp" : "https://ssologin.prudential.com/app/retirement/rso/web/content/RegistrationOverview.pdf",
				"InformationAbtInternetSec" : "https://ssologin.prudential.com/app/retirement/rso/security.html",
				"PrivacyNBusinessInt" : "https://www.prudential.com/privacyandbusinessintegrity/",
				"ForgotUsernamePruOnline" :"",
				"ForgotUsernamePruRetirement" :"https://www.retirement.prudential.com/TRSWeb/forgotUserId.do?sourceName=RSO",
				"ForgotPasswordPruOnline" :"https://client.prudential.com/retail/portal/PruRDAlias/_NoNavigation/pru.ifs.passwordreset?Site=Public",
				"ForgotPasswordRetirement" :"https://www.retirement.prudential.com/TRSWeb/forgotPassword.do?sourceName=RSO",
				"PruOnlineAccountAccess" : "/wps/portal/production/prudential/links/faq/#faq-3919b411-7814-4fb5-b1e4-79dff326b7f2",
				"NeedHelpGetHelpRetirement" : "https://www.retirement.prudential.com/UnProtected/Prudential%20What%20You%20Need%20to%20Access%20Your%20Account%20Online.htm",
				"PruOnlineDashboardPage": "https://client.prudential.com/retail/myportal",
				"PruOnlineEnrollNowPage": "https://client.prudential.com/retail/portal/PruRDAlias/_NoNavigation/pru.rp.registration?Site=Public",
				"PruOnlineTroubleLoginPage" : "http://www.prudential.com/view/page/public/15312?trouble%20logging%20in",
				"RetirementDashboardPage": "https://www.retirement.prudential.com/TRSWeb/TRSLogin",
				"RetirementEnrollNowPage" : "https://www.retirement.prudential.com/TRSWeb/registration.do?sourceName=RSO",
				"RetirementTroubleLoginPage" : "https://www.retirement.prudential.com/UnProtected/Prudential%20What%20You%20Need%20to%20Access%20Your%20Account%20Online.htm",
				"IndSolIRAsTaxableAccBrokerageServiceClients" : "https://www.mystreetscape.com/my/pru",
				"IndSolIRAsTaxableAccPrudentialSmartSolIRAClients" : "https://ssologin.prudential.com/app/retirement/Login.fcc?TYPE=33554433&REALMOID=06-000311eb-1184-1e9e-8453-669230a0f044&GUID=&SMAUTHREASON=0&METHOD=GET&SMAGENTNAME=retirement&TARGET=-SM-https%3a%2f%2fwww%2eretirement%2eprudential%2ecom%2fTRSWeb%2fTRSLogin",
				"PrucoCommandLoginPage" : "http://www.prudential.com/view/page/public/13429" ,
				"PrucoCommandEnrollPage" : "https://client.prudential.com/retail/portal/PruRDAlias/_NoNavigation/pru.rp.registration?Site=Public",
				"PrucoCommandHavingTroubleLoginPage" : "http://www.prudential.com/view/page/13186" ,
				"SimpleIRAPlansPlanParticipantLogin" : "https://client.prudential.com/retail/portal/PruRDAlias/_NoNavigation/pru.rp.registration?Site=Public",
				"QPLinkPlansParticipantLogin" : "https://www.myaccount.ascensus.com/rplink",
				"QPLinkPlansParticipantEnroll" : "https://retire.expertplan.com/servlet/tsc.customersite.flex.NewUsersInitServlet",
				"CreditCardsPersonalAccountLogin" : "http://www.prudential.com/view/page/public/13234",
				"CreditCardsBusinessAccountLogin" : "http://www.prudential.com/view/page/public/13234",
				"AllianceAccountMoreInformation" : "http://www.prudential.com/alliancelogin",	
				"GroupInsuranceEmployeeLoginPage" : "https://mybenefits.prudential.com" ,
				"GroupInsuranceEmployeeEnrollNowPage" : "https://webenroll.prudential.com" ,
				"GroupInsuranceBillingPage" : "https://gibilling.prudential.com" ,
				"PruXpressLoginPage" : "https://ssologin.prudential.com/app/pxbportal/Login.fcc?TYPE=33554433&REALMOID=06-000095fb-9cef-1e94-8794-" ,
				"PruXpressEnrollPage" : "https://www.psb.prudential.com/PSB/PSBServletRegister?page=register_entry_external&action=start" ,
				"AnnuitiesEnrollPage" : "https://annuityfpservice.prudential.com/registration/LoadFPRegistration.do",
				"RegistrationAnnuities" : "https://annuityclientservice.prudential.com/registration/LoadClientRegistration.do",	
				"MutualFundsfromPrudentialInvestmentsEnrollPage" : "https://investment.prudential.com/wps/portal/pipub/!ut/p/b1/zZDbjqJAFEW_ZT6AUIByeQRKoAoKQS4iLwRFC1RAGy1ov34wmWQynfTM65zzdJKds7I2n_MZn3cla2j5aPquvL7vXC4WduRaLhFCNyAa0BFeADV0BGAr_JbP8gOY4IBGqGfhIOnGBqQHiu16RYknJfgjnUq8e13wNaZaYqXWlXSw4Ip9VS7juwxxQzVqPtE576o04PDt6GsssjJ5vLS6UZwc56wkZ3FYc2MyXXTztm3Q2kS781LEXNbTgfntzieBfA3wgYvtLG-Y_ET9vQJtHK5L07st9wyKwXOqXk2gVLPUbpYC34wO_u2c_xmJlgQCpAACFz4SgCv9CvwFsZsDyu8Piw1S3xAxJIorviExn2WHcYI9GSHK6qEIzUdDqy18iMqI9wa0P6P65UV5_PEA4X3VT1zBsrrGa1nYq1vHY45zOsVm2wAFlhR1QesSs6i0IY-QkXgbzJzhk3Weu7RosmXUECCDXSONl7R3VmKqvuLk2F7xDfQPtarvqyCUpCNjh7sfDT--CkQkNGcBIySarc4tSf-9gO_07ZG_tcyTN6owr_4TqYlgfA!!/dl4/d5/L2dBISEvZ0FBIS9nQSEh/",
				"RetirementPlannedSponsor" : "https://ssologin.prudential.com/app/sponsorcenter/Login.fcc?TYPE=33554433&REALMOID=06-000d6e75-680c-14c0-ac9d-80a930a040e7&GUID=&SMAUTHREASON=0&METHOD=GET&SMAGENTNAME=businesscenter&TARGET=-SM-https%3a%2f%2fbusinesscenter%2eprudential%2ecom%2fsponsorcenter" ,
				"RetirementAdvisor" : "https://ssologin.prudential.com/app/advisorcenter/Login.fcc?TYPE=33554433&REALMOID=06-000330ec-67fd-14c0-ac9d-80a930a040e7&GUID=&SMAUTHREASON=0&METHOD=GET&SMAGENTNAME=businesscenter&TARGET=-SM-https%3a%2f%2fbusinesscenter%2eprudential%2ecom%2fadvisorcenter" ,
				"SimpleIRAPlansPlanSponsorLogin" : "https://nge01.bnymellon.com/NextGenV3PlanSponsor/dflt/Login.pru",
				"QPLinkPlansPlanSponsorLogin" : "https://retire.expertplan.com/plan",
				"GroupInsuranceEmployerLoginPage" : "https://giportal.prudential.com/wps/myportal",
				"GroupInsuranceProducers" : "https://ssologin.prudential.com/app/gicommissions/Login.fcc?TYPE=33554433&REALMOID=06-0005a878-6dcc-1eea-a65c-348d307ff074&GUID=&SMAUTHREASON=0&METHOD=GET&SMAGENTNAME=gicommissions&TARGET=-SM-https%3a%2f%2fgicommissions%2eprudential%2ecom%2fcommissions%2fservlet%2fCommissionController",
				"PrudentialAnnuitiesFinancialProfessionals" : "https://ssologin.prudential.com/app/annuityfp/Login.fcc?TYPE=33554433&REALMOID=06-0004fb57-9f3e-1ec5-8c3a-669330a0f024&GUID=&SMAUTHREASON=0&METHOD=GET&SMAGENTNAME=annuityfp&TARGET=-SM-https%3a%2f%2fannuityfp%2eprudential%2ecom%2fwps%2fmyportal%2ffpportal%2fAnnuities",
				"PrudentialInvestmentsFinancialProfessionals" : "https://ssologin.prudential.com/app/fpinvestment/Login.fcc?TYPE=33554433&REALMOID=06-0004b112-14ec-1194-8240-80a930a0f044&GUID=&SMAUTHREASON=0&METHOD=GET&SMAGENTNAME=fpinvestment&TARGET=-SM-https%3a%2f%2ffpinvestment%2eprudential%2ecom%2fwps%2futil%2fauth%2fsmRedirect",
				"AllAccountsPage": "/wps/portal/global/allaccounts",
				"RetirementChangePasswordSSOPage" : "https://ssologin.prudential.com/app/retirement/ChangePassword.fcc?SMAUTHREASON=20&USERNAME=",
				"PruOnlineChangePasswordSSOPage" : "https://ssologin.prudential.com/app/pol/ChangePassword.fcc?SMAUTHREASON=20&USERNAME=",
				"FinancialProffesionalPatnersPage" : "http://www.prudential.com/view/page/public/13024",
				"FindFinancialProfessional" : "/wps/portal/production/common/findfinancialprofessional",
"FindFinancialProfessionalAnnuities": "/wps/portal/production/common/ffpAllAdvisors",
				"GetQuote_Desktop" : "https://edgpruquote.prudential.com/eDG/pruquote/pruquotemainproc.jsp?flow=essential&campaignid=040152&campaignextension=001013&sessionid=&ctrn=&office=&leadsource=pru.com&leadtype=quote&userid=&mainproducttype=&a=&zipcode=",
				"GetQuote_Mobile" : "https://edgpruquote.prudential.com/eDG/pruquote/gaq_mobile_home.jsp?zipcode=",
				"SiteMap" : "/sitemap",
				"ContactUs" : "/contact-us",
"FindFP": "https://www.prudential.com/common/findfinancialprofessional?type=bylocation&term=",
				"FFPContactUs" : "/links/contact",
				"PrivacyOptOutFormCsr" : "/csr/privacypolicy",
				"DigilantCall" : "No",
"IndividualAnnuitiesLoginPage":"https://ssologin.prudential.com/app/pol/Login.fcc?TYPE=33554433&REALMOID=06-000df573-9abf-1e98-89d1-348d307ff074&GUID=&SMAUTHREASON=0&METHOD=GET&SMAGENTNAME=client&TARGET=-SM-https%3a%2f%2fclient%2eprudential%2ecom%2fretail%2fmyportal",
      "IndividualAnnuitiesEnrollPage":"https://www.prudential.com/register#/lookup",
      "IndividualAnnuitiesGetHelpPage":"https://www.prudential.com/wps/portal/production/prudential/links/faq/#faq-3919b411-7814-4fb5-b1e4-79dff326b7f2"
        },
		"feeds": {"news": "http://news.prudential.com/news/rss.xml"}
    }
}	


var eloqua = {
  form: {
    'worksite': {
      header: {
        appID: 'WE',
        appName: 'Worksite Engagement',
        eventType: 'B2C',
        profileAssociation: {
          elqFormName: "1603_CO_Workplace Engagement",
          elqSiteId: "2147464946",
          elqCampaignId: "1602_CO_Workplace Engagement",
          elqCookieWrite: "0",
          version: "1.0"
        }
      },
      data: {
        id: '27', //Eloqua form id
        fields: { //matches fields with Eloqua's field id
          firstName: '226',
          lastName: '227',
          email: '225'
        },
        hidden: { //hidden fields/data post to Eloqua
          campaignId: {
            id: '228',
            value: function (data) {
              return data.header.profileAssociation.elqCampaignId
            }
          },
          customerGUID: {
            id: '230',
            value: function (data) {
              return localStorage.getItem('elqCustomerGUID') || data.header.profileAssociation.elqFormName
            }
          }
        }
      }
    },
    'goals': {
  header: {
    appID: 'Goals',
    appName: 'Goals',
    eventType: 'B2C',
    profileAssociation: {
      elqFormName: "1602_CO_Goals",
      elqSiteId: "1606748220",
      elqCampaignId: "1602_CO_Goals",
      elqCookieWrite: "0",
      version: "1.0"
    }
  },
  data: {
    id: '31', //Eloqua form id
    fields: { //matches fields with Eloqua's field id
      firstName: '251',
      lastName: '252',
      email: '253'
    },
    hidden: { //hidden fields/data post to Eloqua
      campaignId: {
        id: '254',
        value: function (data) {
          return data.header.profileAssociation.elqCampaignId
        }
      },
      customerGUID: {
        id: '255',
        value: function (data) {
          return localStorage.getItem('elqCustomerGUID') || data.header.profileAssociation.elqFormName
        }
      },
      persona: {
        id: '257',
        value: function (data) {
          return (document.cookie.match(/persona=([^&;]+)/) || [])[1] || 'N/A'
        }
      },
      
            elqSource: {
              id: '258',
              value: function() {
                return (sessionStorage && sessionStorage.getItem("elqSource")) || ''
              }
            }
    }
  }
} ,
    'ili-advisor': {
      header: {
        appID: 'ILI',
        appName: 'Unauthenticated Advisor Experience',
        eventType: 'B2B',
        profileAssociation: {
          elqFormName: "1603_ILI_Unauthenticated Advisor Experience Pilot",
          elqSiteId: "888090381",
          elqCampaignId: "1603_ILI_Unauthenticated Advisor Experience Pilot",
          elqCookieWrite: "0",
          version: "1.0"
        }
      },
      data: {
        id: '20', //Eloqua form id
        fields: { //matches fields with Eloqua's field id
          firstName: '192',
          lastName: '193',
          email: '194',
          policiesSoldLastYear: '195'
        },
        hidden: { //hidden fields/data post to Eloqua
          campaignId: {
            id: '196',
            value: function (data) {
              return data.header.profileAssociation.elqCampaignId
            }
          },
          customerGUID: {
            id: '197',
            value: function (data) {
              return localStorage.getItem('elqCustomerGUID') || data.header.profileAssociation.elqFormName
            }
          }
        }
      },
    },
    'annuities-advisor': {
      header: {
        appID: 'Ann',
        appName: 'Annuities Advisor Experience',
        eventType: 'B2C',
        profileAssociation: {
          elqFormName: "1603_ANN_Annuities Pilot",
          elqSiteId: "1606748220 ",
          elqCampaignId: "1603_ANN_Annuities Pilot",
          elqCookieWrite: "0",
          version: "1.0"
        }
      },
      data: {
        id: '29', //Eloqua form id
        fields: { //matches fields with Eloqua's field id
          firstName: '238',
          lastName: '239',
          email: '240',
          company: '244',
          zip: '245'
        },
        hidden: { //hidden fields/data post to Eloqua
          campaignId: {
            id: '241',
            value: function (data) {
              return data.header.profileAssociation.elqCampaignId
            }
          },
          customerGUID: {
            id: '242',
            value: function (data) {
              return localStorage.getItem('elqCustomerGUID') || data.header.profileAssociation.elqFormName
            }
          }
        }
      },

    }
  }
}


			/* Hiding wptheme control header*/
			.wpthemeControlHeader { display: none; }
	

var urlSSOJSFnal='';
var dynHostN =location.hostname;
if(dynHostN.match(/qa/g)){
	urlSSOJSFnal='//ssologin-qa.prudential.com/utils/sso.js';
} else if(dynHostN.match(/dev/g)){
	urlSSOJSFnal='//ssologin-dev.prudential.com/utils/sso.js';
}else if(dynHostN.match(/stage/g)){
	urlSSOJSFnal='//ssologin-stage.prudential.com/utils/sso.js';	 }else
{
	urlSSOJSFnal='https://ssologin.prudential.com/utils/sso.js'; }
JSLibraryElement = document.createElement('script');
JSLibraryElement.type = "text\/javascript"; 
JSLibraryElement.src = urlSSOJSFnal;
document.getElementsByTagName('head')[0].appendChild(JSLibraryElement); 


var parameterFromURL = getParameterByName('persona');
var digilantCall1= wcm.urls.pages.DigilantCall;
var mypersona = getCookie1('persona');
//Check to allow Digilant call or not. Should be No in configlib if digilant is down and hampers pru.com page load
$(document).ready(function() {
if (digilantCall1 == "Yes"){

//Cookies.get('persona');
   if(parameterFromURL === null && mypersona === undefined){	
      
// Added as requested by Digilant team to debug issue
$.ajaxSetup({
  xhrFields: {
    withCredentials: true
  }
});
   
$.ajax({url: 'https://www.wtp101.com/pdata?req=json', success: function(result){
        $(document).trigger('personaSelected', [result]);
        var jsonData1=JSON.stringify(result);
        var jsonObj1 = JSON.parse(jsonData1);
        var persona1 = jsonObj1.profile;
        document.getElementById('ddo.user.profile.profileInfo.persona').textContent = persona1;
        createCookie1('persona',persona1, 1);
        
        
     },error: function (error) {
             digilanterror();
        }
	 });	
	
 	}else {
 	console.log(mypersona);
 	if(parameterFromURL != null){
        createCookie1('persona',parameterFromURL, 1);
        }
    }
 } else{
	 
	 if(parameterFromURL != null){
	    createCookie1('persona',parameterFromURL, 1);
     }else if(parameterFromURL === null && mypersona === undefined){
	 	digilanterror();
	 }
 }
 });
 function digilanterror()
 {
        var persona2="default";
        document.getElementById('ddo.user.profile.profileInfo.persona').textContent = persona2;
        createCookie1('persona',persona2, 1);
}
 
  function getCookie1(c_name)
{
    var i,x,y,ARRcookies=document.cookie.split(";");

    for (i=0;i<ARRcookies.length;i++)
    {
        x=ARRcookies[i].substr(0,ARRcookies[i].indexOf("="));
        y=ARRcookies[i].substr(ARRcookies[i].indexOf("=")+1);
        x=x.replace(/^\s+|\s+$/g,"");
        if (x==c_name)
        {
            return unescape(y);
        }
     }
}

function createCookie1(name, value, days) {
    var date, expires;
    if (days) {
        date = new Date();
        date.setTime(date.getTime()+(days*24*60*60*1000));
        expires = "; expires="+date.toGMTString();
    } else {
        expires = "";
    }
    document.cookie = name+"="+value+expires+"; path=/";
}
//function to fetch url parameters for Digilant
function getParameterByName(name, url) {
    if (!url) url = window.location.href;
    name = name.replace(/[\[\]]/g, "\$&");
    var regex = new RegExp("[?&]" + name + "(=([^&#]*)|&|#|$)"),
        results = regex.exec(url);
    if (!results) return null;
    if (!results[2]) return '';
    return decodeURIComponent(results[2].replace(/\+/g, " "));
}
 


	var brName = "DEFAULT";
	brokerCookie = "brokerCookie="+brName+";path=/";
	document.cookie=brokerCookie;





Prudential Privacy Center

www.prudential.com
us-east-1

US
en


RPvHCQYuYJHQldLUFO1wvtE
| 





Skip to main content






close





Home


 Personal



 Overview



LINK by Prudential 
                          



 Overview


 90-Day Fee Waiver


 Free Financial Check-up






Financial Education
                          



 Overview


 Everyday Money


 Aspire and Plan


 Retire


 Invest for Tomorrow 


 Plan for the Unexpected


 Life Events


 Tools


 My Goals






Life Insurance
                          



 Overview


 Why Life Insurance


 Life Insurance 101


 Find a Life Insurance Policy


 Buy Life Insurance Online


 Beneficiary Resources






Annuities
                          



 Overview


 Envisioning Your Retirement


 The Need for Retirement Income


 Annuities Education


 Our Annuities


 Guaranteed Income For Tomorrow






Investments
                          



 Overview


 Personalize Your Approach


 Get Guidance





 Advice



Workplace Benefits
                          



 Overview


 Protect the Ones You Love


 Prepare for Retirement


 Beneficiary Resources


 Prudential SmartSolution IRA






 Life Insurance, Retirement, Investments



 Life Insurance, Retirement, Investments 



 Life Insurance, Retirement, Investments





 Advisors



 Overview



Workplace Benefits
                          



 Overview


 Group Insurance






Life Insurance
                          



 Overview


 Clients Solutions


 Practice Management


 The Strength of Prudential


 Product Solutions 






Annuities
                          



 Overview


 Build Your Business


 Prudential Annuities Advantages


 Value of Annuities


 Annuity Products for Advisors





 Investments


 Structured Settlements


 Partner With Us



Insights
                          



 Overview


 Retirement Readiness


 Prepare for Life


 Living Longer


 Investing for Outcomes








 Employers



 Overview



Financial Wellness
                          



 Overview


 The Wellness Effect






Retirement
                          



 Overview


 Plan Sponsors






Group Insurance
                          



 Overview


 Benefits Insights


 Association/Affinity


 Services


 Products


 Employee Behavior





 Pension Risk Transfer



Insights
                          



 Overview


 Retirement Readiness


 Prepared for Life


 Living Longer


 Investing for Outcomes








 Institutions



 Overview


 PGIM at a Glance



Insights
                          



 Overview


 Retirement Readiness


 Living Longer


 Investing For Outcomes











 About


 News


 Investor Relations


 Corporate Responsibility


 Careers


 FAQs


 Forms


 Contact


















 About


 News


 Investor Relations


 Corporate Responsibility


 Careers


 FAQs


 Forms


 Contact












Menu



Close





Prudential Financial







 Personal




 LINK by Prudential 


 Financial Education


 Life Insurance


 Annuities


 Investments


 Advice


 Workplace Benefits



 Life Insurance, Retirement, Investments



 Life Insurance, Retirement, Investments 



 Life Insurance, Retirement, Investments






 Advisors




 Workplace Benefits


 Life Insurance


 Annuities


 Investments


 Structured Settlements


 Partner With Us


 Insights






 Employers




 Financial Wellness


 Retirement


 Group Insurance


 Pension Risk Transfer


 Insights






 Institutions




 PGIM at a Glance


 Insights










Search



Log In



Close






At least  characters must be typed in the search field in order to perform the search

Search Field

Search Field. Suggestions may appear below after you type 3 letters. Use up and down arrow keys to navigate.



Search

Go





 Log In
        










{}





Z7_K8HEHHG0L06610ATAS36BP1AI7


Z7_K8HEHHG0L06610ATAS36BP1AI7
Web Content Viewer
ltr
en







Web Content Viewer



Actions



 

























      Privacy Center
   Prudential respects your privacy and we are committed to protecting it.  We strongly believe in the responsible use of information we collect about individuals. Our policies and procedures are designed to protect the confidentiality and security of personal information. The material herein sets out our privacy policies and describes how we treat the information we receive about you.















Z7_K8HEHHG0L06610ATAS36BP1CO3


Z7_K8HEHHG0L06610ATAS36BP1CO3
Web Content Viewer
ltr
en







Web Content Viewer



Actions



 








a.card.card-default.color-scheme-white .card-title, a.card.card-default.color-scheme-gray .card-title {
 color : #06c!important;
}
a.card.card-default.color-scheme-blue .card-title {
 color : #e3f2f4!important;
}
a.card.card-default.color-scheme-navy .card-title {
 color : #dadada!important;
}























































Z7_K8HEHHG0LOSFE0ANSH7LIE2OC0


Z7_K8HEHHG0LOSFE0ANSH7LIE2OC0
Web Content Viewer
ltr
en







Web Content Viewer



Actions



 




















Z7_K8HEHHG0LOSFE0ANSH7LIE2OM2


Z7_K8HEHHG0LOSFE0ANSH7LIE2OM2
Web Content Viewer
ltr
en







Web Content Viewer



Actions



 



























Z7_K8HEHHG0L06610ATAS36BP1C44


Z7_K8HEHHG0L06610ATAS36BP1C44
Web Content Viewer
ltr
en







Web Content Viewer



Actions



 








a.card.card-default.color-scheme-white .card-title, a.card.card-default.color-scheme-gray .card-title {
 color : #06c!important;
}
a.card.card-default.color-scheme-blue .card-title {
 color : #e3f2f4!important;
}
a.card.card-default.color-scheme-navy .card-title {
 color : #dadada!important;
}



















					
					
						Your Privacy as Our Customer
					
				






HIPAA Notice of Privacy Practices

U.S. Consumer Privacy Notice

 
How We Protect Your Privacy Online


Online Privacy Statement


 










	
	
		Your Privacy Preferences
	
	







 
			
			
				Your Privacy Preferences
			 
		







Limit sharing of your personal information among Prudential companies for marketing purposes and the sharing of consumer report information among Prudential companies.
To opt out of marketing emails from a Prudential product or service, you can click “unsubscribe” on the bottom of e-mails and follow the instructions.  Privacy elections you make for any one product or service may not automatically be applied to other products and services. 
To opt out of marketing calls from all Prudential companies, register for the National Do Not Call List
To opt out of marketing direct mailings from all Prudential companies, register for the Direct Marketing Association’s Mail Preference Service






























Z7_K8HEHHG0L06610ATAS36BP1CK7


Z7_K8HEHHG0L06610ATAS36BP1CK7
Web Content Viewer
ltr
en







Web Content Viewer



Actions



 








a.card.card-default.color-scheme-white .card-title, a.card.card-default.color-scheme-gray .card-title {
 color : #06c!important;
}
a.card.card-default.color-scheme-blue .card-title {
 color : #e3f2f4!important;
}
a.card.card-default.color-scheme-navy .card-title {
 color : #dadada!important;
}




















*[data-qa="c-sh-305-h2-4-col-text"].color-scheme-white { background-color: #f2f2f2 }


Other resources



Other Resources

On Guard OnlineOpens in New Window 
FTC.govOpens in New Window 
Keeping Your Personal Information SecureOpens in New Window 
Online SecurityOpens in New Window 
Protecting Kids OnlineOpens in New Window 














































Z7_K8HEHHG0L06610ATAS36BP1CC2


Z7_K8HEHHG0L06610ATAS36BP1CC2
Web Content Viewer
ltr
en







Web Content Viewer



Actions



 




















































































Z7_K8HEHHG0L06610ATAS36BP1CS5


Z7_K8HEHHG0L06610ATAS36BP1CS5
Web Content Viewer
ltr
en







Web Content Viewer



Actions



 













 












Z7_K8HEHHG0L06610ATAS36BP1CS7


Z7_K8HEHHG0L06610ATAS36BP1CS7
Web Content Viewer
ltr
en







Web Content Viewer



Actions



 





LINK by Prudential is an umbrella marketing name for Prudential Customer Solutions LLC (“PCS”), Prudential Annuities Distributors, Inc. and various subsidiaries of The Prudential Insurance Company of America. Investment advisory products and services of LINK by Prudential are made available through PCS, an SEC registered investment adviser. PCS is not a licensed insurance agency or broker. Prudential LINK and LINK by Prudential occasionally may be referred to as LINK. 
Securities products and services are offered through: Pruco Securities, LLC and Prudential Investment Management Services, LLC, both members SIPC and located in Newark, NJ, or Prudential Annuities Distributors, Inc., located in Shelton, CT. All are Prudential Financial companies. Statement of Financial Condition for Prudential Investment Management Services, LLC.
Insurance and/or annuities are issued by The Prudential Insurance Company of America, Pruco Life Insurance Company (except in NY and/or NJ), Pruco Life Insurance Company of New Jersey (in NY and/or NJ), and Prudential Annuities Life Assurance Corporation (PALAC). Each is a Prudential Financial company located in Newark, NJ (main office), except for PALAC which is located in Shelton, CT (main office), and each is solely responsible for its own financial condition and contractual obligations.
Variable annuities are distributed by Prudential Annuities Distributors, Inc., Shelton, CT.
Retirement products and services are provided by Prudential Retirement Insurance and Annuity Company, Hartford, CT, or its affiliates .
This web page is being provided for informational or educational purposes only and does not take into account the investment objectives or financial situation of any client or prospective clients. The information is not intended as investment advice and is not a recommendation about managing or investing your retirement savings. Clients seeking information regarding their particular investment needs should contact a financial professional. Prudential Financial, its affiliates, and their financial professionals do not render tax or legal advice. Please consult with your tax and legal advisors regarding your personal circumstances.
This website is for U.S. persons only and may not be approved in all states. Information contained on this site does not and is not intended to constitute an advertisement, solicitation or offer for sale in any jurisdiction, outside the United States of America, where such use would be prohibited or otherwise regulated.
"Prudential Advisors" is a brand name of The Prudential Insurance Company of America and its subsidiaries.
Prudential, the Prudential logo, the Rock Symbol and Bring Your Challenges are service marks of Prudential Financial, Inc. and its related entities, registered in many jurisdictions worldwide.
Prudential Financial, Inc. of the United States is not affiliated with Prudential plc, which is headquartered in the United Kingdom.
Pruco Life Insurance Company, an Arizona company - California COA # 3637. The Prudential Insurance Company of America - California COA # 1179. Prudential Retirement Insurance and Annuity Company - California COA # 08003. The Prudential Life Insurance Company of America Newark, NJ.
Securities and Insurance Products:
Not Insured by FDIC or any Federal Government Agency   |   May Lose Value   |   Not a Deposit of or Guaranteed by the Bank or any Bank Affiliate.
  

     if(!$('#header').hasClass('nav-open-level-three') && $('.tertiary-nav-container').length){
          (function($){
               var $anchor, pathname = window.location.pathname;
              
               $('.nav-mobile a').each(function(){
                    if(pathname.indexOf($(this).attr('href')) >= 0){
                         $anchor = $(this)
                    }
               })
              
               if(typeof $anchor !== 'undefined' && $anchor !== null){
                    $anchor.addClass('active')
                       .parents('.collapse').collapse('show');                        
               }
          })(window.jQuery);    
     }

     (function($){
          $(function(){
               $tertiaryNavContainer = $('.tertiary-nav-container');
               if($tertiaryNavContainer.length && !$tertiaryNavContainer.outerHeight()){
                    $(window).off('.affix');
                    $tertiaryNavContainer.removeData('bs.affix').removeClass('affix affix-top affix-bottom');
                    $tertiaryNavContainer.affix({offset: {top: 222}});         
               }
          });
     })(window.jQuery);

$(document).ready(function() {
$("a[href='/contact']").attr('href', '/contact-us')
});

window.isToolsAnalytics = window.isToolsAnalytics || function(){}

[data-qa="c-sh-601a-smart-cta" ] .pru-module-12 .pru-module-rich-text-editor{width:100%!important;}


.nav-mobile .controls { margin-top: 0px;}


if(window.location.href == "https://www.prudential.com/advisors/investments/day-one-target-date-funds/glidepath"){
    $('html').css('overflow-x','auto');
    $('html').css('overflow','auto');
    $('body').css('overflow-x','auto');
    $('body').css('overflow','auto');
}
if(window.location.href == "https://www.prudential.com/advisors/investments/day-one-target-date-funds/incomeflex-funds"){
    $('html').css('overflow-x','auto');
    $('html').css('overflow','auto');
    $('body').css('overflow-x','auto');
    $('body').css('overflow','auto');
}


#global-links-bar ul li:nth-child(-n+5) {
    float: left;
}


  try {
    window.wcm.urls.services.search.autocomplete =
      "/prusearchservice/auto/getresult?inputSearchString=${query}&startIndex=${start}&endIndex=${end}";
  } catch (e) {}

Template: 1000797-00001-00






Z7_K8HEHHG0LG83E0ATBFTMTHJRQ0


Z7_K8HEHHG0LG83E0ATBFTMTHJRQ0
Web Content Viewer
ltr
en







Web Content Viewer



Actions



 





Securities products and services are offered through: Pruco Securities, LLC and Prudential Investment Management Services, LLC, both members SIPC and located in Newark, NJ, or Prudential Annuities Distributors, Inc., located in Shelton, CT. All are Prudential Financial companies. Statement of Financial Condition for Prudential Investment Management Services, LLC. Annuities are issued by The Prudential Insurance Company of America and Pruco Life Insurance Company (in New York, by Pruco Life Insurance Company of New Jersey), all located in Newark, NJ (main office). Variable annuities are distributed by Prudential Annuities Distributors, Inc., Shelton, CT. Retirement products and services are provided by Prudential Retirement Insurance and Annuity Company, Hartford, CT, or its affiliates. "Prudential Advisors" is a brand name of The Prudential Insurance Company of America and its subsidiaries. Prudential, the Prudential logo, the Rock Symbol and Bring Your Challenges are service marks of Prudential Financial, Inc. and its related entities, registered in many jurisdictions worldwide. Site for U.S. persons only. Information contained on this site does not and is not intended to constitute an advertisement, solicitation or offer for sale in any jurisdiction, outside the United States of America, where such use would be prohibited or otherwise regulated. Prudential Financial, its affiliates, and their financial professionals do not render tax or legal advice. Please consult with your tax and legal advisors regarding your personal circumstances. Prudential Financial, Inc. of the United States is not affiliated with Prudential plc, which is headquartered in the United Kingdom. Pruco Life Insurance Company, an Arizona company - California COA # 3637. The Prudential Insurance Company of America - California COA # 1179. Prudential Retirement Insurance and Annuity Company - California COA # 08003. The Prudential Life Insurance Company of America Newark, NJ. Securities and Insurance Products: Not Insured by FDIC or any Federal Government Agency | May Lose Value | Not a Deposit of or Guaranteed by the Bank or any Bank Affiliate.
Template: 201502-768













Follow us on:

Follow us on:
Facebook page opens in a new window

Linkedin page opens in a new window

Instagram page opens in a new window
Youtube page opens in a new window
Twitter page opens in a new window
Pinterest page opens in a new window



Follow us on:



Follow us on: 


Facebook page opens in a new window

Linkedin page opens in a new window

Instagram page opens in a new window
Youtube page opens in a new window


Twitter page opens in a new window
Pinterest page opens in a new window













 Personal




 LINK by Prudential 


 Financial Education


 Life Insurance


 Annuities


 Investments


 Advice


 Workplace Benefits
















 Advisors


 Workplace Benefits


 Life Insurance


 Annuities


 Investments


 Structured Settlements


 Partner With Us


 Insights




 Employers


 Financial Wellness


 Retirement


 Group Insurance


 Pension Risk Transfer




 Insights




 Institutions


 PGIM at a Glance






 Insights








 About


 News


 Investor Relations


 Corporate Responsibility


 Careers


 FAQs


 Forms


 Contact












Help
Report Fraud
Terms & Conditions
Privacy Center
Online Privacy Statement
Accessibility
NY - Domestic Violence Notice

Alert for Illinois Customers
Business Integrity
Sitemap
Check the background of this firm on FINRA's BrokerCheck opens in a new window
AdChoices opens in a new window


  if(window.location.href == "https://www.prudential.com/advisors/investments/day-one-target-date-funds/glidepath"){
    $('html').css('overflow-x','auto');
    $('html').css('overflow','auto');
    $('body').css('overflow-x','auto');
    $('body').css('overflow','auto');
}
if(window.location.href == "https://www.prudential.com/advisors/investments/day-one-target-date-funds/incomeflex-funds"){
    $('html').css('overflow-x','auto');
    $('html').css('overflow','auto');
    $('body').css('overflow-x','auto');
    $('body').css('overflow','auto');
}

$('#dayOneFundsConfirmation').on('hidden.bs.modal', function (e) {
  if(window.location.href == "https://www.prudential.com/advisors/investments/day-one-target-date-funds/glidepath"){
    $('html').css('overflow-x','auto');
    $('html').css('overflow','auto');
    $('body').css('overflow-x','auto');
    $('body').css('overflow','auto');
}
if(window.location.href == "https://www.prudential.com/advisors/investments/day-one-target-date-funds/incomeflex-funds"){
    $('html').css('overflow-x','auto');
    $('html').css('overflow','auto');
    $('body').css('overflow-x','auto');
    $('body').css('overflow','auto');
}
})

$('#dayOneFundsConfirmation').on('shown.bs.modal', function (e) {
  if(window.location.href == "https://www.prudential.com/advisors/investments/day-one-target-date-funds/glidepath"){
    $('html').css('overflow-x','hidden');
    $('html').css('overflow','hidden');
    $('body').css('overflow-x','hidden');
    $('body').css('overflow','hidden');
}
if(window.location.href == "https://www.prudential.com/advisors/investments/day-one-target-date-funds/incomeflex-funds"){
    $('html').css('overflow-x','hidden');
    $('html').css('overflow','hidden');
    $('body').css('overflow-x','hidden');
    $('body').css('overflow','hidden');
}
})




$( document ).ready(function() {
    $('a.vtranscript').removeClass('inactive');
});













©
						2019  Prudential Financial, Inc. and its related entities.
					






Back to top







$( document ).ready(function() {
$("#footer_disclaimer_container").html($("#footer_disclaimer_content").html());
$("#footer_disclaimer_content").html("");
});


$( document ).ready(function() {
$("#wpToolbarToggle").hide();
if($('span').hasClass('wpToolbarPublishedSiteLabel')) {
    $("#wpPageModeToggle").addClass("disabled");
    $("#wpToolbarToggle").hide();

}
else{
    $("#wpPageModeToggle").removeClass("disabled");
	$("#wpToolbarToggle").show();
}
});


 









