






Privacy and Terms | Federal Reserve Bank of Minneapolis










    var expDate = new Date();
    expDate.setDate(expDate.getDate() + 365);
    var expires = "expires=" + expDate.toGMTString() + ";"
    var resolution = "resolution=" + Math.max(screen.width, screen.height) + ("devicePixelRatio" in window ? "," + devicePixelRatio : ",1") + ";path=/;";
    var secureit = "secure;";
    var allValues = resolution + expires;

    if (isSecure())
        allValues += secureit;

    document.cookie = allValues;

    function isSecure() {
        return window.location.protocol == 'https:';
    }
















Home
Careers
Contact















About the Fed
Banking Supervision
Economic Research
Regional Economy
Community & Education
News & Events
Publications

Menu



HomePrivacy






Privacy

Online Privacy Notice
 This notice covers the personal information that we  automatically collect on individuals that visit minneapolisfed.org, such as  cookies, and also information that visitors affirmatively provide to the Bank,  for example, when signing up for a newsletter.  
General Reserve Bank Data  Privacy Notice
 This notice describes the core functions that the Reserve Banks  perform in which we obtain personal information from sources other than the  individuals to whom the personal information relates.   
Inquiries 
 If you have any questions about our privacy policies or  practices, please use this form to contact us.  






Latest Content from the Minneapolis Fed


Live Debate - Ten Years After the Global Financial Crisis, the System Is Safer 
President's Speeches                

Neel Kashkari at Rochester Area Chamber of Commerce 
President's Speeches                

Regional manufacturers expect continued growth in 2019 
fedgazette                

Powell and Melander named chair and deputy chair of Minneapolis Fed board 
News Releases                

Optimal Paternalistic Savings Policies 
Institute Working Paper                





Connect

MinneapolisFed on Twitter
Minneapolis Fed on Facebook
RSS Feeds






 




 



Minneapolis Fed

About the Fed
Banking Supervision
Economic Research
Regional Economy
Community
News & Events
Publications


Privacy
Disclaimer
Accessibility
Glossary
Careers
Contact Us



Other Federal Reserve System Sites

Board of Governors
Atlanta
Boston
Chicago
Cleveland
Dallas


Kansas City
New York
Philadelphia
Richmond
San Francisco
St. Louis







var _ctct_m = "893dd8ef8163c5909e767b76354dca4e";



//--------- Publications subscribe desktop and mobile -----------
(function ($) {
    var uniqueCntr = 0;
    $.fn.scrolled = function (waitTime, fn) {
        if (typeof waitTime === "function") {
            fn = waitTime;
            waitTime = 500;
        }
        var tag = "scrollTimer" + uniqueCntr++;
        this.scroll(function () {
            var self = $(this);
            var timer = self.data(tag);
            if (timer) {
                clearTimeout(timer);
            }
            timer = setTimeout(function () {
                self.removeData(tag);
                fn.call(self[0]);
            }, waitTime);
            self.data(tag, timer);
        });
    }
})(jQuery);

$(document).ready(function () {
    $(window).scrolled(function () {
        if ($(this).scrollTop() > 1200) {
            $('#fixed-pub-subscription').fadeIn();
            $('#fixedTop').fadeIn();
        } else {
            $('#fixed-pub-subscription').fadeOut("slow");
            $('#fixedTop').fadeOut("slow");
        }

        if ($(this).scrollTop() > 700) {
            $('#publications-tray').slideDown("slow");
        } else {
            $('#publications-tray').slideUp("slow");
        }

    });
    $('#fixedTop').click(function () {
        $("html, body").animate({
            scrollTop: 0
        }, 600);
        return false;
    });


    $(function () {
        $('.tray-subscribe').click(function () {
            $('.tray-subscribe').toggleClass("down");
            $('.hideme').slideToggle(400);
        });
    });

    // Inject link to privacy policy after CC form
    $('.ctct-inline-form').after('<p class="ctct-privacy-policy-mpls"><a href="/site-information/privacy-and-terms">Privacy Policy</a></p>');
});












    //<![CDATA[
    var _tag = new WebTrends();
    _tag.dcsGetId();
    //]]>


    //<![CDATA[
    _tag.dcsCustom = function () {
        // Add custom parameters here.
        //_tag.DCSext.param_name=param_value;
    }
    _tag.dcsCollect();
    //]]>






  (function(i,s,o,g,r,a,m){i['GoogleAnalyticsObject']=r;i[r]=i[r]||function(){
  (i[r].q=i[r].q||[]).push(arguments)},i[r].l=1*new Date();a=s.createElement(o),
  m=s.getElementsByTagName(o)[0];a.async=1;a.src=g;m.parentNode.insertBefore(a,m)
  })(window,document,'script','https://www.google-analytics.com/analytics.js','ga');
    ga('create', 'UA-96803787-1', 'minneapolisfed.org');
    ga('send', 'pageview');


