



	Privacy Policy | The Jerusalem Post 
  
        var pageTypeId = '25';       

(function(w,d,s,l,i){w[l]=w[l]||[];w[l].push({'gtm.start':
new Date().getTime(),event:'gtm.js'});var f=d.getElementsByTagName(s)[0],
j=d.createElement(s),dl=l!='dataLayer'?'&l='+l:'';j.async=true;j.src=
'https://www.googletagmanager.com/gtm.js?id='+i+dl;f.parentNode.insertBefore(j,f);
})(window,document,'script','dataLayer','GTM-T4BJGTM');








(function () {
    var node = document.getElementsByTagName('script')[0],
rvbP = document.createElement('script');
    window.CMT = { appId: '9de4bd6f-10af-4e2c-b51d-42a4360a6eec' };
    rvbP.defer = true;
    rvbP.type = 'text/javascript';
    rvbP.src = (document.location.protocol == 'https:' ? 'https:' : 'http:') +
'//revboostprocdnadsprod.azureedge.net/scripts/latest/min.js';
    node.parentNode.insertBefore(rvbP, node);
})();



var _zaVerSnippet="5c",_zaq=_zaq||[]; 
(function() {
  var w=window,d=document;w.__za_api=function(a){_zaq.push(a);if(typeof __ZA!='undefined'&&typeof __ZA.sendActions!='undefined')__ZA.sendActions(a);};
  var e=d.createElement('script');e.type='text/javascript';e.async=true;e.src=('https:'==d.location.protocol?'https://d29k50lkkhkjby.cloudfront.net/':'http://d29k50lkkhkjby.cloudfront.net/')+'19760976-1b49/5/widget-c.js';
  var ssc=d.getElementsByTagName('script')[0];ssc.parentNode.insertBefore(e,ssc);
})();



    (function (a, d, o, r, i, c, u, p, w, m) {
    m = d.getElementsByTagName(o)[0], a[c] = a[c]
    || {}, a[c].trigger = a[c].trigger || function () {
    (a[c].trigger.arg = a[c].trigger.arg || []).push(arguments)},
    a[c].on = a[c].on || function () {(a[c].on.arg = a[c].on.arg || []).push(arguments)},
    a[c].off = a[c].off || function () {(a[c].off.arg = a[c].off.arg || []).push(arguments)
    }, w = d.createElement(o), w.id = i, w.src = r, w.async = 1, w.setAttribute(p, u),
    m.parentNode.insertBefore(w, m), w = null}
    )(window, document, "script", "https://95662602.adoric-om.com/adoric.js", "Adoric_Script", "adoric","9cc40a7455aa779b8031bd738f77ccf1", "data-key");



  var googletag = googletag || {};
  googletag.cmd = googletag.cmd || [];


  googletag.cmd.push(function() {
    googletag.defineSlot('/6943/1x1_Sovrn', [1, 1], 'div-gpt-ad-1528019985954-0').addService(googletag.pubads());
    googletag.enableServices();
  });











googletag.cmd.push(function() { googletag.display('div-gpt-ad-1507440017193-0'); });


















googletag.cmd.push(function() { googletag.display('div-gpt-ad-1528019985954-0'); });















                October 02 2018
            
|

                Tishrai, 23, 5779
            









Breaking News




Arab Israeli Conflict





                    Arab Israeli Conflict 
                



                    Gaza News 
                




Middle East





                    Middle East 
                



                    ISIS News 
                



                    Iran News 
                




Israel News





                    Israel News 
                



                    Israeli Politics 
                



                    Israeli Sports 
                



                    Culture News 
                



                    India Israel 
                




Opinion




Hi Tech News





                    Hi Tech News 
                



                    Business & Innovation 
                



                    Environmental news 
                




TRENDING STORIES





                    TRENDING STORIES 
                



                    Podcast 
                




Diaspora





                    Diaspora 
                



                    Antisemitism 
                




OMG




HEALTH & SCIENCE




ISRAELI FOOD




American Politics




Premium





                    Premium 
                



                    Magazine 
                



                    IVRIT 
                



                    Metro 
                



                    The Jerusalem Report 
                



                    In Jerusalem 
                



                    The daily edition 
                




jerusalem




BDS Movement




Crypto Currency




Annual Conference




Diplomatic Conference




Blogs





                    Blogs 
                



                    StudentLife 
                




International news





                    International news 
                



                    ISLAMIC TERRORISM 
                




Green Israel




Israel's 70th anniversary




CROSSWORDS PUZZLES


















Breaking News




Arab Israeli Conflict





                    Arab Israeli Conflict 
                



                    Gaza News 
                




Middle East





                    Middle East 
                



                    ISIS News 
                



                    Iran News 
                




Israel News





                    Israel News 
                



                    Israeli Politics 
                



                    Israeli Sports 
                



                    Culture News 
                



                    India Israel 
                




Opinion




Hi Tech News





                    Hi Tech News 
                



                    Business & Innovation 
                



                    Environmental news 
                




TRENDING STORIES





                    TRENDING STORIES 
                



                    Podcast 
                




Diaspora





                    Diaspora 
                



                    Antisemitism 
                




OMG




HEALTH & SCIENCE




ISRAELI FOOD




American Politics




Premium





                    Premium 
                



                    Magazine 
                



                    IVRIT 
                



                    Metro 
                



                    The Jerusalem Report 
                



                    In Jerusalem 
                



                    The daily edition 
                




jerusalem




BDS Movement




Crypto Currency




Annual Conference




Diplomatic Conference




Blogs





                    Blogs 
                



                    StudentLife 
                




International news





                    International news 
                



                    ISLAMIC TERRORISM 
                




Green Israel




Israel's 70th anniversary




CROSSWORDS PUZZLES







   
            Arab Israeli Conflict
         
   
            Israel News
         
   
            Opinion
         
   
            Middle East
         
   
            Diaspora
         
   
            Green Israel
         
   
            International news
         

LOGIN






sign out




   
            50 MOST INFLUENTIAL JEWS
         
   
            Gaza News
         
   
            BDS
         
   
            Antisemitism
         



   
            Health & Science
         
   
            CRYPTO CURRENCY
         
   
            business news
         
   
            Blogs
         
   
            Premium
         




  




  




  




  













    #PayWall {
        display: block;
        margin-top: 8px;
    }

    .paywall-before-login a:hover {
        color: white;
    }








.txts
{
 font-family: arial;
    font-size: 13px;
line-height: 20px;
}
li {
    list-style-type: disc;
}
h4
{
font-family: arial;
    font-size: 30px;
}
ol, ul {
    list-style: none outside none;
}
li
{
list-style-type: disc;
}
.main
{
 border-right: 1px solid #d8d8d8;
    display: inline-block;
    padding-right: 20px;
    /*width: 814px;*/
 line-height: 24px;
}
.seco
{
display: inline-block;
   /*width: 814px;*/
padding-top: 20px;
}
.roni
{
  background: url("../../../images/article-bg-top.jpg") no-repeat scroll 0 0 rgba(0, 0, 0, 0);
    /*width: 814px;*/

}
.elr
{
 background: none repeat scroll 0 0 #fff;
    border-right: 1px solid #eee;
    border-top: 1px solid #eee;
    box-shadow: 3px 3px 5px 0 rgba(50, 50, 50, 0.1);
    margin-left: 16px;
    padding: 8px 0 8px 15px;
    position: relative;
    z-index: 20;
}
.title
{
 color: #bb131a;
    font-family: 'swiss_721bold_condensed';
    font-size: 20px;
padding: 0;
}
.txtrow
{
background: url("../../../images/article-bg-middle.jpg") repeat-y scroll 0 0 rgba(0, 0, 0, 0);
}
.spxc
{
  background: none repeat scroll 0 0 #fff;
    border-right: 1px solid #eee;
    margin-left: 18px;
    position: relative;
    z-index: 10;
}
.article-row
{
  border-bottom: 1px solid #d8d8d8;
    margin: 0 0 16px 29px;
    padding: 16px 0 10px;
    position: relative;
    /*width: 735px;*/
}




Privacy Policy





1.  Privacy: In order to protect Your Privacy, The Jerusalem Post has set up this extensive Privacy Policy. When You use Services,                         certain information is retained at The Jerusalem Post's servers, as well as at 3rd                         Parties. Such information may be stored in databases, conveyed to 3rd parties or                         used to provide You with better Service, all according to the following policy: 
    You are not obligated under law to provide your information, but without providing your information, The Jerusalem Post may not be able to provide you with the services. The information you provide shall be used to provide you with the Jerusalem Post's services, as you requested through the Terms of Service, and to send you periodic updates according to this Privacy Policy.

1.1What Information is stored? The Jerusalem Post                                 retains certain information you provide it when you browse its Services, as well                                 as information tracked using automated means.

1.1.1Information You Provide Directly: The Jerusalem                                         Post retains the following information when you register to its services, and may                                         request, from time to time, additional information:

1.1.1.1Commenting: The Jerusalem Post retains the                                                 following information when You post any Contribution or comment through Service:                                                 Your Name , Email address and Country.



1.1.1.2Premium Service: The  Jerusalem Post retains                                                 the following  information when You sign up to The Jerusalem Post Premium Service:                                                 Your Full Name, Your  Email address, Your Password for the Service, Your Title, Your                                                 Date of Birth, Your  Residence, Your Phone Number, Your Social Security Number or                                                 ID Number, Your Credit  Card and Payment Information.



1.1.1.3Newsletter:  The Jerusalem Post retains the                                                 following information  when You sign up to The Jerusalem Post's newsletter: Your                                                 Name, Email address,  Gender, Date of Birth, Country, State, Family Status, Income,                                                 Education, Religious  Affiliation and Fields of Interest



1.1.2Information You Provide Indirectly:                                         The Jerusalem Post may retain and store information you provide when browsing Services                                         such as Your IP address, Your browser and operating system, Your session number,                                         Your geolocation and other browsing information.



1.2Who Has Access to the Information? Selected 3rd                                 Parties who provide The Jerusalem Post with services have a unique access to specific                                 information required in order to provide such services, and The Jerusalem Post may                                 convey information to such parties in order to provide You with Service. For example,                                 The Jerusalem Post may use 3rd parties to send its Newsletter, display videos or                                 other content and/or provide You with advertisements.



1.3How is the information collected? Information is                                 collected in two distinct ways, when You browse the site, a cookie is placed in                                 Your browser; a cookie is a small text file which may allow The Jerusalem Post to                                 identify You personally and provide You with Services; You also provide, when using                                 Services, some information about Yourself to The Jerusalem Post. Finally, the Jerusalem                                 Post, either by itself or through 3rd parties, may collect Your browsing habits                                 and browsing data.



1.4How is the information processed? The information                                 You provide with The Jerusalem Post shall be processed by it and by selected 3rd                                 parties in order to provide You with the Services You requested (such as The Jerusalem                                 Post's Newsletter), moreover, The Jerusalem Post may process Your information in                                 order to include you in specific user groups or tiers and to provide you with personal                                 solicitations.



1.5 We use third-party advertising companies to serve ads when you visit our Website. These companies may use information (not including your name, address email address or telephone number) about your visits to this and other Web sites in order to provide advertisements about goods and services of interest to you. If you would like more information about this practice and to know your choices about not having this information used by these companies, click here.

    We allow third-party companies to serve ads and/or collect certain anonymous information when you visit our web site. These companies may use non-personally identifiable information (e.g., click stream information, browser type, time and date, subject of advertisements clicked or scrolled over) during your visits to this and other Web sites in order to provide advertisements about goods and services likely to be of greater interest to you. These companies typically use a cookie or third party web beacon to collect this information. To learn more about this behavioral advertising practice or to opt-out of this type of advertising, you can visit www.networkadvertising.org
     



1.6What uses are made with the information? The Jerusalem                                 Post uses the information You provided in order to provide You with Services. Moreover,                                 in specific Services, Your Information is used in the following way:
     
1.6.1Premium: When You register to The Jerusalem Post's                                         Premium Service, The Jerusalem Post shall process Your credit card and retain it                                         for that period and send you communications from time to time.

1.6.2Newsletter: When You register to The Jerusalem                                         Post's Newsletter, The Jerusalem Post shall send you, from time to time, personal                                         or tiered solicitations and use Your information for direct marketing.

1.7Can You Review, Amend or Remove Information? Yes,                                 You may contact the Jerusalem Post at any time in regards to Your Personal Information,                                 and after You provided the Jerusalem Post with sufficient evidence that You are                                 the data-subject of the information, receive the option to either remove all Your                                 personal information from The Jerusalem Post's Servers or Amend it. Please note                                 that such removal or amendment may be a costly process, depending on the amount                                 of personal information retained, and that The Jerusalem Post may charge fees for                                 such service.

















   
            Sign Up For Our NewsLetter
         


Follow Us




  




  




  




  




  




  




  











Information



                                About Us
                            



                                Feedback
                            



                                Staff E-mails
                            



                                Copyright
                            



                                Advertise with Us
                            



                                Statistics
                            



                                Ad Specs
                            



                                Terms Of Service
                            



                                Privacy Policy
                            



                                Subscriber Agreement
                            



                                jpost-jobs
                            



                                Cancel Subscription
                            




The Jerusalem Post Group



                                NYC Conference
                            



                                Diplomatic Conference
                            



                                Israel Health Conference
                            



                                Learn Hebrew
                            



                                The Jerusalem Report
                            



                                Our Magazines
                            



                                Green Israel
                            



                                Jerusalem Post Lite
                            



                                Ulpan Online
                            




Tools and services



                                JPost Mobile Apps
                            



                                JPost Premium
                            



                                JPost Newsletter
                            



                                JPost News Ticker
                            



                                JPost RSS feeds
                            



                                JPost.com Archive
                            



                                JPost Alert
                            



                                Find us on Google+
                            



                                Digital Library
                            




Promo Content



                                Promo Content
                            



                                Commercial Espresso Machines
                            



                                Undercounter Ice Makers
                            



                                Bad Credit Loans
                            



                                Cash Counting Machines
                            



                                Portable Solar Generators
                            



                                Personal Loans
                            



                                Guru Mortgage
                            



                                Moving In Israel
                            




Sites Of Interest



                                Jerusalem Hotels
                            



                                KKL-JNF
                            



                                Poalim Online
                            



                                Jewish Broadcasting Service
                            



                                Personas Media
                            



                                Dealspotr Promo Codes
                            




Follow Us









The Jerusalem Post Customer Service Center can be contacted with any questions or requests:
 
 Telephone: *2421 * Extension 4 Jerusalem Post or 03-7619056 Fax: 03-5613699E-mail: subs@jpost.com
 
The center is staffed and provides answers on Sundays through Thursdays between 07:00 and 14:00 and Fridays only handles distribution requests between 7:00 and 
13:00
 
For international customers: The center is staffed and provides answers on Sundays through Thursdays between 7AM and 6PM 

Toll Free number in Israel only 1-800-574-574 
Telephone +972-3-761-9056
Fax: 972-3-561-3699
E-mail: subs@jpost.com



Copyright © 2018 Jpost Inc. All rights reserved • Terms of Use • Privacy Policy

 ux design by: studio Inbar Edut
•








!function (d, s, id) { var js, fjs = d.getElementsByTagName(s)[0]; if (!d.getElementById(id)) { js = d.createElement(s); js.id = id; js.src = "//platform.twitter.com/widgets.js"; fjs.parentNode.insertBefore(js, fjs); } }(document, "script", "twitter-wjs");


		    (function () {
		        var po = document.createElement('script'); po.type = 'text/javascript'; po.async = true;
		        po.src = 'https://apis.google.com/js/platform.js';
		        var s = document.getElementsByTagName('script')[0]; s.parentNode.insertBefore(po, s);
		    })();
		



    /* <![CDATA[ */
    var google_conversion_id = 879542449;
    var google_custom_params = window.google_tag_params;
    var google_remarketing_only = true;
    /* ]]> */














