


Privacy Policy | Kaggle


 







    window.ga = window.ga || function () { (ga.q = ga.q || []).push(arguments) }; ga.l = +new Date;
    ga('create', 'UA-12629138-1', 'auto');
    ga('set', 'displayFeaturesTask', null);
    ga('send', 'pageview');
    



    window.dataLayer = window.dataLayer || [];
    function gtag() { dataLayer.push(arguments); }
    gtag('js', new Date());
    gtag('config', 'AW-955737689');


    !function(f,b,e,v,n,t,s)
    {if(f.fbq)return;n=f.fbq=function(){n.callMethod?
            n.callMethod.apply(n,arguments):n.queue.push(arguments)};
        if(!f._fbq)f._fbq=n;n.push=n;n.loaded=!0;n.version='2.0';
        n.queue=[];t=b.createElement(e);t.async=!0;
        t.src=v;s=b.getElementsByTagName(e)[0];
        s.parentNode.insertBefore(t,s)}(window,document,'script',
        'https://connect.facebook.net/en_US/fbevents.js');
    fbq("set", "autoConfig", "false", "136809193586742");
    fbq('init', '136809193586742'); 
    fbq('track', 'PageView');




window.intercomSettings = {"app_id":"koj6gxx6"}; (function () { var w = window; var ic = w.Intercom; if (typeof ic === "function") { ic('reattach_activator'); ic('update', intercomSettings); } else { var d = document; var i = function () { i.c(arguments) }; i.q = []; i.c = function (args) { i.q.push(args) }; w.Intercom = i; function l() { var s = d.createElement('script'); s.type = 'text/javascript'; s.async = true; s.src = 'https://widget.intercom.io/widget/koj6gxx6'; var x = d.getElementsByTagName('script')[0]; x.parentNode.insertBefore(s, x); } if (w.attachEvent) { w.attachEvent('onload', l); } else { w.addEventListener('load', l, false); } } })()
let useKaggleAnalytics = true;






var Kaggle=window.Kaggle||{};Kaggle.State=Kaggle.State||[];Kaggle.State.push({});performance && performance.mark && performance.mark("SiteHeaderContainer.componentCouldBootstrap");


var Kaggle=window.Kaggle||{};Kaggle.State=Kaggle.State||[];Kaggle.State.push();performance && performance.mark && performance.mark("Privacy.componentCouldBootstrap");





© 2018 Kaggle Inc


Our Team
Terms
Privacy
Contact/Support


var Kaggle=window.Kaggle||{};Kaggle.State=Kaggle.State||[];Kaggle.State.push();performance && performance.mark && performance.mark("SocialIcons.componentCouldBootstrap");






    var Kaggle = Kaggle || {};

    Kaggle.Current = {
        antiForgeryToken: 'bthwhHZX_dras1Psk0G7AEClOkJKsJr6FVVD9hqF09DDEOSHs8vZR1Q0FZcDfX_ePARt9HuzWJOw-oNiY8RBYS9LiJI1',
        isAnonymous: true,
        isFullScreen: false,
        analyticsToken: 'eyJhbGciOiJIUzI1NiIsInR5cCI6IkpXVCJ9.eyJleHAiOjE1NDEwOTc5NzIsIlVzZXJJZCI6MH0.UpzkP0sfUputgWw5xrozsMU-tRjAk_pc3MbCdqbzjyc',
        analyticsTokenExpiry: 15,
        internetKernelsEnabled: false,
        
        
        
        
        
        
        
        
        
        
        
    }
        Kaggle.Current.log = function(){};
        Kaggle.Current.warn = function(){};

    var decodeUserDisplayName = function () {
        var escapedUserDisplayName = Kaggle.Current.userDisplayNameEscaped || "";
        try {
            var textVersion = new DOMParser().parseFromString(escapedUserDisplayName, "text/html").documentElement.textContent;
            if (textVersion) {
                return textVersion;
            }
        } catch(ex) {}
        
        return escapedUserDisplayName;
    }
    Kaggle.Current.userDisplayName = decodeUserDisplayName();


    var Kaggle = Kaggle || {};
    Kaggle.PageMessages = [];



            (function() {
                if ('serviceWorker' in navigator) {
                    
                    navigator.serviceWorker.register("/static/assets/service-worker.js").then(function(reg) {
                        
                        reg.onupdatefound = function() {
                            
                            var installingWorker = reg.installing;
                            installingWorker.onstatechange = function() {
                                switch (installingWorker.state) {
                                case 'installed':
                                    if (navigator.serviceWorker.controller) {
                                        
                                        console.log('New or updated content is available.');
                                    } else {
                                        
                                        console.log('Content is now available offline!');
                                    }
                                    break;
                                case 'redundant':
                                    console.error('The installing service worker became redundant.');
                                    break;
                                }
                            };
                        };
                    }).catch(function(e) {
                      console.error('Error during service worker registration:', e);
                    });
                }
            })();
        


