{
    "config": {
        "chainId": 33,
        "homesteadBlock": 0,
        "eip150Block": 0,
        "eip155Block": 0,
        "eip158Block": 0,
        "byzantiumBlock": 0,
        "constantinopleBlock": 0,
        "petersburgBlock": 0,
        "istanbulBlock": 0,
        "muirGlacierBlock": 0,
        "berlinBlock": 0,
        "londonBlock": 0,
        "ethash": {}
    },
    "difficulty": "1",
    "gasLimit": "8000000",
    "alloc": {
        "5fbbb31be52608d2f52247e8400b7fcaa9e0bc12": {
            "balance": "500000000000000000000000"
        },
        "76ce31bd03f601c3fc13732def921c5bac282676": {
            "balance": "500000000000000000000000"
        },
        "09ee460834498a4ee361beb819470061b7381b49": {
            "balance": "500000000000000000000000"
        },
        "6aefbd09209e1ee2e0a589d31e732f69b77713d2": {
            "balance": "500000000000000000000000"
        },
        "631e128b16f9adcf1bb6385112b1519c917d77a7": {
            "balance": "500000000000000000000000"
        },
        "cd5c788e84220e8b8934ea4f1dc6a12009bcc91d": {
            "balance": "500000000000000000000000"
        },
        "3627c1b31525887cb9441130c831e35887650305": {
            "balance": "500000000000000000000000"
        },
        "03a13a989af30c92ad7abd1e6210308a6c96f373": {
            "balance": "500000000000000000000000"
        },
        "534799422b45420a438358e36f597a636e0c78de": {
            "balance": "500000000000000000000000"
        },
        "abca3ff5309537af9ed9bf3df67539f74338f8cb": {
            "balance": "500000000000000000000000"
        },
        "a1eccd849966e42e72de2ea319b66b329ac52891": {
            "balance": "500000000000000000000000"
        },
        "2a67e18deb28b549e3d45a4b74b04178d0383c7c": {
            "balance": "500000000000000000000000"
        },
        "b31ee8e2d87853c25982ba4dc5058a28e3db203a": {
            "balance": "500000000000000000000000"
        },
        "946650b30943a46386a296117b0342e18e73e4cb": {
            "balance": "500000000000000000000000"
        },
        "aeaf7f00b4e12a6763b679518ef561aead5e84f9": {
            "balance": "500000000000000000000000"
        },
        "43d4611ceb94c58c7cf9058fa625e16af2ad8d83": {
            "balance": "500000000000000000000000"
        },
        "5c79a9f5767e3c1b926f963fa24e21d8a04289ae": {
            "balance": "500000000000000000000000"
        },
        "ef69a91be0dbbf044b416fcb819b2c23fd6aba22": {
            "balance": "500000000000000000000000"
        },
        "d0adc64f42d4241b2c1cf4d390e48142a084fc93": {
            "balance": "500000000000000000000000"
        },
        "6a0f279ddee8648a863d7251584e86104a4a51b7": {
            "balance": "500000000000000000000000"
        },
        "a2277cc7c8ae24f4f86e0d41bde9679e6ebb730b": {
            "balance": "500000000000000000000000"
        },
        "31ed87a390fb66e4c3f2c2cf8a7c59c1d2d7ddf4": {
            "balance": "500000000000000000000000"
        },
        "0e4830f56bb3aa3da70e9dbaaa472ebb6bd4549d": {
            "balance": "500000000000000000000000"
        },
        "3f6c7da283bef6d28b8d05948e6d81393f29e64f": {
            "balance": "500000000000000000000000"
        },
        "10d7b6dc29e6b16faea717dec18947d1fd70fba9": {
            "balance": "500000000000000000000000"
        },
        "338d889ee68955be449dfd0bb9379a6692a264a1": {
            "balance": "500000000000000000000000"
        },
        "0e89a2ea2b8582d12ca55899e153017354bc5227": {
            "balance": "500000000000000000000000"
        },
        "33226cdd64e9fc64d661e0ff878b8b93793795ff": {
            "balance": "500000000000000000000000"
        },
        "3500cab92ac344dfef85d51b5c03745ec9e3912b": {
            "balance": "500000000000000000000000"
        },
        "da3a94ae88dfd316f87184533664e66baea11a96": {
            "balance": "500000000000000000000000"
        },
        "c8dffcc547522e29af991e3a8235ce5a42c8116e": {
            "balance": "500000000000000000000000"
        },
        "9e706c947b0d7640fc1df14ff6373a9a92b73896": {
            "balance": "500000000000000000000000"
        }
    }
}
