{
  "logLevel": "info",
  "backendUrl": "http://localhost:3000",
  "frontendUrl": "http://localhost:3000",
  "frontendCallbackUrl": "http://localhost:3000/callback",
  "peerplays": {
    "peerplaysWS": "ws://ec2-99-79-98-229.ca-central-1.compute.amazonaws.com:8090",
    "peerplaysFaucetURL": "http://ec2-99-79-98-229.ca-central-1.compute.amazonaws.com:5000/api/v1/accounts",
    "referrer": "1.2.18",
    "feeAssetId": "1.3.0",
    "paymentAccountID": "1.2.19",
    "paymentAccountWIF": "5Ji3ZPqfhewPnVTmSyeZHwA4zFHrYpCMbenvmMwi5FcKR5KjxGr"
  },
  "google": {
    "clientId": "457241315847-53tlujrnj4oj66sehd37rqqjjmgdh1r6.apps.googleusercontent.com",
    "clientSecret": "1vkXPzTcNew4Q4pKmiPgVFFp"
  },
  "facebook": {
    "clientId": "2534442443233970",
    "clientSecret": "271bd8b8a045cf88f42b6ba36765a337"
  },
  "db": {
    "database": "peerplaysid"
  }
}
