{
  "db": {
    "user": "DB_USER",
    "password": "DB_PASSWORD",
    "host": "DB_HOST",
    "port": "DB_PORT",
    "database": "DB_DATABASE"
  },
  "sessionSecret": "SESSION_SECRET",
  "google": {
    "clientId": "GOOGLE_CLIENT_ID",
    "clientSecret": "GOOGLE_CLIENT_SECRET"
  },
  "facebook": {
    "clientId": "FACEBOOK_CLIENT_ID",
    "clientSecret": "FACEBOOK_CLIENT_SECRET"
  },
  "backendUrl": "BACKEND_URL",
  "frontendUrl": "FRONTEND_URL",
  "mailer": {
    "host": "MAILER_HOST",
    "auth": {
      "user": "MAILER_AUTH_USER",
      "pass": "MAILER_AUTH_PASS"
    }
  },
  "peerplays": {
    "paymentAccountID": "PEERPLAYS_PAYMENT_ACCOUNT_ID",
    "paymentAccountWIF": "PEERPLAYS_PAYMENT_ACCOUNT_WIF",
    "peerplaysWS": "PEERPLAYS_WS"
  }
}
