<svg id="Component_19_1" data-name="Component 19 – 1" xmlns="http://www.w3.org/2000/svg" xmlns:xlink="http://www.w3.org/1999/xlink" width="63.613" height="63.613" viewBox="0 0 63.613 63.613">
  <defs>
    <linearGradient id="linear-gradient" x1="0.5" y1="1.001" x2="0.5" y2="-0.001" gradientUnits="objectBoundingBox">
      <stop offset="0" stop-color="#0051bc"/>
      <stop offset="0.159" stop-color="#0071cb"/>
      <stop offset="0.258" stop-color="#0080d3"/>
      <stop offset="0.477" stop-color="#0090db"/>
      <stop offset="0.724" stop-color="#009be0"/>
      <stop offset="1" stop-color="#009fe2"/>
    </linearGradient>
  </defs>
  <ellipse id="Ellipse_5" data-name="Ellipse 5" cx="22.531" cy="22.451" rx="22.531" ry="22.451" transform="translate(0 31.879) rotate(-45.029)" fill="url(#linear-gradient)"/>
  <path id="Path_4003" data-name="Path 4003" d="M1336.048,458.45l-14.162,8.177V450.273Z" transform="translate(-1294.663 -426.643)" fill="#fff"/>
</svg>
