{
  "type": "party",
  "lazy_key": "P_9200_OFFICER",
  "object": {
    "entity_name": "Charles W. Sinclair",
    "entity_type": "person",
    "contact": {
      "phone": "704-825-0000",
      "email": "cwsinclair@no-deliver.com"
    }
  }
}
