{
  "type": "party",
  "lazy_key": "P_FISHKILL_CHILDRENS_HOSP",
  "object": {
    "entity_name": "Fishkill Upstate Childrens Hospital",
    "entity_type": "501(c)(3)",
    "tin": "00-1237777",
    "contact": {
      "street_address": "1803 Recovery Road",
      "city": "Fishkill",
      "state": "New York",
      "country": "United States of America",
      "postal_code": "12524",
      "phone": "000-555-7177",
      "email": "inquiries@fishkillupstatechildrenshosp.org"
    }
  }
}
