{
  "type": "party",
  "lazy_key": "P_FISHKILL_RIDERS_NOTARY",
  "object": {
    "entity_name": "John Q. Notary",
    "entity_type": "individual",
    "contact": {
      "street_address": "413 Notorious Lane",
      "city": "Fishkill",
      "state": "New York",
      "country": "United States of America",
      "postal_code": "12524"
    },
    "x.509_cert": {
      "t.b.d.": {}
    }
  }
}
