{
  "type": "party",
  "lazy_key": "P_9200_VOLUNTEER",
  "object": {
    "entity_name": "Kelly Marks",
    "entity_type": "person",
    "contact": {
      "phone": "704-555-0000",
      "email": "kellymm@no-deliver.com"
    }
  }
}
