{
  "db": {
    "user": "postgres",
    "password": "password",
    "host": "127.0.0.1",
    "port": "5432",
    "database": "lotto"
  },
  "swagger": {
    "host": "virtserver.swaggerhub.com",
    "schemes": [
      "https"
    ]
  },
  "sessionSecret": "sessionSecret",
  "cors": false,
  "port": 3000,
  "frontendUrl": "http://localhost:8082",
  "peerplays": {
    "peerplaysWS": "wss://irona.peerplays.download/api",
    "peerplaysFaucetURL": "https://irona-faucet.peerplays.download/faucet/api/v1/accounts",
    "referrer": "1.2.18",
    "sendAssetId": "1.3.0",
    "paymentAccountID": "1.2.1162",
    "paymentAccountWIF": "5JjydmMbkXSbd47J8CqNqA9dwSqTmUvoYdxxHP5JecDPZti9ZnQ",
    "paymentReceiver": "1.2.1163",
    "paymentReceiverWIF": "5HpxiGbhGgayv4YE43Jtp5R95aKCXoUiKH6eCadaVfGyRwKjLPu",
    "ticketPrice": 1,
    "ticketAssetID": "1.3.0",
    "maxTicketSupply": 10000000
  },
  "mailer": {
    "host": "smtp.gmail.com",
    "port": 587,
    "secure": false,
    "auth": {
      "user": "prabhjot.narula@gmail.com",
      "pass": "mgclffomjvbzwhvu"
    },
    "sender": "Prabhjot Singh"
  },
  "s3": {
    "bucket": "nh5050-dev"
  },
  "cdnUrl": "http://d2auf3ow1jba87.cloudfront.net",
  "stripe": {
    "publishableKey": "pk_test_eXMu4Pj53sjl7Ff2pj3xYPh8",
    "secretKey": "sk_test_vC4hHCnGd6c2q7l4XZZEtDV0",
    "endpointSecret": "whsec_gqPI1tTE8B8JzNLtUlUOCB2hZnmoSwFt"
  }
}
