<?xml version="1.0" encoding="UTF-8" standalone="no"?>
<!-- Created with Inkscape (http://www.inkscape.org/) -->

<svg
   version="1.1"
   id="svg2"
   xml:space="preserve"
   width="1333.3333"
   height="1333.3333"
   viewBox="0 0 1333.3333 1333.3333"
   sodipodi:docname="Peerplays logo.ai"
   xmlns:inkscape="http://www.inkscape.org/namespaces/inkscape"
   xmlns:sodipodi="http://sodipodi.sourceforge.net/DTD/sodipodi-0.dtd"
   xmlns="http://www.w3.org/2000/svg"
   xmlns:svg="http://www.w3.org/2000/svg"><defs
     id="defs6" /><sodipodi:namedview
     id="namedview4"
     pagecolor="#ffffff"
     bordercolor="#666666"
     borderopacity="1.0"
     inkscape:pageshadow="2"
     inkscape:pageopacity="0.0"
     inkscape:pagecheckerboard="0" /><g
     id="g8"
     inkscape:groupmode="layer"
     inkscape:label="Peerplays logo"
     transform="matrix(1.3333333,0,0,-1.3333333,0,1333.3333)"><g
       id="g10"
       transform="translate(340.0386,775.9496)"><path
         d="M 0,0 320.062,0.029 345.704,-44.384 226.468,-251.643 H 84.723 l -128.583,-223.505 -41.979,72.641 129.282,226.142 h 139.536 l 58.156,101.087 H 44.383 l -159.127,-275.842 -43.893,74.772 z"
         style="fill:#fb7a14;fill-opacity:1;fill-rule:nonzero;stroke:none"
         id="path12" /></g><g
       id="g14"
       transform="translate(660.9283,223.7489)"><path
         d="m 0,0 -320.063,-0.029 -17.078,29.818 129.539,225.891 H -70.568 L 49.336,464.442 90.018,394.855 -33.098,179.669 h -130.61 L -224.731,74.753 h 180.927 l 158.548,276.367 43.893,-74.772 z"
         style="fill:#0148be;fill-opacity:1;fill-rule:nonzero;stroke:none"
         id="path16" /></g></g></svg>
