<svg xmlns="http://www.w3.org/2000/svg" xmlns:xlink="http://www.w3.org/1999/xlink" width="143.797" height="69.397" viewBox="0 0 143.797 69.397">
  <defs>
    <linearGradient id="linear-gradient" x1="0.5" y1="0.992" x2="0.5" y2="0.066" gradientUnits="objectBoundingBox">
      <stop offset="0"/>
      <stop offset="0.202" stop-color="#020202"/>
      <stop offset="0.309" stop-color="#090a0a"/>
      <stop offset="0.393" stop-color="#171717"/>
      <stop offset="0.466" stop-color="#292a2a"/>
      <stop offset="0.532" stop-color="#414243"/>
      <stop offset="0.591" stop-color="#5f6061"/>
      <stop offset="0.614" stop-color="#6d6e70"/>
      <stop offset="1" stop-color="#fff"/>
    </linearGradient>
    <linearGradient id="linear-gradient-2" x1="0.5" y1="-0.004" x2="0.5" y2="0.996" gradientUnits="objectBoundingBox">
      <stop offset="0"/>
      <stop offset="0.461" stop-color="#6d6e70"/>
      <stop offset="1" stop-color="#fff"/>
    </linearGradient>
    <linearGradient id="linear-gradient-3" x1="0.794" y1="-0.706" x2="0.214" y2="1.676" gradientUnits="objectBoundingBox">
      <stop offset="0"/>
      <stop offset="0.122" stop-color="#020202"/>
      <stop offset="0.195" stop-color="#0a0a0a"/>
      <stop offset="0.255" stop-color="#191919"/>
      <stop offset="0.309" stop-color="#2d2d2d"/>
      <stop offset="0.357" stop-color="#474747"/>
      <stop offset="0.403" stop-color="#676768"/>
      <stop offset="0.446" stop-color="#8d8e8e"/>
      <stop offset="0.485" stop-color="#b8b9ba"/>
      <stop offset="0.521" stop-color="#e6e7e8"/>
      <stop offset="0.546" stop-color="#c6c7c8"/>
      <stop offset="0.588" stop-color="#989999"/>
      <stop offset="0.633" stop-color="#6f7070"/>
      <stop offset="0.68" stop-color="#4d4d4d"/>
      <stop offset="0.729" stop-color="#303131"/>
      <stop offset="0.782" stop-color="#1b1b1b"/>
      <stop offset="0.839" stop-color="#0b0b0b"/>
      <stop offset="0.905" stop-color="#020202"/>
      <stop offset="1"/>
    </linearGradient>
    <linearGradient id="linear-gradient-4" x1="0.5" y1="0.998" x2="0.5" y2="0.01" gradientUnits="objectBoundingBox">
      <stop offset="0" stop-color="#009b00"/>
      <stop offset="0.218" stop-color="#00ab00"/>
      <stop offset="0.644" stop-color="#00d600"/>
      <stop offset="1" stop-color="lime"/>
    </linearGradient>
    <linearGradient id="linear-gradient-5" x1="0.5" y1="-0.008" x2="0.5" y2="0.999" gradientUnits="objectBoundingBox">
      <stop offset="0" stop-color="#fff"/>
      <stop offset="1" stop-color="#fff" stop-opacity="0"/>
    </linearGradient>
  </defs>
  <g id="Btt" transform="translate(51.521)">
    <g id="Grupo_8001" data-name="Grupo 8001" transform="translate(-51.521 0)">
      <rect id="Rectángulo_4760" data-name="Rectángulo 4760" width="143.797" height="69.397" rx="34.698" fill="url(#linear-gradient)"/>
      <rect id="Rectángulo_4761" data-name="Rectángulo 4761" width="135.197" height="59.077" rx="29.538" transform="translate(4.3 6.02)" fill="url(#linear-gradient-2)"/>
      <rect id="Rectángulo_4759" data-name="Rectángulo 4759" width="135.197" height="59.077" rx="29.538" transform="translate(4.3 5.16)" fill="url(#linear-gradient-3)"/>
      <rect id="Rectángulo_35" data-name="Rectángulo 35" width="131.757" height="53.917" rx="26.958" transform="translate(6.02 6.88)" fill="url(#linear-gradient-4)"/>
      <path id="Rectángulo_4758" data-name="Rectángulo 4758" d="M27,0h77.317a28,28,0,0,1,28,28v6.1a0,0,0,0,1,0,0H0a0,0,0,0,1,0,0V27A27,27,0,0,1,27,0Z" transform="translate(5.74 7.74)" fill="url(#linear-gradient-5)"/>
    </g>
    <text id="Share" transform="translate(34.535 40.044)" font-size="21" font-family="Lato-MediumItalic, Lato" font-weight="500" font-style="italic"><tspan x="-31.321" y="0">SHARE</tspan></text>
    <g id="Grupo_60" data-name="Grupo 60" transform="translate(-28.902 21.804)">
      <path id="Trazado_136" data-name="Trazado 136" d="M1761.519,1056.318h-1.647a.773.773,0,0,0-.823.814v2.036a.387.387,0,0,1-.412.408h-14a.387.387,0,0,1-.412-.408v-2.036a.773.773,0,0,0-.823-.814h-1.646a.774.774,0,0,0-.824.814v4.886a.774.774,0,0,0,.824.814h19.758a.773.773,0,0,0,.823-.814v-4.886A.773.773,0,0,0,1761.519,1056.318Z" transform="translate(-1740.937 -1043.288)"/>
      <path id="Trazado_137" data-name="Trazado 137" d="M1748.575,1047.273a.8.8,0,0,0,1.152,0l.823-.814a.444.444,0,0,1,.741.325v5.375a.774.774,0,0,0,.823.814h1.646a.774.774,0,0,0,.823-.814v-5.375a.455.455,0,0,1,.74-.325l.823.814a.8.8,0,0,0,1.153,0l1.152-1.14a.781.781,0,0,0,0-1.14l-4.939-4.885a.8.8,0,0,0-1.153,0l-4.939,4.885a.781.781,0,0,0,0,1.14Z" transform="translate(-1742.236 -1039.862)"/>
    </g>
  </g>
</svg>
