{
  "logLevel": "trace",
  "db": {
    "user": "",
    "password": "",
    "host": "127.0.0.1",
    "port": "5432",
    "database": "nh5050"
  },
  "swagger": {
    "host": "virtserver.swaggerhub.com",
    "schemes": [
      "https"
    ]
  },
  "sessionSecret": "sessionSecret",
  "cors": false,
  "port": 3000,
  "peerplays": {
    "ticketPrice": 1,
    "ticketAssetID": "1.3.0",
    "ticketAssetPrecision": 5,
    "maxTicketSupply": 10000000
  },
  "mailer": {
    "host": "smtp.gmail.com",
    "port": 587,
    "secure": false,
    "auth": {
      "user": "",
      "pass": ""
    },
    "sender": "NFT Lotter Test"
  },
  "s3": {
    "bucket": "nh5050-dev"
  },
  "cdnUrl": "http://d2auf3ow1jba87.cloudfront.net",
  "stripe": {
    "publishableKey": "",
    "secretKey": "",
    "endpointSecret": ""
  },
  "peerid": {
    "url": "https://peerid.peerplays.download/api/v1/",
    "client_id": 1,
    "client_secret": "",
    "redirect_uri": ""
  }
}