2017-10-02 21:40:20;3000001
2017-11-03 03:46:50;3000002
2017-08-11 12:06:28;3000003
2017-01-15 04:20:36;3000004
2017-10-07 10:57:25;3000005
2017-08-25 03:53:14;3000006
2017-04-29 03:25:46;3000007
2017-12-20 15:13:29;3000008
2017-10-16 21:02:14;3000009
2017-03-18 16:53:17;3000010
2017-07-18 02:31:42;3000011
2017-06-06 13:09:15;3000012
2017-08-11 05:12:42;3000013
2017-09-17 09:48:58;3000014
2017-01-24 04:37:20;3000015
2017-01-19 17:16:54;3000016
2017-09-16 02:37:39;3000017
2017-08-12 23:32:43;3000018
2017-01-27 12:42:01;3000019
2017-06-03 04:42:29;3000020
2017-05-13 02:13:33;3000021
2017-05-29 15:40:36;3000022
2017-10-12 07:43:58;3000023
2017-10-10 02:04:31;3000024
2017-10-30 06:03:24;3000025
2017-02-11 11:38:48;3000026
2017-04-07 12:49:09;3000027
2017-07-13 16:12:36;3000028
2017-10-17 01:21:22;3000029
2017-03-11 18:36:22;3000030
2017-03-15 11:45:12;3000031
2017-09-02 17:50:46;3000032
2017-03-27 18:46:18;3000033
2017-06-30 18:42:56;3000034
2017-12-21 17:20:39;3000035
2017-08-10 00:15:17;3000036
2017-10-07 23:00:33;3000037
2017-06-09 18:23:17;3000038
2017-08-16 13:06:55;3000039
2017-09-24 13:34:56;3000040
2017-02-07 05:19:50;3000041
2017-02-13 10:26:43;3000042
2017-02-13 10:33:07;3000043
2017-06-17 01:00:15;3000044
2017-01-15 00:32:53;3000045
2017-10-29 14:08:49;3000046
2017-06-19 10:34:02;3000047
2017-01-07 10:46:39;3000048
2017-07-09 14:14:52;3000049
2017-10-18 11:32:39;3000050
2017-04-16 13:40:08;3000051
2017-12-25 18:10:05;3000052
2017-01-30 03:41:18;3000053
2017-08-13 19:49:15;3000054
2017-05-27 06:55:31;3000055
2017-11-07 00:28:36;3000056
2017-01-22 13:07:16;3000057
2017-06-13 01:38:05;3000058
2017-07-16 21:09:35;3000059
2017-10-31 09:41:35;3000060
2017-10-09 14:20:19;3000061
2017-06-25 05:41:47;3000062
2017-01-25 06:49:01;3000063
2017-07-09 14:57:05;3000064
2017-10-06 06:28:25;3000065
2017-08-24 06:32:21;3000066
2017-03-25 14:43:36;3000067
2017-07-25 09:33:34;3000068
2017-10-09 06:02:53;3000069
2017-11-06 12:02:28;3000070
2017-06-22 20:45:29;3000071
2017-08-04 05:22:49;3000072
2017-05-18 15:09:11;3000073
2017-10-26 03:29:51;3000074
2017-12-17 00:05:12;3000075
2017-02-29 19:12:04;3000076
2017-08-10 12:53:04;3000077
2017-08-04 01:22:21;3000078
2017-12-15 15:12:31;3000079
2017-11-06 23:32:46;3000080
2017-11-29 21:09:36;3000081
2017-11-28 10:53:05;3000082
2017-03-12 04:15:30;3000083
2017-07-13 12:12:35;3000084
2017-07-03 15:22:16;3000085
2017-03-17 03:07:14;3000086
2017-02-25 09:11:59;3000087
2017-09-02 22:56:50;3000088
2017-10-20 12:45:04;3000089
2017-06-24 02:27:43;3000090
2017-11-24 23:34:09;3000091
2017-03-06 11:46:57;3000092
2017-06-26 18:41:19;3000093
2017-12-09 06:37:45;3000094
2017-10-19 12:13:20;3000095
2017-11-30 04:48:31;3000096
2017-03-27 03:23:13;3000097
2017-09-30 10:42:56;3000098
2017-09-10 09:06:32;3000099
2017-09-02 03:30:10;3000100
2017-03-07 17:28:52;3000101
2017-01-31 21:09:19;3000102
2017-07-29 14:22:41;3000103
2017-05-04 02:00:35;3000104
2017-05-19 22:08:33;3000105
2017-10-15 22:47:49;3000106
2017-08-31 15:27:12;3000107
2017-11-24 14:23:39;3000108
2017-09-26 11:30:10;3000109
2017-11-27 17:41:08;3000110
2017-03-19 05:37:24;3000111
2017-05-28 19:51:14;3000112
2017-03-11 16:33:57;3000113
2017-03-23 21:03:22;3000114
2017-12-11 17:33:24;3000115
2017-03-26 01:05:23;3000116
2017-08-10 13:12:57;3000117
2017-10-20 11:05:27;3000118
2017-05-12 00:47:49;3000119
2017-09-05 20:35:07;3000120
2017-04-01 07:47:57;3000121
2017-06-06 11:58:39;3000122
2017-03-30 22:21:33;3000123
2017-01-22 02:06:41;3000124
2017-12-05 05:03:14;3000125
2017-03-18 06:01:02;3000126
2017-08-12 17:36:22;3000127
2017-05-17 12:56:52;3000128
2017-06-30 11:15:54;3000129
2017-10-30 23:43:40;3000130
2017-01-03 02:55:14;3000131
2017-02-07 02:24:04;3000132
2017-05-25 23:51:05;3000133
2017-02-16 23:21:29;3000134
2017-08-02 16:30:50;3000135
2017-06-06 12:12:42;3000136
2017-11-26 10:24:45;3000137
2017-08-24 06:31:26;3000138
2017-10-02 21:52:44;3000139
2017-10-01 10:47:28;3000140
2017-10-01 10:41:38;3000141
2017-09-10 17:07:44;3000142
2017-08-30 00:37:30;3000143
2017-06-30 23:16:05;3000144
2017-09-17 01:15:35;3000145
2017-11-23 20:18:22;3000146
2017-02-26 08:14:49;3000147
2017-03-03 17:29:58;3000148
2017-07-14 23:13:27;3000149
2017-02-18 23:36:54;3000150
2017-02-18 02:22:27;3000151
2017-01-18 01:10:16;3000152
2017-06-17 14:25:01;3000153
2017-06-22 13:14:13;3000154
2017-08-22 21:04:38;3000155
2017-01-25 21:35:22;3000156
2017-04-02 01:32:53;3000157
2017-11-23 16:44:43;3000158
2017-04-29 02:28:29;3000159
2017-11-22 10:18:58;3000160
2017-03-28 16:40:38;3000161
2017-03-12 23:32:22;3000162
2017-06-17 02:14:26;3000163
2017-02-07 23:25:32;3000164
2017-12-23 11:01:15;3000165
2017-01-25 05:16:42;3000166
2017-09-04 16:32:07;3000167
2017-06-08 10:33:57;3000168
2017-12-31 00:58:19;3000169
2017-04-29 22:11:16;3000170
2017-08-20 22:27:55;3000171
2017-12-19 10:54:55;3000172
2017-11-25 22:27:15;3000173
2017-10-12 08:56:22;3000174
2017-11-15 20:02:12;3000175
2017-04-11 02:10:06;3000176
2017-02-17 22:13:40;3000177
2017-01-17 16:19:45;3000178
2017-05-11 13:07:51;3000179
2017-12-21 16:17:51;3000180
2017-06-07 23:43:38;3000181
2017-03-04 09:18:23;3000182
2017-03-11 14:55:11;3000183
2017-03-13 17:29:43;3000184
2017-06-20 00:26:56;3000185
2017-05-10 19:48:17;3000186
2017-05-26 05:16:01;3000187
2017-10-12 13:41:00;3000188
2017-06-13 17:08:12;3000189
2017-06-05 15:39:23;3000190
2017-02-24 12:16:47;3000191
2017-08-18 17:03:59;3000192
2017-04-09 20:22:53;3000193
2017-09-04 10:56:56;3000194
2017-03-03 10:13:14;3000195
2017-03-22 04:49:42;3000196
2017-01-07 06:32:25;3000197
2017-05-26 08:02:57;3000198
2017-03-04 17:36:21;3000199
2017-02-05 10:41:14;3000200
2017-02-10 11:55:05;3000201
2017-01-29 00:43:21;3000202
2017-06-06 10:05:57;3000203
2017-08-19 14:44:30;3000204
2017-05-11 22:47:09;3000205
2017-02-11 08:47:04;3000206
2017-10-10 19:20:07;3000207
2017-07-13 18:22:20;3000208
2017-09-22 14:26:10;3000209
2017-10-05 04:18:04;3000210
2017-08-31 11:56:13;3000211
2017-01-18 08:09:06;3000212
2017-12-05 12:24:12;3000213
2017-05-20 20:19:43;3000214
2017-08-14 02:37:56;3000215
2017-06-16 10:03:20;3000216
2017-09-22 14:06:38;3000217
2017-11-02 01:02:51;3000218
2017-02-03 08:23:25;3000219
2017-02-22 14:48:18;3000220
2017-08-17 22:25:31;3000221
2017-01-13 19:56:05;3000222
2017-05-31 22:41:20;3000223
2017-11-08 02:57:54;3000224
2017-06-19 13:14:58;3000225
2017-05-16 20:05:23;3000226
2017-12-20 20:00:48;3000227
2017-03-30 20:00:49;3000228
2017-07-08 15:03:32;3000229
2017-03-24 23:09:15;3000230
2017-01-05 16:08:16;3000231
2017-09-02 03:29:04;3000232
2017-04-21 16:54:24;3000233
2017-03-06 09:59:02;3000234
2017-03-24 18:20:21;3000235
2017-03-21 20:14:07;3000236
2017-04-26 02:41:20;3000237
2017-06-06 14:07:26;3000238
2017-03-13 04:21:05;3000239
2017-04-07 11:40:57;3000240
2017-10-24 14:02:23;3000241
2017-01-06 04:40:11;3000242
2017-08-28 05:08:53;3000243
2017-12-30 20:38:33;3000244
2017-04-25 12:41:30;3000245
2017-04-29 07:38:38;3000246
2017-03-12 21:32:08;3000247
2017-08-26 12:29:16;3000248
2017-07-15 13:47:36;3000249
2017-12-18 16:14:10;3000250
2017-05-04 05:17:12;3000251
2017-09-11 06:16:07;3000252
2017-11-24 12:21:07;3000253
2017-08-11 19:40:00;3000254
2017-03-13 15:58:02;3000255
2017-02-06 21:57:27;3000256
2017-03-12 19:20:10;3000257
2017-08-24 10:58:11;3000258
2017-11-09 04:52:21;3000259
2017-07-21 13:31:42;3000260
2017-10-01 11:13:49;3000261
2017-03-10 07:56:34;3000262
2017-12-29 12:56:13;3000263
2017-06-02 10:47:00;3000264
2017-09-28 12:42:00;3000265
2017-03-11 02:32:19;3000266
2017-02-01 11:20:33;3000267
2017-10-26 02:36:57;3000268
2017-04-10 09:52:14;3000269
2017-10-07 13:57:40;3000270
2017-12-25 20:46:09;3000271
2017-09-22 07:20:57;3000272
2017-06-24 13:55:26;3000273
2017-12-29 20:29:43;3000274
2017-03-21 21:48:36;3000275
2017-02-28 01:06:02;3000276
2017-01-19 16:35:54;3000277
2017-11-29 06:35:27;3000278
2017-06-07 12:41:58;3000279
2017-08-23 13:14:23;3000280
2017-09-07 07:57:07;3000281
2017-08-07 23:35:20;3000282
2017-06-02 22:25:34;3000283
2017-11-09 20:50:29;3000284
2017-12-12 04:19:13;3000285
2017-03-16 07:22:25;3000286
2017-06-22 14:49:50;3000287
2017-07-28 10:28:03;3000288
2017-03-28 01:22:18;3000289
2017-11-21 04:53:37;3000290
2017-10-31 08:23:13;3000291
2017-02-17 07:23:32;3000292
2017-11-01 01:14:39;3000293
2017-05-22 00:43:11;3000294
2017-02-16 22:04:09;3000295
2017-02-20 05:42:39;3000296
2017-02-04 10:06:26;3000297
2017-12-14 21:56:36;3000298
2017-12-08 04:45:27;3000299
2017-04-04 00:56:16;3000300
2017-10-25 09:33:16;3000301
2017-02-02 00:34:46;3000302
2017-08-08 20:47:35;3000303
2017-07-24 10:13:56;3000304
2017-12-10 14:57:11;3000305
2017-10-10 06:08:14;3000306
2017-04-27 17:53:33;3000307
2017-08-25 23:05:38;3000308
2017-04-27 22:45:45;3000309
2017-12-19 20:44:12;3000310
2017-12-10 11:40:14;3000311
2017-09-30 05:45:10;3000312
2017-05-03 06:32:04;3000313
2017-01-15 11:09:59;3000314
2017-07-20 02:47:34;3000315
2017-08-07 23:50:34;3000316
2017-09-23 19:13:33;3000317
2017-12-28 12:03:44;3000318
2017-11-08 20:20:11;3000319
2017-01-05 05:17:52;3000320
2017-02-18 12:19:12;3000321
2017-08-02 16:25:15;3000322
2017-01-30 16:14:58;3000323
2017-02-16 13:33:09;3000324
2017-05-17 13:28:57;3000325
2017-02-01 16:22:58;3000326
2017-11-13 12:27:09;3000327
2017-01-22 19:52:23;3000328
2017-09-21 03:04:42;3000329
2017-06-09 14:16:44;3000330
2017-11-30 01:37:16;3000331
2017-02-10 04:51:24;3000332
2017-11-14 16:48:28;3000333
2017-06-29 09:37:47;3000334
2017-11-11 12:58:48;3000335
2017-04-15 21:45:10;3000336
2017-07-17 15:00:18;3000337
2017-01-15 10:21:22;3000338
2017-11-08 07:21:39;3000339
2017-02-01 02:36:57;3000340
2017-07-02 18:19:25;3000341
2017-06-29 11:03:40;3000342
2017-12-11 19:07:38;3000343
2017-05-25 01:30:34;3000344
2017-04-23 13:49:17;3000345
2017-09-30 01:17:43;3000346
2017-11-30 18:21:01;3000347
2017-11-01 03:43:01;3000348
2017-05-05 09:20:02;3000349
2017-03-06 21:01:17;3000350
2017-02-16 02:25:57;3000351
2017-08-24 02:50:51;3000352
2017-10-06 15:51:05;3000353
2017-06-03 04:13:10;3000354
2017-04-22 23:25:29;3000355
2017-11-28 19:52:57;3000356
2017-12-03 14:27:48;3000357
2017-02-22 19:23:52;3000358
2017-01-21 05:48:04;3000359
2017-01-15 03:57:51;3000360
2017-09-01 06:42:27;3000361
2017-10-05 08:26:46;3000362
2017-07-11 21:00:29;3000363
2017-08-04 20:05:15;3000364
2017-02-05 08:12:35;3000365
2017-03-20 14:47:18;3000366
2017-01-24 22:25:07;3000367
2017-02-11 01:37:24;3000368
2017-10-08 02:54:09;3000369
2017-06-04 01:30:11;3000370
2017-01-09 15:29:46;3000371
2017-10-08 22:51:08;3000372
2017-04-20 01:59:36;3000373
2017-12-03 00:35:58;3000374
2017-05-10 14:17:32;3000375
2017-04-25 16:32:23;3000376
2017-06-25 03:15:11;3000377
2017-12-05 04:50:18;3000378
2017-03-01 07:25:25;3000379
2017-12-09 19:59:39;3000380
2017-04-09 17:38:43;3000381
2017-09-24 16:35:10;3000382
2017-11-22 22:13:16;3000383
2017-12-31 07:55:00;3000384
2017-06-12 09:04:29;3000385
2017-09-01 21:31:22;3000386
2017-05-31 03:54:51;3000387
2017-08-28 17:45:24;3000388
2017-12-22 09:01:42;3000389
2017-02-22 12:27:07;3000390
2017-08-27 13:22:46;3000391
2017-10-31 16:34:59;3000392
2017-12-15 11:23:15;3000393
2017-08-21 10:37:23;3000394
2017-03-12 00:30:52;3000395
2017-01-06 19:41:11;3000396
2017-12-07 02:57:08;3000397
2017-08-28 13:49:28;3000398
2017-07-12 23:45:49;3000399
2017-06-01 02:00:00;3000400
2017-06-15 21:05:48;3000401
2017-11-27 09:40:44;3000402
2017-06-02 21:02:15;3000403
2017-10-07 17:38:34;3000404
2017-12-21 19:49:28;3000405
2017-02-11 15:48:33;3000406
2017-12-10 15:24:19;3000407
2017-07-06 06:07:40;3000408
2017-04-16 02:29:03;3000409
2017-05-25 02:25:22;3000410
2017-06-29 13:31:09;3000411
2017-11-26 02:29:01;3000412
2017-05-27 11:21:57;3000413
2017-03-07 18:50:59;3000414
2017-09-03 08:04:31;3000415
2017-10-20 15:08:05;3000416
2017-08-11 11:29:21;3000417
2017-03-30 10:44:51;3000418
2017-10-10 07:18:48;3000419
2017-06-12 15:38:10;3000420
2017-01-06 10:42:17;3000421
2017-10-27 08:12:46;3000422
2017-06-17 01:08:53;3000423
2017-01-23 09:48:33;3000424
2017-03-22 20:41:07;3000425
2017-01-16 03:43:17;3000426
2017-08-20 10:19:56;3000427
2017-09-28 16:18:36;3000428
2017-06-04 07:27:49;3000429
2017-05-12 22:54:12;3000430
2017-02-07 06:19:36;3000431
2017-08-02 17:17:53;3000432
2017-11-08 13:01:32;3000433
2017-07-01 03:30:38;3000434
2017-06-30 09:29:09;3000435
2017-08-30 22:10:21;3000436
2017-11-26 16:03:39;3000437
2017-12-28 14:07:29;3000438
2017-11-16 21:56:49;3000439
2017-01-15 02:52:49;3000440
2017-05-26 10:17:43;3000441
2017-03-05 15:36:50;3000442
2017-05-11 18:57:25;3000443
2017-07-23 18:03:07;3000444
2017-01-24 19:23:15;3000445
2017-02-25 02:12:00;3000446
2017-01-13 12:42:37;3000447
2017-12-22 17:45:32;3000448
2017-07-24 09:53:32;3000449
2017-02-05 02:57:29;3000450
2017-02-14 01:19:55;3000451
2017-03-24 03:01:19;3000452
2017-10-13 19:12:54;3000453
2017-06-02 20:26:46;3000454
2017-06-09 11:09:11;3000455
2017-06-25 05:20:03;3000456
2017-03-21 03:35:57;3000457
2017-02-11 17:56:07;3000458
2017-01-19 02:02:10;3000459
2017-06-23 18:14:18;3000460
2017-05-12 05:31:13;3000461
2017-10-14 20:24:42;3000462
2017-05-03 20:52:21;3000463
2017-02-16 18:16:24;3000464
2017-04-30 09:47:59;3000465
2017-08-07 15:08:05;3000466
2017-12-18 22:35:18;3000467
2017-03-27 02:42:35;3000468
2017-12-10 18:27:25;3000469
2017-05-14 04:50:08;3000470
2017-10-22 04:05:47;3000471
2017-03-03 17:26:33;3000472
2017-03-13 00:59:18;3000473
2017-01-04 23:40:15;3000474
2017-03-20 12:57:34;3000475
2017-05-15 01:18:21;3000476
2017-06-23 15:21:08;3000477
2017-10-19 18:43:25;3000478
2017-11-20 04:10:18;3000479
2017-05-19 23:11:46;3000480
2017-01-30 00:15:18;3000481
2017-02-25 05:55:01;3000482
2017-09-14 17:59:09;3000483
2017-08-01 23:32:32;3000484
2017-09-20 06:09:08;3000485
2017-08-22 23:01:47;3000486
2017-12-24 19:28:27;3000487
2017-05-26 10:18:24;3000488
2017-04-26 16:26:01;3000489
2017-01-03 16:39:11;3000490
2017-02-22 15:56:35;3000491
2017-06-09 06:35:00;3000492
2017-06-10 05:10:18;3000493
2017-10-06 20:42:40;3000494
2017-08-25 13:45:26;3000495
2017-09-13 18:34:04;3000496
2017-06-09 09:39:16;3000497
2017-07-11 07:37:28;3000498
2017-04-29 19:33:11;3000499
2017-05-19 06:43:32;3000500
2017-10-07 10:08:06;3000501
2017-12-03 15:16:29;3000502
2017-01-07 01:52:02;3000503
2017-02-07 02:32:29;3000504
2017-11-09 09:00:12;3000505
2017-01-23 21:19:50;3000506
2017-08-23 11:16:24;3000507
2017-02-11 20:40:20;3000508
2017-11-08 04:05:51;3000509
2017-08-11 10:41:16;3000510
2017-09-10 06:18:09;3000511
2017-04-12 21:52:19;3000512
2017-04-29 15:33:57;3000513
2017-03-01 04:30:47;3000514
2017-03-25 11:57:42;3000515
2017-11-12 12:17:56;3000516
2017-02-24 00:18:47;3000517
2017-11-17 02:39:33;3000518
2017-01-07 09:28:33;3000519
2017-10-04 03:40:08;3000520
2017-12-28 09:50:07;3000521
2017-03-12 18:36:04;3000522
2017-01-15 03:35:07;3000523
2017-05-31 20:04:52;3000524
2017-01-03 14:08:30;3000525
2017-08-19 05:20:19;3000526
2017-07-01 16:50:47;3000527
2017-06-25 00:45:19;3000528
2017-01-22 20:48:01;3000529
2017-08-04 03:43:56;3000530
2017-09-20 03:44:16;3000531
2017-04-26 13:00:09;3000532
2017-07-22 10:18:26;3000533
2017-11-13 13:43:22;3000534
2017-05-04 21:42:42;3000535
2017-08-22 16:21:02;3000536
2017-11-26 03:38:03;3000537
2017-07-27 05:31:22;3000538
2017-05-16 03:34:38;3000539
2017-03-31 12:51:02;3000540
2017-12-14 20:18:21;3000541
2017-04-08 07:27:46;3000542
2017-03-21 02:58:11;3000543
2017-11-15 02:46:31;3000544
2017-04-18 18:53:17;3000545
2017-01-14 19:27:10;3000546
2017-09-26 13:01:46;3000547
2017-01-25 20:46:40;3000548
2017-08-03 20:59:05;3000549
2017-08-22 02:29:29;3000550
2017-08-29 05:01:48;3000551
2017-12-01 04:46:23;3000552
2017-10-19 08:06:48;3000553
2017-06-09 09:02:37;3000554
2017-11-02 20:43:18;3000555
2017-10-16 08:08:57;3000556
2017-08-13 15:18:08;3000557
2017-03-14 08:16:30;3000558
2017-02-25 12:07:43;3000559
2017-06-10 19:13:21;3000560
2017-12-18 01:59:41;3000561
2017-05-30 06:01:37;3000562
2017-12-12 09:41:02;3000563
2017-07-12 11:33:17;3000564
2017-05-28 19:04:15;3000565
2017-02-08 16:09:59;3000566
2017-11-07 02:13:41;3000567
2017-10-13 01:22:19;3000568
2017-11-23 09:36:36;3000569
2017-12-17 22:39:58;3000570
2017-07-03 19:09:57;3000571
2017-07-07 08:11:06;3000572
2017-11-04 12:43:34;3000573
2017-03-05 17:24:36;3000574
2017-04-06 22:05:55;3000575
2017-01-30 00:14:46;3000576
2017-01-23 22:01:49;3000577
2017-10-08 04:51:24;3000578
2017-06-13 14:33:46;3000579
2017-08-14 11:13:09;3000580
2017-03-06 19:44:34;3000581
2017-10-12 13:37:58;3000582
2017-03-24 01:43:31;3000583
2017-10-17 09:10:37;3000584
2017-04-30 03:40:42;3000585
2017-10-19 16:28:15;3000586
2017-01-13 12:00:48;3000587
2017-09-21 06:22:14;3000588
2017-02-18 09:34:23;3000589
2017-12-20 00:29:57;3000590
2017-01-29 23:57:18;3000591
2017-12-25 07:12:19;3000592
2017-08-25 07:06:56;3000593
2017-12-26 14:58:24;3000594
2017-08-23 04:07:31;3000595
2017-05-14 23:25:05;3000596
2017-05-31 09:22:33;3000597
2017-12-06 19:01:45;3000598
2017-11-25 02:31:33;3000599
2017-12-01 12:13:34;3000600
2017-08-07 01:44:12;3000601
2017-07-06 14:01:44;3000602
2017-12-12 20:00:46;3000603
2017-02-06 18:35:21;3000604
2017-09-21 13:35:32;3000605
2017-12-28 17:31:57;3000606
2017-06-05 00:00:51;3000607
2017-07-02 08:31:06;3000608
2017-03-19 01:20:30;3000609
2017-11-29 07:01:01;3000610
2017-10-10 18:46:32;3000611
2017-07-24 03:41:25;3000612
2017-07-06 14:04:09;3000613
2017-05-17 05:13:26;3000614
2017-07-31 10:42:56;3000615
2017-09-10 11:40:58;3000616
2017-09-22 04:08:01;3000617
2017-03-14 21:48:26;3000618
2017-07-21 10:12:37;3000619
2017-11-01 21:43:56;3000620
2017-04-28 21:29:06;3000621
2017-07-31 05:12:44;3000622
2017-11-28 23:24:42;3000623
2017-12-27 15:56:09;3000624
2017-10-26 18:36:04;3000625
2017-06-08 20:00:08;3000626
2017-09-04 11:51:15;3000627
2017-03-19 13:04:26;3000628
2017-03-03 03:23:05;3000629
2017-06-13 10:22:21;3000630
2017-08-09 16:18:05;3000631
2017-08-23 06:36:11;3000632
2017-03-06 02:40:10;3000633
2017-01-27 15:21:08;3000634
2017-11-11 07:30:48;3000635
2017-12-05 18:24:06;3000636
2017-12-18 23:02:36;3000637
2017-10-19 03:35:04;3000638
2017-08-04 08:21:25;3000639
2017-10-31 21:54:54;3000640
2017-08-28 16:45:42;3000641
2017-08-10 21:00:25;3000642
2017-04-09 03:57:13;3000643
2017-09-27 22:00:23;3000644
2017-10-28 17:12:50;3000645
2017-06-19 18:06:20;3000646
2017-01-06 02:57:05;3000647
2017-12-05 00:04:46;3000648
2017-10-04 15:03:02;3000649
2017-08-25 00:26:49;3000650
2017-04-07 19:53:39;3000651
2017-01-13 04:39:21;3000652
2017-05-07 14:01:46;3000653
2017-11-19 09:22:26;3000654
2017-07-16 06:43:26;3000655
2017-12-06 23:59:08;3000656
2017-07-18 06:46:58;3000657
2017-07-22 04:58:41;3000658
2017-05-10 20:05:21;3000659
2017-08-24 16:02:53;3000660
2017-07-23 06:15:53;3000661
2017-05-02 09:24:12;3000662
2017-03-11 04:50:28;3000663
2017-03-06 15:21:14;3000664
2017-07-24 02:35:33;3000665
2017-01-08 05:58:22;3000666
2017-03-08 16:02:48;3000667
2017-12-14 03:45:25;3000668
2017-10-05 09:51:28;3000669
2017-03-28 18:37:17;3000670
2017-10-07 17:13:20;3000671
2017-05-20 20:05:56;3000672
2017-11-22 03:32:03;3000673
2017-09-16 14:54:14;3000674
2017-08-29 17:19:26;3000675
2017-12-18 19:28:32;3000676
2017-01-05 06:00:17;3000677
2017-05-24 11:37:17;3000678
2017-03-29 05:18:47;3000679
2017-08-23 07:25:15;3000680
2017-07-25 16:20:20;3000681
2017-09-06 00:49:33;3000682
2017-10-18 19:26:46;3000683
2017-11-13 03:51:50;3000684
2017-10-18 18:17:02;3000685
2017-07-15 13:38:31;3000686
2017-07-09 18:33:33;3000687
2017-05-16 02:10:31;3000688
2017-08-27 16:32:07;3000689
2017-09-30 17:55:08;3000690
2017-10-21 23:13:45;3000691
2017-05-26 01:04:42;3000692
2017-05-22 02:34:49;3000693
2017-07-30 14:49:59;3000694
2017-04-13 20:30:12;3000695
2017-11-02 10:24:35;3000696
2017-10-21 07:05:31;3000697
2017-12-12 10:43:24;3000698
2017-12-05 10:11:16;3000699
2017-07-16 20:06:31;3000700
2017-06-27 20:08:26;3000701
2017-10-12 00:35:58;3000702
2017-01-15 22:13:13;3000703
2017-08-22 03:08:40;3000704
2017-09-10 17:55:59;3000705
2017-06-17 16:47:15;3000706
2017-11-17 19:49:31;3000707
2017-05-24 23:54:52;3000708
2017-06-21 05:06:18;3000709
2017-01-26 04:52:56;3000710
2017-04-18 15:14:05;3000711
2017-12-14 12:02:01;3000712
2017-06-07 05:55:15;3000713
2017-12-06 10:45:35;3000714
2017-04-03 22:37:04;3000715
2017-08-07 15:43:41;3000716
2017-12-07 15:08:42;3000717
2017-08-09 21:01:04;3000718
2017-09-19 17:57:34;3000719
2017-02-05 21:18:20;3000720
2017-02-08 10:53:40;3000721
2017-02-28 19:58:15;3000722
2017-05-31 00:41:47;3000723
2017-06-19 01:50:48;3000724
2017-05-12 18:54:54;3000725
2017-02-07 07:02:10;3000726
2017-04-11 06:34:03;3000727
2017-12-27 16:39:50;3000728
2017-10-05 04:24:08;3000729
2017-05-15 06:54:35;3000730
2017-03-20 18:58:09;3000731
2017-09-28 03:07:26;3000732
2017-06-09 08:17:55;3000733
2017-09-15 01:31:09;3000734
2017-05-14 08:39:11;3000735
2017-11-12 10:29:29;3000736
2017-09-19 13:28:41;3000737
2017-08-23 16:30:57;3000738
2017-03-06 01:39:43;3000739
2017-04-10 10:09:30;3000740
2017-12-04 23:14:12;3000741
2017-02-16 19:26:59;3000742
2017-01-26 02:51:54;3000743
2017-06-29 09:14:09;3000744
2017-08-16 12:58:13;3000745
2017-02-18 21:42:28;3000746
2017-06-24 04:49:12;3000747
2017-02-23 07:17:45;3000748
2017-12-27 14:48:22;3000749
2017-12-27 01:10:04;3000750
2017-07-30 17:30:58;3000751
2017-04-14 21:54:35;3000752
2017-01-16 20:35:11;3000753
2017-08-02 09:28:04;3000754
2017-03-23 07:44:43;3000755
2017-05-16 12:35:21;3000756
2017-09-04 21:00:44;3000757
2017-08-14 14:03:35;3000758
2017-07-29 08:36:07;3000759
2017-10-11 00:37:24;3000760
2017-08-23 23:57:23;3000761
2017-07-13 11:07:32;3000762
2017-05-17 00:32:23;3000763
2017-10-19 22:17:32;3000764
2017-07-10 05:22:21;3000765
2017-12-18 21:46:18;3000766
2017-09-10 01:00:21;3000767
2017-03-30 14:17:02;3000768
2017-06-30 15:31:26;3000769
2017-05-11 03:48:14;3000770
2017-12-14 01:34:13;3000771
2017-07-03 20:47:15;3000772
2017-12-09 12:07:22;3000773
2017-01-30 16:12:18;3000774
2017-02-14 20:45:33;3000775
2017-02-10 23:34:14;3000776
2017-07-29 18:43:39;3000777
2017-11-24 19:42:47;3000778
2017-09-20 18:16:39;3000779
2017-04-06 05:20:53;3000780
2017-11-19 06:11:20;3000781
2017-07-25 11:34:39;3000782
2017-11-23 16:40:11;3000783
2017-06-16 10:10:19;3000784
2017-08-01 04:11:39;3000785
2017-08-13 15:24:06;3000786
2017-11-09 22:25:58;3000787
2017-10-31 14:14:56;3000788
2017-01-05 08:20:57;3000789
2017-04-12 23:44:25;3000790
2017-05-16 11:31:13;3000791
2017-06-11 08:56:13;3000792
2017-12-06 01:07:49;3000793
2017-12-02 19:14:28;3000794
2017-09-14 13:22:22;3000795
2017-10-15 18:35:04;3000796
2017-10-12 12:57:31;3000797
2017-09-27 13:41:35;3000798
2017-12-08 03:39:46;3000799
2017-12-02 11:57:44;3000800
2017-09-25 02:49:48;3000801
2017-05-24 10:21:20;3000802
2017-02-08 07:57:24;3000803
2017-07-06 03:57:19;3000804
2017-04-22 18:14:19;3000805
2017-05-03 14:56:25;3000806
2017-02-10 23:02:42;3000807
2017-03-25 02:27:27;3000808
2017-12-05 08:49:52;3000809
2017-07-23 06:51:29;3000810
2017-05-25 11:20:09;3000811
2017-01-19 22:34:32;3000812
2017-09-10 15:19:45;3000813
2017-11-05 22:14:59;3000814
2017-05-24 08:10:24;3000815
2017-05-14 07:17:19;3000816
2017-06-28 07:59:47;3000817
2017-11-14 14:17:34;3000818
2017-09-01 02:31:56;3000819
2017-09-14 12:30:23;3000820
2017-01-18 06:43:44;3000821
2017-02-14 06:47:11;3000822
2017-09-30 03:04:22;3000823
2017-08-26 18:31:43;3000824
2017-04-16 05:22:45;3000825
2017-12-03 23:00:12;3000826
2017-01-05 07:14:32;3000827
2017-11-05 20:37:13;3000828
2017-05-17 13:58:05;3000829
2017-06-22 14:04:08;3000830
2017-03-06 11:30:14;3000831
2017-04-15 02:50:40;3000832
2017-01-17 06:20:00;3000833
2017-01-15 02:46:24;3000834
2017-10-18 02:56:09;3000835
2017-02-03 18:12:43;3000836
2017-04-28 12:26:33;3000837
2017-01-07 05:46:27;3000838
2017-09-10 11:27:22;3000839
2017-12-17 19:51:00;3000840
2017-11-22 12:51:30;3000841
2017-03-06 01:34:41;3000842
2017-07-29 23:35:32;3000843
2017-06-03 21:56:01;3000844
2017-08-04 06:35:33;3000845
2017-03-14 23:56:18;3000846
2017-04-05 01:52:55;3000847
2017-11-16 01:46:55;3000848
2017-12-05 15:02:05;3000849
2017-10-22 02:55:34;3000850
2017-04-28 04:55:55;3000851
2017-02-05 03:32:15;3000852
2017-02-12 22:25:26;3000853
2017-07-16 16:19:45;3000854
2017-07-07 09:27:31;3000855
2017-03-02 23:23:56;3000856
2017-07-29 17:22:48;3000857
2017-05-13 13:27:23;3000858
2017-07-08 07:47:31;3000859
2017-11-12 03:03:27;3000860
2017-01-23 02:58:52;3000861
2017-05-15 03:58:38;3000862
2017-09-07 10:00:21;3000863
2017-06-19 23:30:08;3000864
2017-07-24 10:19:03;3000865
2017-08-22 05:46:44;3000866
2017-12-17 16:51:15;3000867
2017-06-01 22:16:22;3000868
2017-11-03 22:57:40;3000869
2017-05-01 15:51:20;3000870
2017-04-30 04:19:30;3000871
2017-02-21 11:12:23;3000872
2017-08-10 06:46:47;3000873
2017-05-11 23:43:29;3000874
2017-11-06 18:52:53;3000875
2017-12-13 13:41:20;3000876
2017-03-10 08:39:21;3000877
2017-03-19 22:26:00;3000878
2017-04-30 16:04:40;3000879
2017-04-21 13:42:22;3000880
2017-12-30 09:46:13;3000881
2017-12-29 10:24:16;3000882
2017-01-17 13:16:24;3000883
2017-07-15 22:20:30;3000884
2017-04-14 23:22:12;3000885
2017-05-29 00:18:21;3000886
2017-10-25 05:48:22;3000887
2017-12-14 20:52:05;3000888
2017-09-11 02:11:41;3000889
2017-11-12 05:36:52;3000890
2017-07-09 02:38:56;3000891
2017-12-31 20:56:17;3000892
2017-10-03 05:42:21;3000893
2017-04-08 10:42:33;3000894
2017-09-16 17:40:37;3000895
2017-08-29 13:42:32;3000896
2017-04-22 20:22:54;3000897
2017-05-06 11:33:06;3000898
2017-03-13 10:49:31;3000899
2017-01-31 22:51:04;3000900
2017-09-26 01:43:52;3000901
2017-11-30 10:37:59;3000902
2017-12-26 11:24:08;3000903
2017-01-10 20:10:28;3000904
2017-11-27 03:54:38;3000905
2017-01-31 02:19:44;3000906
2017-11-28 09:42:55;3000907
2017-02-16 08:34:41;3000908
2017-01-30 09:28:50;3000909
2017-10-15 11:09:04;3000910
2017-11-30 12:02:37;3000911
2017-08-19 18:52:53;3000912
2017-03-05 20:12:22;3000913
2017-01-12 06:37:02;3000914
2017-03-26 15:26:35;3000915
2017-12-03 15:00:15;3000916
2017-04-05 08:16:41;3000917
2017-11-16 00:14:38;3000918
2017-09-04 16:15:47;3000919
2017-07-27 15:52:11;3000920
2017-09-01 11:31:11;3000921
2017-07-03 21:19:05;3000922
2017-02-27 14:32:51;3000923
2017-08-22 23:53:29;3000924
2017-10-13 20:54:02;3000925
2017-03-14 08:54:11;3000926
2017-05-31 15:55:50;3000927
2017-08-06 14:24:35;3000928
2017-12-26 05:51:01;3000929
2017-09-10 07:56:34;3000930
2017-12-24 19:08:05;3000931
2017-03-17 22:21:33;3000932
2017-07-11 05:08:01;3000933
2017-03-30 18:39:45;3000934
2017-01-26 09:22:39;3000935
2017-07-27 07:39:24;3000936
2017-08-04 13:24:44;3000937
2017-02-01 09:26:23;3000938
2017-10-22 18:58:59;3000939
2017-10-11 16:21:07;3000940
2017-10-15 16:27:40;3000941
2017-10-16 06:39:49;3000942
2017-04-08 08:40:20;3000943
2017-07-08 04:45:40;3000944
2017-04-19 04:34:35;3000945
2017-11-24 21:13:40;3000946
2017-09-07 18:16:41;3000947
2017-06-22 19:47:49;3000948
2017-05-25 10:10:45;3000949
2017-03-29 06:05:35;3000950
2017-10-22 07:16:55;3000951
2017-09-02 18:12:59;3000952
2017-08-19 20:06:20;3000953
2017-05-15 08:16:55;3000954
2017-10-16 06:22:51;3000955
2017-02-02 17:45:19;3000956
2017-10-27 20:55:11;3000957
2017-08-01 17:15:52;3000958
2017-08-12 00:39:39;3000959
2017-10-17 13:23:03;3000960
2017-10-17 18:17:55;3000961
2017-07-17 13:27:11;3000962
2017-03-20 08:02:02;3000963
2017-01-13 02:48:07;3000964
2017-10-11 17:33:35;3000965
2017-09-26 00:00:22;3000966
2017-12-08 04:09:10;3000967
2017-03-16 08:35:15;3000968
2017-11-18 17:40:55;3000969
2017-09-01 09:18:54;3000970
2017-11-08 16:54:00;3000971
2017-08-31 03:27:53;3000972
2017-02-16 06:00:01;3000973
2017-04-20 05:30:12;3000974
2017-07-13 18:59:42;3000975
2017-06-12 20:02:51;3000976
2017-05-05 08:14:41;3000977
2017-08-07 08:36:42;3000978
2017-06-20 14:54:41;3000979
2017-06-14 01:22:47;3000980
2017-04-22 13:22:18;3000981
2017-03-31 11:28:00;3000982
2017-06-18 11:57:47;3000983
2017-09-19 16:04:49;3000984
2017-06-27 06:00:40;3000985
2017-03-30 19:23:44;3000986
2017-06-06 01:49:03;3000987
2017-09-01 21:04:30;3000988
2017-05-27 11:47:48;3000989
2017-09-17 08:52:59;3000990
2017-03-07 20:37:27;3000991
2017-01-20 08:21:03;3000992
2017-10-20 12:03:25;3000993
2017-02-15 06:45:47;3000994
2017-10-20 21:10:22;3000995
2017-10-12 00:39:39;3000996
2017-06-04 11:14:43;3000997
2017-03-09 05:46:36;3000998
2017-06-11 07:07:03;3000999
2017-11-08 04:17:49;3001000
