57865910;1;2000001;0
72266069;1;2000002;1
howardmargaret@adams.com;9;2000003;2
36499843;5;2000004;3
10804690;3;2000005;4
83591584;1;2000006;5
20069899;5;2000007;6
42295901;3;2000008;7
39733177;4;2000009;8
20249582;5;2000010;9
Jennifer.Acosta;8;2000011;10
53422395;1;2000012;11
41673993;4;2000013;12
Daniel.Diaz;7;2000014;13
26397914;2;2000015;14
ogarcia@hotmail.com;9;2000016;15
87778362;1;2000017;16
30925902;2;2000018;17
90058241;1;2000019;18
63033711;5;2000020;19
59275147;2;2000021;20
68436033;4;2000022;21
Michael.Watkins;6;2000023;22
Renee.Lewis;7;2000024;23
katelynhenderson@gmail.com;9;2000025;24
xfox@rogers.com;9;2000026;25
Adrian.Nelson;6;2000027;26
Kim.Bailey;8;2000028;27
jhill@gray.com;9;2000029;28
cturner@hotmail.com;9;2000030;29
Lauren.Roy;6;2000031;30
52912993;3;2000032;31
Jason.Gonzalez;7;2000033;32
65409286;3;2000034;33
68982914;1;2000035;34
Brittany.Allen;8;2000036;35
Heather.Johnson;6;2000037;36
29412334;5;2000038;37
Sandra.Bass;8;2000039;38
96179860;3;2000040;39
Katherine.Lowery;7;2000041;40
53006301;3;2000042;41
57305596;4;2000043;42
98931596;1;2000044;43
76187315;2;2000045;44
Vicki.Patterson;7;2000046;45
91076296;3;2000047;46
89948264;2;2000048;47
romerojennifer@yahoo.com;9;2000049;48
49060810;2;2000050;49
49312512;1;2000051;50
39227921;1;2000052;51
Brian.Miller;8;2000053;52
40160706;1;2000054;53
Stephanie.Berry;6;2000055;54
waltersamanda@jones-lawrence.info;9;2000056;55
Claudia.Hart;6;2000057;56
64479524;4;2000058;57
11578342;1;2000059;58
Jeremy.Sharp;8;2000060;59
41273868;3;2000061;60
79967959;2;2000062;61
65591848;4;2000063;62
crawfordkenneth@griffin.com;9;2000064;63
99940803;3;2000065;64
Ruben.Swanson;8;2000066;65
62405727;4;2000067;66
75831169;1;2000068;67
williamrangel@white.info;9;2000069;68
John.Willis;8;2000070;69
ibrooks@simon-hayes.com;9;2000071;70
82340564;2;2000072;71
89320211;3;2000073;72
Elizabeth.Michael;8;2000074;73
76726091;3;2000075;74
Lisa.Diaz;7;2000076;75
Dustin.Johnson;7;2000077;76
Jasmine.Douglas;8;2000078;77
19074451;3;2000079;78
Steven.Herrera;7;2000080;79
Brian.Perez;7;2000081;80
64950727;3;2000082;81
nicholasowens@abbott.biz;9;2000083;82
71833974;2;2000084;83
85327810;1;2000085;84
William.Turner;6;2000086;85
87274558;3;2000087;86
48543801;4;2000088;87
41002547;1;2000089;88
20437048;5;2000090;89
26392960;1;2000091;90
Michelle.Russell;8;2000092;91
Meagan.Joseph;7;2000093;92
53439021;1;2000094;93
84490403;1;2000095;94
melissastewart@gmail.com;9;2000096;95
Seth.Peterson;8;2000097;96
50999863;4;2000098;97
95836609;1;2000099;98
Erica.Leach;7;2000100;99
83423580;1;2000101;100
94192932;2;2000102;101
Robert.Wheeler;6;2000103;102
37852885;3;2000104;103
23156956;5;2000105;104
jacobchavez@gmail.com;9;2000106;105
45987061;3;2000107;106
aclark@gmail.com;9;2000108;107
97739912;1;2000109;108
57366830;4;2000110;109
Karen.Davis;8;2000111;110
23846634;4;2000112;111
88421055;5;2000113;112
Susan.Romero;8;2000114;113
Edward.Martin;6;2000115;114
bstewart@gonzalez-davis.biz;9;2000116;115
23416373;3;2000117;116
91886258;2;2000118;117
Christopher.Weaver;7;2000119;118
Austin.Howard;8;2000120;119
68414366;1;2000121;120
99901368;2;2000122;121
29422933;5;2000123;122
70733792;3;2000124;123
John.Smith;7;2000125;124
Jill.Wood;7;2000126;125
Stephanie.Williams;7;2000127;126
48558708;1;2000128;127
98366418;5;2000129;128
Julie.Stephenson;7;2000130;129
40780658;5;2000131;130
Phillip.Miranda;6;2000132;131
38768426;3;2000133;132
31742559;1;2000134;133
62622606;4;2000135;134
36912243;5;2000136;135
65821874;5;2000137;136
misty08@yahoo.com;9;2000138;137
Mr..Evan.Phillips;8;2000139;138
85440566;1;2000140;139
34473079;1;2000141;140
77368263;2;2000142;141
38341190;4;2000143;142
61688175;3;2000144;143
62055722;2;2000145;144
patricia71@hotmail.com;9;2000146;145
94699867;4;2000147;146
Kristin.Sparks;6;2000148;147
robinsonkaren@shields.biz;9;2000149;148
62507963;4;2000150;149
millermiranda@gmail.com;9;2000151;150
79289314;2;2000152;151
James.Hensley;7;2000153;152
21059486;1;2000154;153
Lisa.Marshall;6;2000155;154
42627379;4;2000156;155
Dr..Meagan.Alvarez.DVM;8;2000157;156
Rebecca.Navarro;8;2000158;157
50190338;1;2000159;158
16053540;1;2000160;159
87467408;2;2000161;160
Patricia.Mays;6;2000162;161
Robin.Brown;8;2000163;162
mferrell@yahoo.com;9;2000164;163
Cassandra.Jefferson;7;2000165;164
28094640;3;2000166;165
Lisa.Spencer;7;2000167;166
Jerry.Murillo;6;2000168;167
Jodi.Hamilton;8;2000169;168
26481069;5;2000170;169
Samantha.Bass;6;2000171;170
Stephanie.Gonzalez;8;2000172;171
Jill.Kennedy;7;2000173;172
Scott.Nicholson;6;2000174;173
73497815;2;2000175;174
Paula.Armstrong.MD;7;2000176;175
59968427;1;2000177;176
ssherman@barker-fowler.com;9;2000178;177
60166747;4;2000179;178
Melody.Williams;7;2000180;179
Rhonda.Le;8;2000181;180
60834963;3;2000182;181
50111836;3;2000183;182
Danielle.Wilson;8;2000184;183
Tina.Lopez;8;2000185;184
Tyler.Horne;8;2000186;185
Patrick.Fuller;7;2000187;186
82188400;1;2000188;187
68349461;3;2000189;188
46091448;3;2000190;189
Charlotte.Pruitt;7;2000191;190
14880085;1;2000192;191
51584607;5;2000193;192
90391727;5;2000194;193
Kathy.Ball;7;2000195;194
Jermaine.Collins;7;2000196;195
57355020;4;2000197;196
76066123;2;2000198;197
27408465;2;2000199;198
16159402;2;2000200;199
Thomas.Young;7;2000201;200
Jeffrey.Whitaker;8;2000202;201
22748812;4;2000203;202
16357026;3;2000204;203
33351088;2;2000205;204
Tonya.Gordon;6;2000206;205
Christina.Bell;8;2000207;206
65657485;5;2000208;207
35054090;1;2000209;208
27014574;4;2000210;209
23607190;4;2000211;210
Logan.Mckenzie;8;2000212;211
gedwards@krause-tucker.com;9;2000213;212
68993292;3;2000214;213
38187421;1;2000215;214
43690018;4;2000216;215
matthew23@gmail.com;9;2000217;216
79634389;3;2000218;217
Dylan.Willis;6;2000219;218
Mr..Gary.Morales;8;2000220;219
89474684;4;2000221;220
louismccoy@hotmail.com;9;2000222;221
Steve.Ortiz;8;2000223;222
36133080;2;2000224;223
pamela39@holloway.biz;9;2000225;224
37370366;1;2000226;225
14287773;5;2000227;226
Mrs..Molly.Oconnell;8;2000228;227
Brett.Mcmahon;6;2000229;228
74084272;3;2000230;229
84880718;2;2000231;230
Victoria.Lewis;7;2000232;231
33874904;2;2000233;232
35922315;3;2000234;233
David.Dawson;6;2000235;234
89028340;4;2000236;235
91495742;4;2000237;236
David.Pearson;7;2000238;237
57701264;5;2000239;238
Hunter.Morgan;6;2000240;239
50411039;5;2000241;240
20665195;5;2000242;241
Mark.Rush;7;2000243;242
Joann.Harrington;8;2000244;243
24838201;3;2000245;244
59881703;5;2000246;245
29545885;3;2000247;246
Brian.Campbell;7;2000248;247
Valerie.Mcguire;6;2000249;248
27431695;3;2000250;249
93302296;4;2000251;250
10870439;1;2000252;251
95089347;2;2000253;252
26684474;2;2000254;253
25269647;4;2000255;254
Edward.Walker;6;2000256;255
18715642;2;2000257;256
11139112;3;2000258;257
Matthew.Benton;8;2000259;258
80427823;2;2000260;259
scott69@hotmail.com;9;2000261;260
89513551;3;2000262;261
Kathleen.Campbell;6;2000263;262
31609576;2;2000264;263
justin84@gmail.com;9;2000265;264
43346474;1;2000266;265
Ashley.Garza;6;2000267;266
silvavanessa@foley.biz;9;2000268;267
Glenda.Howell.PhD;7;2000269;268
32970579;3;2000270;269
46622897;3;2000271;270
52150012;5;2000272;271
61260100;5;2000273;272
94047171;2;2000274;273
16105263;3;2000275;274
89561970;1;2000276;275
79156264;2;2000277;276
Tamara.Moore;6;2000278;277
Kyle.Wood;7;2000279;278
15789081;2;2000280;279
87192366;5;2000281;280
44319212;3;2000282;281
81426453;1;2000283;282
Brian.Mitchell;8;2000284;283
14031950;1;2000285;284
Darius.Green;6;2000286;285
35700123;3;2000287;286
Travis.Patel;8;2000288;287
87015011;4;2000289;288
92142096;4;2000290;289
Erica.Roman;6;2000291;290
98276000;3;2000292;291
61618975;2;2000293;292
Walter.Salas;6;2000294;293
Randall.Scott;6;2000295;294
Sonia.Henry;6;2000296;295
23382437;4;2000297;296
currykristen@gmail.com;9;2000298;297
Kelli.Villarreal;8;2000299;298
44714359;2;2000300;299
David.Sanchez;8;2000301;300
87397360;1;2000302;301
27274488;4;2000303;302
Michelle.Contreras;7;2000304;303
Lori.Smith;8;2000305;304
66733590;5;2000306;305
68040678;3;2000307;306
gsmith@yahoo.com;9;2000308;307
74645200;2;2000309;308
terri93@powers.biz;9;2000310;309
John.Anderson;6;2000311;310
57398410;1;2000312;311
Lisa.Guerrero;8;2000313;312
Justin.Rodriguez;6;2000314;313
46374360;5;2000315;314
idavila@gmail.com;9;2000316;315
70765686;1;2000317;316
21798117;3;2000318;317
ylandry@barton-ritter.com;9;2000319;318
Brianna.Bennett;7;2000320;319
94166458;4;2000321;320
Michael.Kemp;7;2000322;321
46845538;4;2000323;322
77890162;4;2000324;323
Kevin.Sweeney;8;2000325;324
Deborah.Smith;7;2000326;325
11947226;5;2000327;326
21471045;4;2000328;327
Travis.Davis;7;2000329;328
21840756;4;2000330;329
61957000;3;2000331;330
Thomas.Cross;7;2000332;331
David.Jennings;8;2000333;332
keithadams@yahoo.com;9;2000334;333
38632230;5;2000335;334
Tiffany.Hubbard;7;2000336;335
56549418;4;2000337;336
39404280;3;2000338;337
49547353;2;2000339;338
holmesjoy@burton.com;9;2000340;339
Stacey.Sexton;8;2000341;340
53383133;3;2000342;341
Matthew.Boyd.Jr.;7;2000343;342
69253874;1;2000344;343
Jennifer.Norton;8;2000345;344
87505589;4;2000346;345
Gary.Glenn;8;2000347;346
Charles.Smith;7;2000348;347
95264185;3;2000349;348
Wendy.Le;6;2000350;349
43480903;5;2000351;350
Ashley.Williamson;7;2000352;351
70603862;2;2000353;352
87019595;3;2000354;353
Matthew.Ho;7;2000355;354
77453105;3;2000356;355
Marcus.Shannon;8;2000357;356
66574254;3;2000358;357
55945076;1;2000359;358
44386968;5;2000360;359
99038098;5;2000361;360
murphykristie@gibson-wilson.com;9;2000362;361
45773318;5;2000363;362
79546708;5;2000364;363
70520575;2;2000365;364
Anne.Butler.DDS;7;2000366;365
80135698;5;2000367;366
Glenn.Anthony;8;2000368;367
40873883;2;2000369;368
47503450;3;2000370;369
Carl.Jennings;6;2000371;370
98351339;5;2000372;371
Daniel.Obrien;7;2000373;372
28069636;1;2000374;373
14342451;4;2000375;374
78822909;1;2000376;375
73370141;2;2000377;376
84876574;3;2000378;377
Dustin.Edwards;8;2000379;378
Jimmy.Carpenter;7;2000380;379
Michele.Rogers;6;2000381;380
Steven.Perry;7;2000382;381
Lisa.Hernandez;6;2000383;382
Matthew.Bowers;8;2000384;383
Robert.Little;8;2000385;384
Daniel.Owen;6;2000386;385
tpage@marshall-romero.com;9;2000387;386
62239490;4;2000388;387
Darrell.Owens;7;2000389;388
98185383;3;2000390;389
harriswilliam@bell.org;9;2000391;390
64709101;2;2000392;391
41756465;5;2000393;392
61694316;4;2000394;393
52153782;2;2000395;394
thunt@yahoo.com;9;2000396;395
29373010;5;2000397;396
31578917;2;2000398;397
Holly.Landry;7;2000399;398
63972680;5;2000400;399
57950214;4;2000401;400
44619438;5;2000402;401
Joanna.Newman;7;2000403;402
53889802;5;2000404;403
87587553;3;2000405;404
28673641;1;2000406;405
46603474;3;2000407;406
29728733;1;2000408;407
92195600;2;2000409;408
76318770;2;2000410;409
Katherine.Gordon;8;2000411;410
63864855;4;2000412;411
57917893;1;2000413;412
steinbeverly@hotmail.com;9;2000414;413
Logan.Jones;6;2000415;414
James.Flowers;6;2000416;415
Gregory.Freeman;6;2000417;416
59630744;2;2000418;417
nicholassantos@yahoo.com;9;2000419;418
ocook@yahoo.com;9;2000420;419
58485578;3;2000421;420
20747911;4;2000422;421
31417367;5;2000423;422
garypope@lang.com;9;2000424;423
98437389;4;2000425;424
Kristin.Mason;6;2000426;425
Catherine.Smith;8;2000427;426
Timothy.Mejia;8;2000428;427
hooperlinda@gmail.com;9;2000429;428
72104880;5;2000430;429
Brian.Flores;7;2000431;430
Henry.Williams;6;2000432;431
hinesfrancisco@yahoo.com;9;2000433;432
adriangreene@wagner-rollins.biz;9;2000434;433
Mark.Gentry;6;2000435;434
Maria.Williams;6;2000436;435
20339357;5;2000437;436
50390300;4;2000438;437
aoconnell@mitchell-stone.com;9;2000439;438
richardsjoshua@hotmail.com;9;2000440;439
95770617;2;2000441;440
Jason.Smith;6;2000442;441
79795941;1;2000443;442
Heather.Mitchell;7;2000444;443
Howard.Jackson;7;2000445;444
50851436;1;2000446;445
37232103;4;2000447;446
Lori.Fields;7;2000448;447
sherri49@gmail.com;9;2000449;448
53368555;3;2000450;449
Benjamin.Dickerson;6;2000451;450
Steven.Hensley;6;2000452;451
nicolebryant@hampton.com;9;2000453;452
77227411;5;2000454;453
47097483;5;2000455;454
April.Stone;8;2000456;455
51075436;4;2000457;456
Mr..Christopher.Freeman;7;2000458;457
Donna.Mason;7;2000459;458
29459670;1;2000460;459
57273587;5;2000461;460
76037934;1;2000462;461
79382115;3;2000463;462
Evan.Ballard;6;2000464;463
91785497;1;2000465;464
Sean.Williams;8;2000466;465
Erica.Gallagher;6;2000467;466
89532087;2;2000468;467
47813060;5;2000469;468
54976803;1;2000470;469
70809586;1;2000471;470
Joshua.Ward;6;2000472;471
Dr..April.Harris;7;2000473;472
85201171;2;2000474;473
Courtney.Taylor;6;2000475;474
daviskerry@duncan.biz;9;2000476;475
William.Bailey;6;2000477;476
76926703;5;2000478;477
52332191;1;2000479;478
86496476;2;2000480;479
38155924;4;2000481;480
43188210;1;2000482;481
23686674;3;2000483;482
Brian.Ford;6;2000484;483
94470234;2;2000485;484
53460637;1;2000486;485
14338203;1;2000487;486
78924882;2;2000488;487
Kevin.Bray;7;2000489;488
Juan.Harvey;6;2000490;489
Sean.Hanna;8;2000491;490
35080701;4;2000492;491
81083198;3;2000493;492
85264290;4;2000494;493
16365415;3;2000495;494
53643224;2;2000496;495
Sarah.Martinez;8;2000497;496
hallreginald@brown.biz;9;2000498;497
59223560;4;2000499;498
jessicazuniga@hotmail.com;9;2000500;499
29154706;3;2000501;500
veronica32@hurst.com;9;2000502;501
cwilson@gmail.com;9;2000503;502
89586356;4;2000504;503
72400866;1;2000505;504
pbrooks@hotmail.com;9;2000506;505
18235575;2;2000507;506
21736545;5;2000508;507
50714442;4;2000509;508
96196234;5;2000510;509
57546199;1;2000511;510
94933578;5;2000512;511
19431693;4;2000513;512
94506493;5;2000514;513
61626711;3;2000515;514
55923550;5;2000516;515
88307336;3;2000517;516
71399599;4;2000518;517
84133188;2;2000519;518
27918593;1;2000520;519
32303072;4;2000521;520
74262484;3;2000522;521
50077333;3;2000523;522
Sherri.Zimmerman.MD;7;2000524;523
craigwoods@garcia-stevens.info;9;2000525;524
96529088;2;2000526;525
81213986;1;2000527;526
Samuel.Marsh;8;2000528;527
Robert.Krause;6;2000529;528
77812491;5;2000530;529
Isaac.Neal;7;2000531;530
Miss.Kaitlyn.Williams;6;2000532;531
38498340;1;2000533;532
Mary.Watkins;8;2000534;533
98382825;5;2000535;534
Carol.Butler;8;2000536;535
mark69@fitzgerald-schneider.com;9;2000537;536
Ian.Jackson;7;2000538;537
Scott.Boone;6;2000539;538
40956408;1;2000540;539
69218928;1;2000541;540
grandolph@young.org;9;2000542;541
christinemarsh@nichols.org;9;2000543;542
29493242;5;2000544;543
91169142;1;2000545;544
90438485;3;2000546;545
Mr..Bruce.Jefferson;6;2000547;546
41950148;5;2000548;547
Brandon.Vasquez;6;2000549;548
Evan.Hampton;6;2000550;549
Deborah.Ortega;6;2000551;550
14184346;4;2000552;551
18441554;5;2000553;552
73855280;2;2000554;553
57532533;4;2000555;554
62720120;2;2000556;555
32862650;4;2000557;556
William.Koch;7;2000558;557
78927021;1;2000559;558
Claudia.Price;6;2000560;559
78201909;5;2000561;560
87654543;2;2000562;561
28793121;1;2000563;562
51335350;5;2000564;563
29171127;4;2000565;564
pchristensen@smith.com;9;2000566;565
65459412;1;2000567;566
44394774;3;2000568;567
Brian.Jones;6;2000569;568
91207165;4;2000570;569
Megan.Martinez;7;2000571;570
matthewbaker@barnes.com;9;2000572;571
55884561;4;2000573;572
19992902;3;2000574;573
Christopher.Singh;8;2000575;574
mmartin@calderon-miller.net;9;2000576;575
63552285;2;2000577;576
Brooke.Lopez;7;2000578;577
57829099;2;2000579;578
Mrs..Karina.Roy;8;2000580;579
geoffreymann@richardson.org;9;2000581;580
82649029;2;2000582;581
97546198;3;2000583;582
32969357;2;2000584;583
Laura.Rodriguez;7;2000585;584
51146864;5;2000586;585
86879153;1;2000587;586
98396840;2;2000588;587
Paul.Johnson;8;2000589;588
37741849;4;2000590;589
99750039;3;2000591;590
jonathan34@moses.net;9;2000592;591
21061296;3;2000593;592
95295530;1;2000594;593
82397206;4;2000595;594
18331082;3;2000596;595
26432247;2;2000597;596
brett56@hotmail.com;9;2000598;597
24295185;1;2000599;598
75681737;4;2000600;599
52604952;4;2000601;600
Brett.Blair;7;2000602;601
Michael.Edwards;8;2000603;602
stephanie30@hotmail.com;9;2000604;603
Daniel.Zimmerman;7;2000605;604
Colleen.Gonzalez;8;2000606;605
Nicole.Wright;6;2000607;606
Joseph.Butler;8;2000608;607
gregorythornton@gmail.com;9;2000609;608
57894382;5;2000610;609
shannonbradley@buckley-mcknight.com;9;2000611;610
Kathy.Richardson;7;2000612;611
48569768;4;2000613;612
71016641;4;2000614;613
Lisa.Atkins;6;2000615;614
72295953;1;2000616;615
Michael.Padilla;6;2000617;616
84169797;5;2000618;617
Bruce.Long;7;2000619;618
30137618;3;2000620;619
Michael.Anderson;6;2000621;620
67374768;1;2000622;621
64466651;3;2000623;622
tpowell@yahoo.com;9;2000624;623
andrew64@copeland.com;9;2000625;624
Kimberly.Garcia;7;2000626;625
Paige.Martin;7;2000627;626
40309006;2;2000628;627
25438273;5;2000629;628
99202070;5;2000630;629
13309565;3;2000631;630
64265684;3;2000632;631
21863725;3;2000633;632
Adrian.Rice;8;2000634;633
90708412;3;2000635;634
44516194;5;2000636;635
60378445;5;2000637;636
Dr..Jennifer.James.DVM;8;2000638;637
93746644;5;2000639;638
kathrynle@davis.org;9;2000640;639
81282279;3;2000641;640
Mr..Aaron.Duran;7;2000642;641
Joshua.Pierce;6;2000643;642
72887090;4;2000644;643
Diana.Gilmore;7;2000645;644
tom51@grant-hansen.org;9;2000646;645
Erica.Romero;6;2000647;646
Dr..Tara.Rosario;8;2000648;647
27258169;3;2000649;648
Theresa.Russell;7;2000650;649
Tracy.Pearson;7;2000651;650
Steven.Blevins;8;2000652;651
markmalone@yahoo.com;9;2000653;652
gregoryanderson@richmond.org;9;2000654;653
Brittany.Martinez;7;2000655;654
85432650;1;2000656;655
45535581;5;2000657;656
Pamela.Reynolds;6;2000658;657
93451188;4;2000659;658
Mary.Valencia;6;2000660;659
21882150;5;2000661;660
Katherine.Carter;7;2000662;661
Manuel.Davis;7;2000663;662
69187401;2;2000664;663
44034865;2;2000665;664
danielcox@hawkins-dunn.com;9;2000666;665
Roger.Sanchez;8;2000667;666
Cindy.Johnston;8;2000668;667
49344447;5;2000669;668
ysmith@moon.com;9;2000670;669
95297755;3;2000671;670
44295444;3;2000672;671
Jonathan.Stewart;8;2000673;672
16884934;3;2000674;673
53574838;5;2000675;674
50314663;4;2000676;675
Juan.Summers.PhD;6;2000677;676
Michele.Baker;6;2000678;677
Jade.Greer;8;2000679;678
12075678;2;2000680;679
rachel85@gmail.com;9;2000681;680
53646847;4;2000682;681
86772412;3;2000683;682
Kristin.Hayes;6;2000684;683
49717043;5;2000685;684
Jaime.Austin;8;2000686;685
iwhitney@gmail.com;9;2000687;686
39729410;1;2000688;687
Jeremy.Goodwin;8;2000689;688
Sandra.Jones;8;2000690;689
Frances.Campbell;8;2000691;690
Michael.Williams;7;2000692;691
Olivia.Kim;7;2000693;692
Alyssa.Hoffman;8;2000694;693
76281382;5;2000695;694
65737989;2;2000696;695
61533344;4;2000697;696
83489882;1;2000698;697
Tracy.Butler;6;2000699;698
55486799;1;2000700;699
53990942;1;2000701;700
Jesse.Clay;7;2000702;701
catherinecastro@hotmail.com;9;2000703;702
44793203;2;2000704;703
89749779;3;2000705;704
John.Jones;7;2000706;705
62358396;3;2000707;706
64156684;1;2000708;707
79114833;3;2000709;708
Dennis.Byrd;7;2000710;709
ajones@yahoo.com;9;2000711;710
Brandon.Jackson;6;2000712;711
43110844;4;2000713;712
38630201;3;2000714;713
81891041;2;2000715;714
Christopher.Ray;8;2000716;715
95281188;2;2000717;716
71335948;1;2000718;717
70112830;1;2000719;718
Joann.Padilla;8;2000720;719
49868763;3;2000721;720
16392999;2;2000722;721
25063849;2;2000723;722
20452538;4;2000724;723
20529686;1;2000725;724
29213125;1;2000726;725
80626047;1;2000727;726
Jeffrey.Jones;7;2000728;727
73456690;2;2000729;728
91604396;3;2000730;729
marvin03@hotmail.com;9;2000731;730
25887193;1;2000732;731
ramseyholly@sullivan.com;9;2000733;732
Jill.Park;6;2000734;733
21097496;2;2000735;734
Connie.Beck;8;2000736;735
61999872;4;2000737;736
16879759;4;2000738;737
Nicole.Richard;8;2000739;738
Katherine.Jimenez;7;2000740;739
Antonio.Hansen;8;2000741;740
20262019;2;2000742;741
15271910;3;2000743;742
Douglas.Brown;7;2000744;743
51834680;5;2000745;744
43741730;2;2000746;745
50184060;2;2000747;746
46890551;2;2000748;747
Renee.James;8;2000749;748
54420492;2;2000750;749
58909863;5;2000751;750
72346631;3;2000752;751
63046872;2;2000753;752
Linda.Williams;6;2000754;753
Kimberly.Ward;6;2000755;754
okim@jackson.com;9;2000756;755
68043321;4;2000757;756
10211759;4;2000758;757
Matthew.Jackson;6;2000759;758
Calvin.Allen;6;2000760;759
66124319;1;2000761;760
15903529;1;2000762;761
88716372;3;2000763;762
61051432;5;2000764;763
Dennis.Rowe;8;2000765;764
15268365;4;2000766;765
johncontreras@gmail.com;9;2000767;766
27494266;2;2000768;767
42193568;5;2000769;768
jasonrodriguez@gmail.com;9;2000770;769
David.Davis;7;2000771;770
10662851;2;2000772;771
75296124;1;2000773;772
Erik.White;6;2000774;773
Rickey.Miles;7;2000775;774
91448754;4;2000776;775
22819869;2;2000777;776
74652425;5;2000778;777
wayne59@yahoo.com;9;2000779;778
66167392;2;2000780;779
23879852;5;2000781;780
John.Thompson;7;2000782;781
57692144;4;2000783;782
Crystal.Jacobs;7;2000784;783
bfrench@perez.com;9;2000785;784
40625310;5;2000786;785
43723335;2;2000787;786
31695381;5;2000788;787
Sharon.Weiss;6;2000789;788
84118103;5;2000790;789
Sharon.Reid;6;2000791;790
40322398;4;2000792;791
Caleb.Burch;7;2000793;792
51673172;4;2000794;793
48019911;4;2000795;794
29671415;3;2000796;795
73857372;5;2000797;796
90160773;1;2000798;797
slowe@yahoo.com;9;2000799;798
71638510;5;2000800;799
Michele.Jones;8;2000801;800
Fred.Webb;6;2000802;801
62819602;5;2000803;802
36954108;5;2000804;803
William.Jones;8;2000805;804
83293236;3;2000806;805
71589699;1;2000807;806
47764618;2;2000808;807
matthewbryant@gmail.com;9;2000809;808
94389445;2;2000810;809
27721520;3;2000811;810
Julia.Reynolds;6;2000812;811
robertlong@morgan.com;9;2000813;812
59129274;3;2000814;813
40335643;2;2000815;814
38946152;4;2000816;815
94107112;2;2000817;816
Anthony.Larson;8;2000818;817
Jason.Roberts;7;2000819;818
42924759;2;2000820;819
Kimberly.Barker;8;2000821;820
Robert.Schneider;7;2000822;821
83736675;4;2000823;822
97989569;4;2000824;823
jonathan76@riddle.info;9;2000825;824
Melissa.Davila;6;2000826;825
Crystal.Gonzalez;8;2000827;826
Peter.Cummings;7;2000828;827
daniel53@gmail.com;9;2000829;828
52511580;3;2000830;829
63368483;2;2000831;830
David.Meyer;7;2000832;831
christine93@chaney-reynolds.net;9;2000833;832
Mary.Gonzalez;8;2000834;833
22034853;4;2000835;834
15922915;5;2000836;835
pspencer@yahoo.com;9;2000837;836
John.Allen;7;2000838;837
12975108;4;2000839;838
56308050;3;2000840;839
17817949;4;2000841;840
22728145;2;2000842;841
51848373;4;2000843;842
Cory.Edwards;7;2000844;843
21851523;3;2000845;844
79911808;2;2000846;845
79025337;2;2000847;846
Benjamin.Moreno;7;2000848;847
Paul.Walters;7;2000849;848
davisandrea@young.info;9;2000850;849
Robert.Ochoa;7;2000851;850
Gina.Bass;8;2000852;851
62500853;5;2000853;852
65819489;2;2000854;853
10934849;3;2000855;854
23571506;4;2000856;855
sferguson@anderson.biz;9;2000857;856
Louis.Smith;6;2000858;857
Pamela.Dalton;6;2000859;858
58483750;2;2000860;859
66067304;2;2000861;860
40516680;1;2000862;861
99474775;2;2000863;862
Reginald.Pittman;7;2000864;863
25474083;4;2000865;864
15756993;3;2000866;865
57028511;5;2000867;866
Andrew.Cook;6;2000868;867
51449461;2;2000869;868
Keith.Brown;8;2000870;869
John.Cannon;6;2000871;870
16229223;1;2000872;871
70214740;2;2000873;872
Sally.Foley;6;2000874;873
vancemckenzie@harris.org;9;2000875;874
Randy.Scott;6;2000876;875
Cameron.Church.DVM;7;2000877;876
Joseph.Herman;8;2000878;877
Joel.Moore;7;2000879;878
59352679;3;2000880;879
Amanda.Hunter;7;2000881;880
99804870;4;2000882;881
31110074;3;2000883;882
92980553;3;2000884;883
61915557;1;2000885;884
46172909;5;2000886;885
88535643;4;2000887;886
Christian.Long;8;2000888;887
35514724;2;2000889;888
43953923;4;2000890;889
34708531;2;2000891;890
69039330;5;2000892;891
David.Potter;8;2000893;892
44946352;1;2000894;893
39095895;1;2000895;894
28930676;2;2000896;895
Amy.Rocha;7;2000897;896
Joseph.Richardson;7;2000898;897
Jose.Nguyen;7;2000899;898
Annette.Ross;6;2000900;899
tannerrebecca@gmail.com;9;2000901;900
40786902;2;2000902;901
92437971;2;2000903;902
Jerry.Romero;8;2000904;903
emily01@ramos.com;9;2000905;904
26990399;1;2000906;905
61897471;1;2000907;906
deborah71@yahoo.com;9;2000908;907
jessicastone@gmail.com;9;2000909;908
45921841;4;2000910;909
Jeffrey.Allen;8;2000911;910
cerickson@hotmail.com;9;2000912;911
28823327;5;2000913;912
12070446;5;2000914;913
72452764;5;2000915;914
Morgan.Wright;8;2000916;915
78122731;4;2000917;916
56211107;3;2000918;917
83691947;3;2000919;918
Lisa.Riggs;7;2000920;919
Lauren.Moore.PhD;6;2000921;920
Mary.Clark.PhD;6;2000922;921
21691947;2;2000923;922
Justin.Stafford;7;2000924;923
jamesveronica@yahoo.com;9;2000925;924
Megan.Armstrong;6;2000926;925
13548783;4;2000927;926
38666500;2;2000928;927
40909516;1;2000929;928
81223584;3;2000930;929
51809261;2;2000931;930
76700057;3;2000932;931
45580066;4;2000933;932
28543568;3;2000934;933
oscott@smith-bailey.com;9;2000935;934
55670800;1;2000936;935
Jonathan.Pineda;8;2000937;936
42513863;2;2000938;937
75302695;1;2000939;938
Nicholas.Shelton;6;2000940;939
Vanessa.Johnson;8;2000941;940
19479161;4;2000942;941
94499316;4;2000943;942
Mary.Wilcox;6;2000944;943
kimberlytaylor@dillon.com;9;2000945;944
99720950;4;2000946;945
Timothy.Flores;6;2000947;946
52109076;5;2000948;947
sjackson@hernandez-melton.com;9;2000949;948
50307728;5;2000950;949
45327388;4;2000951;950
81232170;3;2000952;951
jmalone@gmail.com;9;2000953;952
Kevin.Lloyd;7;2000954;953
49360776;4;2000955;954
Perry.Velasquez;8;2000956;955
52073207;4;2000957;956
28994354;2;2000958;957
78608990;3;2000959;958
Victor.Simpson;7;2000960;959
68694258;3;2000961;960
Emily.Leon;8;2000962;961
Ann.Murphy;8;2000963;962
44976684;2;2000964;963
Aaron.Keith;6;2000965;964
14601745;3;2000966;965
Shannon.Roberts;6;2000967;966
James.Stevens;6;2000968;967
59107972;4;2000969;968
Christine.Bender;7;2000970;969
Larry.Smith;8;2000971;970
Terry.Kaiser;8;2000972;971
Spencer.Moore;7;2000973;972
86071560;2;2000974;973
Kathleen.Burgess;8;2000975;974
37538660;2;2000976;975
Jonathan.Bishop;8;2000977;976
55308736;5;2000978;977
12749356;3;2000979;978
84156859;5;2000980;979
Ronnie.Reyes;7;2000981;980
bowmanstephanie@hotmail.com;9;2000982;981
Denise.Williams;7;2000983;982
Garrett.Morgan;7;2000984;983
38833252;2;2000985;984
Micheal.White;7;2000986;985
16229231;5;2000987;986
Kelly.Harris;6;2000988;987
36741026;2;2000989;988
63766527;2;2000990;989
10433745;3;2000991;990
12307604;5;2000992;991
97482078;5;2000993;992
lowemary@hotmail.com;9;2000994;993
Mr..Joseph.Williams;7;2000995;994
87620755;2;2000996;995
Tony.Mueller;8;2000997;996
65814230;3;2000998;997
67998731;2;2000999;998
jonesronald@hotmail.com;9;2001000;999
