EESchema Schematic File Version 4
LIBS:SolarPowerBoard-cache
EELAYER 30 0
EELAYER END
$Descr A4 11693 8268
encoding utf-8
Sheet 1 1
Title ""
Date ""
Rev ""
Comp ""
Comment1 ""
Comment2 ""
Comment3 ""
Comment4 ""
$EndDescr
$Comp
L pspice:INDUCTOR Lx1
U 1 1 5DA37DAE
P 2850 2500
F 0 "Lx1" H 2850 2715 50  0000 C CNN
F 1 "15uH" H 2850 2624 50  0000 C CNN
F 2 "Inductor_SMD:L_Taiyo-Yuden_NR-50xx" H 2850 2500 50  0001 C CNN
F 3 "~" H 2850 2500 50  0001 C CNN
F 4 "NR5040T150M" H 2850 2500 50  0001 C CNN "MPN"
	1    2850 2500
	1    0    0    -1  
$EndComp
$Comp
L Device:R R3
U 1 1 5DA38730
P 2050 2900
F 0 "R3" H 2120 2946 50  0000 L CNN
F 1 "1k" H 2120 2855 50  0000 L CNN
F 2 "Resistor_SMD:R_0603_1608Metric" V 1980 2900 50  0001 C CNN
F 3 "~" H 2050 2900 50  0001 C CNN
F 4 "CRCW06031K00FKEA" H 2050 2900 50  0001 C CNN "MPN"
	1    2050 2900
	1    0    0    -1  
$EndComp
$Comp
L Device:D_Zener D_OUT1
U 1 1 5DA3AEAA
P 7000 2850
F 0 "D_OUT1" V 6954 2929 50  0000 L CNN
F 1 "4v5" V 7045 2929 50  0000 L CNN
F 2 "00:DO216-AA" H 7000 2850 50  0001 C CNN
F 3 "~" H 7000 2850 50  0001 C CNN
F 4 "STPS1L40M" H 7000 2850 50  0001 C CNN "MPN"
	1    7000 2850
	0    1    1    0   
$EndComp
$Comp
L power:GND #PWR02
U 1 1 5DA3D1E7
P 3200 4350
F 0 "#PWR02" H 3200 4100 50  0001 C CNN
F 1 "GND" H 3205 4177 50  0000 C CNN
F 2 "" H 3200 4350 50  0001 C CNN
F 3 "" H 3200 4350 50  0001 C CNN
	1    3200 4350
	1    0    0    -1  
$EndComp
$Comp
L Device:R_Variable VR4
U 1 1 5DA3EC3B
P 2050 3850
F 0 "VR4" H 2178 3896 50  0000 L CNN
F 1 "R_Var_50k_DNP" H 2178 3805 50  0000 L CNN
F 2 "00:Potentiometer_3313J_Horizontal" V 1980 3850 50  0001 C CNN
F 3 "~" H 2050 3850 50  0001 C CNN
F 4 "3313J-1-503E" H 2050 3850 50  0001 C CNN "MPN"
	1    2050 3850
	1    0    0    -1  
$EndComp
$Comp
L Device:C C4
U 1 1 5DA3F1AC
P 3200 3250
F 0 "C4" H 3315 3296 50  0000 L CNN
F 1 "100nF" H 3315 3205 50  0000 L CNN
F 2 "Capacitor_SMD:C_0603_1608Metric" H 3238 3100 50  0001 C CNN
F 3 "~" H 3200 3250 50  0001 C CNN
F 4 "C0603C104K8RACTU" H 3200 3250 50  0001 C CNN "MPN"
	1    3200 3250
	1    0    0    -1  
$EndComp
$Comp
L Device:CP1 CIN1
U 1 1 5DA44F3B
P 1650 2850
F 0 "CIN1" H 1765 2896 50  0000 L CNN
F 1 "33uF" H 1765 2805 50  0000 L CNN
F 2 "Capacitor_SMD:C_0805_2012Metric" H 1650 2850 50  0001 C CNN
F 3 "~" H 1650 2850 50  0001 C CNN
F 4 "C2012X5R1A336M125AC" H 1650 2850 50  0001 C CNN "MPN"
	1    1650 2850
	1    0    0    -1  
$EndComp
Wire Wire Line
	3450 2500 3200 2500
Connection ~ 2050 2500
Wire Wire Line
	2050 2500 2600 2500
Wire Wire Line
	2050 2500 2050 2700
Wire Wire Line
	3200 3100 3450 3100
Connection ~ 2050 2700
Wire Wire Line
	2050 2700 2050 2750
Wire Wire Line
	2050 3050 2050 3100
Connection ~ 2050 3100
Wire Wire Line
	3200 4350 3200 4300
Wire Wire Line
	1650 3000 1650 4300
Connection ~ 3200 4300
Wire Wire Line
	1650 2700 1650 2500
Connection ~ 1650 2500
Wire Wire Line
	1650 2500 2050 2500
$Comp
L Jumper:Jumper_2_Open JP1
U 1 1 5DA41CC7
P 2050 3400
F 0 "JP1" V 2096 3312 50  0000 R CNN
F 1 "JP_Open" V 2005 3312 50  0000 R CNN
F 2 "Jumper:SolderJumper-2_P1.3mm_Open_Pad1.0x1.5mm" H 2050 3400 50  0001 C CNN
F 3 "~" H 2050 3400 50  0001 C CNN
F 4 "" H 2050 3400 50  0001 C CNN "MPN"
	1    2050 3400
	0    -1   -1   0   
$EndComp
Connection ~ 1650 4300
$Comp
L Device:C CF1
U 1 1 5DA56418
P 4850 2800
F 0 "CF1" H 4965 2846 50  0000 L CNN
F 1 "1uF" H 4965 2755 50  0000 L CNN
F 2 "Capacitor_SMD:C_0603_1608Metric" H 4888 2650 50  0001 C CNN
F 3 "~" H 4850 2800 50  0001 C CNN
F 4 "C0603C105M8RACAUTO" H 4850 2800 50  0001 C CNN "MPN"
	1    4850 2800
	1    0    0    -1  
$EndComp
$Comp
L Device:R RF1
U 1 1 5DA574EC
P 5250 2650
F 0 "RF1" V 5043 2650 50  0000 C CNN
F 1 "1k" V 5134 2650 50  0000 C CNN
F 2 "Resistor_SMD:R_0603_1608Metric" V 5180 2650 50  0001 C CNN
F 3 "~" H 5250 2650 50  0001 C CNN
F 4 "CRCW06031K00FKEA" H 5250 2650 50  0001 C CNN "MPN"
	1    5250 2650
	0    1    1    0   
$EndComp
$Comp
L Device:R RF2
U 1 1 5DA57C07
P 5250 2950
F 0 "RF2" V 5043 2950 50  0000 C CNN
F 1 "1k" V 5134 2950 50  0000 C CNN
F 2 "Resistor_SMD:R_0603_1608Metric" V 5180 2950 50  0001 C CNN
F 3 "~" H 5250 2950 50  0001 C CNN
F 4 "CRCW06031K00FKEA" H 5250 2950 50  0001 C CNN "MPN"
	1    5250 2950
	0    1    1    0   
$EndComp
$Comp
L Device:R Rs1
U 1 1 5DA5817B
P 5650 2500
F 0 "Rs1" V 5443 2500 50  0000 C CNN
F 1 "20m" V 5534 2500 50  0000 C CNN
F 2 "Resistor_SMD:R_0603_1608Metric" V 5580 2500 50  0001 C CNN
F 3 "~" H 5650 2500 50  0001 C CNN
F 4 "RCWE060320L0FQEA" H 5650 2500 50  0001 C CNN "MPN"
	1    5650 2500
	0    1    1    0   
$EndComp
$Comp
L Device:C C2
U 1 1 5DA590A4
P 4750 3250
F 0 "C2" H 4865 3296 50  0000 L CNN
F 1 "1nF" H 4865 3205 50  0000 L CNN
F 2 "Capacitor_SMD:C_0603_1608Metric" H 4788 3100 50  0001 C CNN
F 3 "~" H 4750 3250 50  0001 C CNN
F 4 "C0603C102J8HACTU" H 4750 3250 50  0001 C CNN "MPN"
	1    4750 3250
	1    0    0    -1  
$EndComp
$Comp
L Device:R R1
U 1 1 5DA59A26
P 6100 2750
F 0 "R1" H 6170 2796 50  0000 L CNN
F 1 "1M_0.1%" H 6170 2705 50  0000 L CNN
F 2 "Resistor_SMD:R_0603_1608Metric" V 6030 2750 50  0001 C CNN
F 3 "~" H 6100 2750 50  0001 C CNN
F 4 "RN73H1JTTD1004B25" H 6100 2750 50  0001 C CNN "MPN"
	1    6100 2750
	1    0    0    -1  
$EndComp
$Comp
L Device:R R21
U 1 1 5DA5A041
P 6100 3300
F 0 "R21" H 6170 3346 50  0000 L CNN
F 1 "422k_0.1%" H 6170 3255 50  0000 L CNN
F 2 "Resistor_SMD:R_0603_1608Metric" V 6030 3300 50  0001 C CNN
F 3 "~" H 6100 3300 50  0001 C CNN
F 4 "RN73H1JTTD4223B25" H 6100 3300 50  0001 C CNN "MPN"
	1    6100 3300
	1    0    0    -1  
$EndComp
$Comp
L Device:R_Variable VR22
U 1 1 5DA5B1E8
P 6600 3300
F 0 "VR22" H 6728 3346 50  0000 L CNN
F 1 "R_Var_50k" H 6728 3255 50  0000 L CNN
F 2 "00:Potentiometer_3313J_Horizontal" V 6530 3300 50  0001 C CNN
F 3 "~" H 6600 3300 50  0001 C CNN
F 4 "3313J-1-503E" H 6600 3300 50  0001 C CNN "MPN"
	1    6600 3300
	1    0    0    -1  
$EndComp
$Comp
L Device:R R22
U 1 1 5DA5B9E6
P 6600 3750
F 0 "R22" H 6670 3796 50  0000 L CNN
F 1 "390k" H 6670 3705 50  0000 L CNN
F 2 "Resistor_SMD:R_0603_1608Metric" V 6530 3750 50  0001 C CNN
F 3 "~" H 6600 3750 50  0001 C CNN
F 4 "RK73B1JTTDD394J" H 6600 3750 50  0001 C CNN "MPN"
	1    6600 3750
	1    0    0    -1  
$EndComp
$Comp
L Jumper:Jumper_3_Open JP_Vctrl1
U 1 1 5DA6140B
P 6350 4050
F 0 "JP_Vctrl1" H 6350 4163 50  0000 C CNN
F 1 "Jumper_3_Bridged12" H 6350 4163 50  0001 C CNN
F 2 "Jumper:SolderJumper-3_P1.3mm_Open_Pad1.0x1.5mm" H 6350 4050 50  0001 C CNN
F 3 "~" H 6350 4050 50  0001 C CNN
F 4 "" H 6350 4050 50  0001 C CNN "MPN"
	1    6350 4050
	1    0    0    -1  
$EndComp
Wire Wire Line
	4450 2700 4700 2700
Wire Wire Line
	4700 2700 4700 2650
Wire Wire Line
	4700 2650 4850 2650
Wire Wire Line
	4850 2650 5100 2650
Connection ~ 4850 2650
Wire Wire Line
	4450 2900 4700 2900
Wire Wire Line
	4700 2900 4700 2950
Wire Wire Line
	4700 2950 4850 2950
Wire Wire Line
	4850 2950 5100 2950
Connection ~ 4850 2950
Wire Wire Line
	5400 2650 5500 2650
Wire Wire Line
	5500 2650 5500 2500
Wire Wire Line
	5500 2500 4450 2500
Connection ~ 5500 2500
Wire Wire Line
	5400 2950 5800 2950
Wire Wire Line
	5800 2950 5800 2500
Wire Wire Line
	5800 2500 6100 2500
Connection ~ 5800 2500
Wire Wire Line
	6100 3450 6100 4050
Wire Wire Line
	6100 2900 6100 3100
Wire Wire Line
	6100 2500 6100 2600
Connection ~ 6100 2500
Wire Wire Line
	6100 2500 7000 2500
Wire Wire Line
	6600 3450 6600 3600
Wire Wire Line
	6600 3900 6600 4050
Wire Wire Line
	7000 2700 7000 2500
Wire Wire Line
	7000 4300 6350 4300
Wire Wire Line
	7000 3000 7000 4300
Wire Wire Line
	4450 3100 4750 3100
Wire Wire Line
	6600 3150 6600 3100
Wire Wire Line
	6600 3100 6100 3100
Connection ~ 6100 3100
Wire Wire Line
	6100 3100 6100 3150
Wire Wire Line
	6100 3100 4750 3100
Connection ~ 4750 3100
Wire Wire Line
	6350 4200 6350 4300
Connection ~ 6350 4300
Wire Wire Line
	6350 4300 4750 4300
Wire Wire Line
	4750 3400 4750 4300
Connection ~ 4750 4300
Wire Wire Line
	1000 4300 1150 4300
$Comp
L Connector:TestPoint_2Pole TP_Vin1
U 1 1 5DA89C52
P 1150 3100
F 0 "TP_Vin1" V 1150 3158 50  0000 L CNN
F 1 "TP_2Pole" V 1195 3158 50  0001 L CNN
F 2 "TestPoint:TestPoint_2Pads_Pitch2.54mm_Drill0.8mm" H 1150 3100 50  0001 C CNN
F 3 "~" H 1150 3100 50  0001 C CNN
F 4 "" H 1150 3100 50  0001 C CNN "MPN"
	1    1150 3100
	0    1    1    0   
$EndComp
Wire Wire Line
	1150 2900 1150 2500
Wire Wire Line
	1000 2500 1150 2500
Connection ~ 1150 2500
Wire Wire Line
	1150 2500 1650 2500
Wire Wire Line
	1150 3300 1150 4300
Connection ~ 1150 4300
Wire Wire Line
	1150 4300 1650 4300
Wire Wire Line
	3200 3100 2550 3100
Connection ~ 3200 3100
Wire Wire Line
	3200 3400 3200 4300
Wire Wire Line
	3200 4300 4750 4300
Wire Wire Line
	1000 2600 1000 4300
Wire Wire Line
	1650 4300 2050 4300
Wire Wire Line
	2050 3100 2050 3200
Wire Wire Line
	2050 3600 2050 3700
Wire Wire Line
	2050 4000 2050 4300
Connection ~ 2050 4300
Wire Wire Line
	2050 4300 3200 4300
$Comp
L Connector:TestPoint TP_MPP_SET1
U 1 1 5DABA4CF
P 2650 3400
F 0 "TP_MPP_SET1" H 2708 3472 50  0000 L CNN
F 1 "TestPoint" H 2708 3427 50  0001 L CNN
F 2 "TestPoint:TestPoint_Loop_D1.80mm_Drill1.0mm_Beaded" H 2850 3400 50  0001 C CNN
F 3 "~" H 2850 3400 50  0001 C CNN
F 4 "" H 2650 3400 50  0001 C CNN "MPN"
	1    2650 3400
	1    0    0    -1  
$EndComp
Wire Wire Line
	2650 3400 2550 3400
Wire Wire Line
	2550 3400 2550 3100
Connection ~ 2550 3100
Wire Wire Line
	2550 3100 2050 3100
$Comp
L Connector:TestPoint TP_Lx1
U 1 1 5DABCEBB
P 3200 2300
F 0 "TP_Lx1" H 3258 2372 50  0000 L CNN
F 1 "TestPoint" H 3258 2327 50  0001 L CNN
F 2 "TestPoint:TestPoint_Loop_D1.80mm_Drill1.0mm_Beaded" H 3400 2300 50  0001 C CNN
F 3 "~" H 3400 2300 50  0001 C CNN
F 4 "" H 3200 2300 50  0001 C CNN "MPN"
	1    3200 2300
	1    0    0    -1  
$EndComp
Wire Wire Line
	3200 2300 3200 2500
Connection ~ 3200 2500
Wire Wire Line
	3200 2500 3100 2500
$Comp
L power:GND #PWR01
U 1 1 5DA41164
P 3050 2950
F 0 "#PWR01" H 3050 2700 50  0001 C CNN
F 1 "GND" H 3055 2777 50  0000 C CNN
F 2 "" H 3050 2950 50  0001 C CNN
F 3 "" H 3050 2950 50  0001 C CNN
	1    3050 2950
	1    0    0    -1  
$EndComp
Wire Wire Line
	3050 2950 3050 2900
Wire Wire Line
	3050 2900 3450 2900
$Comp
L Device:R R5
U 1 1 5DA494BB
P 2400 2700
F 0 "R5" V 2193 2700 50  0000 C CNN
F 1 "0" V 2284 2700 50  0000 C CNN
F 2 "Resistor_SMD:R_0603_1608Metric" V 2330 2700 50  0001 C CNN
F 3 "~" H 2400 2700 50  0001 C CNN
F 4 "CRCW06030000Z0EAC" H 2400 2700 50  0001 C CNN "MPN"
	1    2400 2700
	0    1    1    0   
$EndComp
Wire Wire Line
	2250 2700 2050 2700
$Comp
L lsf-kicad:SPV1040 U1
U 1 1 5DAAC902
P 3950 2750
F 0 "U1" H 3950 3265 50  0000 C CNN
F 1 "SPV1040" H 3950 3174 50  0000 C CNN
F 2 "Package_SO:TSSOP-8_4.4x3mm_P0.65mm" H 3950 2150 50  0001 C CNN
F 3 "https://www.st.com/resource/en/datasheet/spv1040.pdf" H 4050 2000 50  0001 C CNN
F 4 "SPV1040TTR" H 3950 2750 50  0001 C CNN "MPN"
	1    3950 2750
	1    0    0    -1  
$EndComp
Text Label 4500 2500 0    50   ~ 0
VOUT
Text Label 4500 3100 0    50   ~ 0
VCTRL
Text Label 4500 2700 0    50   ~ 0
ICTRL+
Text Label 4500 2900 0    50   ~ 0
ICTRL-
Text Label 3200 2700 0    50   ~ 0
XSHUT
Text Label 3300 2500 0    50   ~ 0
LX
Text Label 3250 3100 0    50   ~ 0
MPP-SET
Text Label 6250 2500 0    50   ~ 0
VBAT1
Text Label 1350 2500 0    50   ~ 0
VPV
$Comp
L Connector:TestPoint P_I2
U 1 1 5DB0A92D
P 1000 2600
F 0 "P_I2" H 900 2800 50  0000 L CNN
F 1 "TestPoint" H 1058 2627 50  0001 L CNN
F 2 "TestPoint:TestPoint_Loop_D1.80mm_Drill1.0mm_Beaded" H 1200 2600 50  0001 C CNN
F 3 "~" H 1200 2600 50  0001 C CNN
F 4 "" H 1000 2600 50  0001 C CNN "MPN"
	1    1000 2600
	0    -1   -1   0   
$EndComp
$Comp
L Connector:TestPoint P_I1
U 1 1 5DB0A1A3
P 1000 2500
F 0 "P_I1" H 1000 2700 50  0000 L CNN
F 1 "TestPoint" H 1058 2527 50  0001 L CNN
F 2 "TestPoint:TestPoint_Loop_D1.80mm_Drill1.0mm_Beaded" H 1200 2500 50  0001 C CNN
F 3 "~" H 1200 2500 50  0001 C CNN
F 4 "" H 1000 2500 50  0001 C CNN "MPN"
	1    1000 2500
	0    -1   -1   0   
$EndComp
Wire Wire Line
	2550 2700 3450 2700
Connection ~ 7000 4300
Connection ~ 7000 2500
Wire Wire Line
	8350 4150 8350 4100
$Comp
L power:GND #PWR0101
U 1 1 5DB42604
P 8350 4150
F 0 "#PWR0101" H 8350 3900 50  0001 C CNN
F 1 "GND" H 8355 3977 50  0000 C CNN
F 2 "" H 8350 4150 50  0001 C CNN
F 3 "" H 8350 4150 50  0001 C CNN
	1    8350 4150
	1    0    0    -1  
$EndComp
$Comp
L power:PWR_FLAG #FLG0101
U 1 1 5DB417EC
P 8350 4100
F 0 "#FLG0101" H 8350 4175 50  0001 C CNN
F 1 "PWR_FLAG" H 8350 4273 50  0000 C CNN
F 2 "" H 8350 4100 50  0001 C CNN
F 3 "~" H 8350 4100 50  0001 C CNN
	1    8350 4100
	1    0    0    -1  
$EndComp
$Comp
L Connector:TestPoint P_O2
U 1 1 5DB12840
P 8000 2600
F 0 "P_O2" H 8000 2800 50  0000 L CNN
F 1 "TestPoint" H 8058 2627 50  0001 L CNN
F 2 "TestPoint:TestPoint_Loop_D1.80mm_Drill1.0mm_Beaded" H 8200 2600 50  0001 C CNN
F 3 "~" H 8200 2600 50  0001 C CNN
F 4 "" H 8000 2600 50  0001 C CNN "MPN"
	1    8000 2600
	0    1    1    0   
$EndComp
$Comp
L Connector:TestPoint P_O1
U 1 1 5DB1283A
P 8000 2500
F 0 "P_O1" H 7800 2700 50  0000 L CNN
F 1 "TestPoint" H 8058 2527 50  0001 L CNN
F 2 "TestPoint:TestPoint_Loop_D1.80mm_Drill1.0mm_Beaded" H 8200 2500 50  0001 C CNN
F 3 "~" H 8200 2500 50  0001 C CNN
F 4 "" H 8000 2500 50  0001 C CNN "MPN"
	1    8000 2500
	0    1    1    0   
$EndComp
Connection ~ 7800 2500
Connection ~ 7500 2500
Wire Wire Line
	7500 2500 7800 2500
Wire Wire Line
	7800 2500 7800 3100
Wire Wire Line
	7800 4300 7500 4300
Connection ~ 7800 4300
Wire Wire Line
	7800 3500 7800 4300
Wire Wire Line
	7800 2500 8000 2500
$Comp
L Connector:TestPoint_2Pole TP_VOUT1
U 1 1 5DA81D95
P 7800 3300
F 0 "TP_VOUT1" V 7800 3358 50  0000 L CNN
F 1 "TestPoint_2Pole" V 7845 3358 50  0001 L CNN
F 2 "TestPoint:TestPoint_2Pads_Pitch2.54mm_Drill0.8mm" H 7800 3300 50  0001 C CNN
F 3 "~" H 7800 3300 50  0001 C CNN
F 4 "" H 7800 3300 50  0001 C CNN "MPN"
	1    7800 3300
	0    1    1    0   
$EndComp
Connection ~ 7500 4300
Wire Wire Line
	8000 4300 7800 4300
Wire Wire Line
	8000 2600 8000 4300
Wire Wire Line
	7500 4300 7000 4300
Wire Wire Line
	7500 3000 7500 4300
Wire Wire Line
	7500 2700 7500 2500
Wire Wire Line
	7000 2500 7500 2500
$Comp
L Device:CP1 COUT2
U 1 1 5DA39F62
P 7500 2850
F 0 "COUT2" H 7615 2896 50  0000 L CNN
F 1 "33uF" H 7615 2805 50  0000 L CNN
F 2 "Capacitor_SMD:C_0805_2012Metric" H 7500 2850 50  0001 C CNN
F 3 "~" H 7500 2850 50  0001 C CNN
F 4 "C2012X5R1A336M125AC" H 7500 2850 50  0001 C CNN "MPN"
	1    7500 2850
	1    0    0    -1  
$EndComp
$Comp
L Device:CP1 COUT1
U 1 1 5DB2B991
P 6000 1900
F 0 "COUT1" H 6115 1946 50  0000 L CNN
F 1 "33uF" H 6115 1855 50  0000 L CNN
F 2 "Capacitor_SMD:C_0805_2012Metric" H 6000 1900 50  0001 C CNN
F 3 "~" H 6000 1900 50  0001 C CNN
F 4 "C2012X5R1A336M125AC" H 6000 1900 50  0001 C CNN "MPN"
	1    6000 1900
	1    0    0    -1  
$EndComp
$Comp
L power:GND #PWR?
U 1 1 5DB2C93F
P 6000 2150
F 0 "#PWR?" H 6000 1900 50  0001 C CNN
F 1 "GND" H 6005 1977 50  0000 C CNN
F 2 "" H 6000 2150 50  0001 C CNN
F 3 "" H 6000 2150 50  0001 C CNN
	1    6000 2150
	1    0    0    -1  
$EndComp
Wire Wire Line
	5500 2500 5500 1650
Wire Wire Line
	5500 1650 6000 1650
Wire Wire Line
	6000 1650 6000 1750
Wire Wire Line
	6000 2050 6000 2150
$EndSCHEMATC
