(module Hirose_DF11-8DP-2DS_2x4_P2.00mm_Horizontal (layer F.Cu) (tedit 5DDD7270)
  (descr https://www.hirose.com/product/en/download_file/key_name/DF11-6DP-2DS%2824%29/category/Catalog/doc_file_id/31688/?file_category_id=5&item_id=05430534424&is_series=)
  (tags Header)
  (fp_text reference REF** (at -2 -4.5) (layer F.SilkS)
    (effects (font (size 1 1) (thickness 0.15)))
  )
  (fp_text value Hirose_DF11-8DP-2DS_2x4_P2.00mm_Horizontal (at -2 2.5) (layer F.Fab)
    (effects (font (size 1 1) (thickness 0.15)))
  )
  (fp_text user %R (at -2 -4.5) (layer F.Fab)
    (effects (font (size 1 1) (thickness 0.15)))
  )
  (fp_line (start -7.1 -1) (end 1.1 -1) (layer F.SilkS) (width 0.12))
  (fp_line (start 0.8 -9.7) (end 2 -9.7) (layer F.SilkS) (width 0.12))
  (fp_line (start 0.8 -7.8) (end 0.8 -9.7) (layer F.SilkS) (width 0.12))
  (fp_line (start -6.8 -7.8) (end 0.8 -7.8) (layer F.SilkS) (width 0.12))
  (fp_line (start -6.8 -9.7) (end -6.8 -7.8) (layer F.SilkS) (width 0.12))
  (fp_line (start -8 -9.7) (end -6.8 -9.7) (layer F.SilkS) (width 0.12))
  (fp_line (start 1.1 0.7) (end 1.1 -1) (layer F.SilkS) (width 0.12))
  (fp_line (start 2 0.7) (end 1.1 0.7) (layer F.SilkS) (width 0.12))
  (fp_line (start -7.1 0.7) (end -7.1 -1) (layer F.SilkS) (width 0.12))
  (fp_line (start -8 0.7) (end -7.1 0.7) (layer F.SilkS) (width 0.12))
  (fp_line (start 2 -9.7) (end 2 0.7) (layer F.SilkS) (width 0.12))
  (fp_line (start -8 0.7) (end -8 -9.7) (layer F.SilkS) (width 0.12))
  (fp_line (start 2.1 -9.8) (end -8.1 -9.8) (layer F.CrtYd) (width 0.05))
  (fp_line (start -8.1 -9.8) (end -8.1 0.8) (layer F.CrtYd) (width 0.05))
  (fp_line (start -8.1 0.8) (end 2.1 0.8) (layer F.CrtYd) (width 0.05))
  (fp_line (start 2.1 0.8) (end 2.1 -9.8) (layer F.CrtYd) (width 0.05))
  (fp_line (start -7.1 -1) (end 1.1 -1) (layer F.Fab) (width 0.1))
  (fp_line (start 0.8 -9.7) (end 2 -9.7) (layer F.Fab) (width 0.1))
  (fp_line (start 0.8 -7.8) (end 0.8 -9.7) (layer F.Fab) (width 0.1))
  (fp_line (start -6.8 -7.8) (end 0.8 -7.8) (layer F.Fab) (width 0.1))
  (fp_line (start -6.8 -9.7) (end -6.8 -7.8) (layer F.Fab) (width 0.1))
  (fp_line (start -8 -9.7) (end -6.8 -9.7) (layer F.Fab) (width 0.1))
  (fp_line (start 1.1 0.7) (end 1.1 -1) (layer F.Fab) (width 0.1))
  (fp_line (start 2 0.7) (end 1.1 0.7) (layer F.Fab) (width 0.1))
  (fp_line (start -7.1 0.7) (end -7.1 -1) (layer F.Fab) (width 0.1))
  (fp_line (start -8 0.7) (end -7.1 0.7) (layer F.Fab) (width 0.1))
  (fp_line (start 2 -9.7) (end 2 0.7) (layer F.Fab) (width 0.1))
  (fp_line (start -8 0.7) (end -8 -9.7) (layer F.Fab) (width 0.1))
  (fp_line (start 0 0.792893) (end -0.5 1.5) (layer F.Fab) (width 0.1))
  (fp_line (start 0.5 1.5) (end 0 0.792893) (layer F.Fab) (width 0.1))
  (pad 4 thru_hole oval (at -2 -2 180) (size 1.2 1.65) (drill 0.85) (layers *.Cu *.Mask))
  (pad 5 thru_hole oval (at -4 0 180) (size 1.2 1.65) (drill 0.85) (layers *.Cu *.Mask))
  (pad 2 thru_hole oval (at 0 -2 180) (size 1.2 1.65) (drill 0.85) (layers *.Cu *.Mask))
  (pad 1 thru_hole roundrect (at 0 0 180) (size 1.2 1.65) (drill 0.85) (layers *.Cu *.Mask) (roundrect_rratio 0.25))
  (pad 6 thru_hole oval (at -4 -2 180) (size 1.2 1.65) (drill 0.85) (layers *.Cu *.Mask))
  (pad 8 thru_hole oval (at -6 -2 180) (size 1.2 1.65) (drill 0.85) (layers *.Cu *.Mask))
  (pad 3 thru_hole oval (at -2 0 180) (size 1.2 1.65) (drill 0.85) (layers *.Cu *.Mask))
  (pad 7 thru_hole oval (at -6 0 180) (size 1.2 1.65) (drill 0.85) (layers *.Cu *.Mask))
  (model ${LSF_KICAD_LIB}/lsf-kicad-lib.3dshapes/Hirose_DF11-8DP-2DS_2x4_P2.00mm_Horizontal.wrl
    (at (xyz 0 0 0))
    (scale (xyz 1 1 1))
    (rotate (xyz 0 0 0))
  )
)
