(module murata-dzb4-b (layer F.Cu) (tedit 5C3E09A4)
  (descr -)
  (tags "Murata Inductor")
  (attr smd)
  (fp_text reference REF** (at 0 0) (layer F.SilkS)
    (effects (font (size 1 1) (thickness 0.15)))
  )
  (fp_text value murata-dzb4-b (at 0 -3.5) (layer F.Fab)
    (effects (font (size 1 1) (thickness 0.15)))
  )
  (fp_line (start 2.5 2.5) (end 2.5 1) (layer F.SilkS) (width 0.12))
  (fp_line (start -2.5 2.5) (end 2.5 2.5) (layer F.SilkS) (width 0.12))
  (fp_line (start -2.5 1) (end -2.5 2.5) (layer F.SilkS) (width 0.12))
  (fp_line (start 2.5 -2.5) (end 2.5 -1) (layer F.SilkS) (width 0.12))
  (fp_line (start -2.5 -2.5) (end 2.5 -2.5) (layer F.SilkS) (width 0.12))
  (fp_line (start -2.5 -1) (end -2.5 -2.5) (layer F.SilkS) (width 0.12))
  (fp_text user %R (at 0 0) (layer F.Fab)
    (effects (font (size 1 1) (thickness 0.15)))
  )
  (fp_line (start -2.5 -2.5) (end 2.5 -2.5) (layer F.Fab) (width 0.1))
  (fp_line (start 2.5 -2.5) (end 2.5 2.5) (layer F.Fab) (width 0.1))
  (fp_line (start 2.5 2.5) (end -2.5 2.5) (layer F.Fab) (width 0.1))
  (fp_line (start -2.5 2.5) (end -2.5 -2.5) (layer F.Fab) (width 0.1))
  (fp_line (start 4 -2.6) (end 4 2.6) (layer F.CrtYd) (width 0.05))
  (fp_line (start 4 -2.6) (end -4 -2.6) (layer F.CrtYd) (width 0.05))
  (fp_line (start -4 -2.6) (end -4 2.6) (layer F.CrtYd) (width 0.05))
  (fp_line (start -4 2.6) (end 4 2.6) (layer F.CrtYd) (width 0.05))
  (pad 1 smd rect (at 3 0) (size 2 1.6) (layers F.Cu F.Paste F.Mask))
  (pad 2 smd rect (at -3 0) (size 2 1.6) (layers F.Cu F.Paste F.Mask))
  (model ${LSF_KICAD_LIB}/lsf-kicad-lib.3dshapes/murata-dzb4-b.wrl
    (at (xyz 0 0 0))
    (scale (xyz 1 1 1))
    (rotate (xyz 0 0 0))
  )
)
