(module QUBIK-Logo-10x10 (layer F.Cu) (tedit 5DDEC5AB)
  (descr "Logo for QUBIC mission 10mm x10mm")
  (tags "LOGO QUBIC")
  (attr virtual)
  (fp_text reference REF** (at 0 0) (layer F.SilkS) hide
    (effects (font (size 1 1) (thickness 0.15)))
  )
  (fp_text value QUBIK-Logo-10x10 (at 0.75 0) (layer F.Fab) hide
    (effects (font (size 1 1) (thickness 0.15)))
  )
  (fp_poly (pts (xy 0.043083 -5.012348) (xy 0.07627 -5.01173) (xy 0.102358 -5.010381) (xy 0.124149 -5.00804)
    (xy 0.144444 -5.004446) (xy 0.166042 -4.999338) (xy 0.179561 -4.99577) (xy 0.245885 -4.973889)
    (xy 0.314383 -4.94406) (xy 0.379864 -4.908683) (xy 0.411058 -4.888849) (xy 0.419534 -4.881665)
    (xy 0.436632 -4.86581) (xy 0.462014 -4.841621) (xy 0.495346 -4.809434) (xy 0.536293 -4.769582)
    (xy 0.584519 -4.722402) (xy 0.63969 -4.668228) (xy 0.701469 -4.607397) (xy 0.769523 -4.540242)
    (xy 0.843514 -4.4671) (xy 0.923109 -4.388306) (xy 1.007972 -4.304194) (xy 1.097767 -4.215101)
    (xy 1.19216 -4.121361) (xy 1.290815 -4.02331) (xy 1.393398 -3.921282) (xy 1.499571 -3.815614)
    (xy 1.609002 -3.70664) (xy 1.721354 -3.594696) (xy 1.836291 -3.480116) (xy 1.95348 -3.363237)
    (xy 2.072583 -3.244393) (xy 2.193268 -3.123919) (xy 2.315197 -3.002151) (xy 2.438036 -2.879425)
    (xy 2.561449 -2.756075) (xy 2.685102 -2.632436) (xy 2.808659 -2.508844) (xy 2.931784 -2.385634)
    (xy 3.054144 -2.263142) (xy 3.175401 -2.141702) (xy 3.295222 -2.02165) (xy 3.41327 -1.903321)
    (xy 3.529211 -1.78705) (xy 3.642709 -1.673172) (xy 3.75343 -1.562024) (xy 3.861037 -1.453939)
    (xy 3.965196 -1.349254) (xy 4.065571 -1.248303) (xy 4.161827 -1.151422) (xy 4.253629 -1.058946)
    (xy 4.340642 -0.97121) (xy 4.42253 -0.88855) (xy 4.498958 -0.8113) (xy 4.569591 -0.739797)
    (xy 4.634094 -0.674374) (xy 4.692131 -0.615368) (xy 4.743368 -0.563114) (xy 4.787468 -0.517947)
    (xy 4.824097 -0.480202) (xy 4.852919 -0.450214) (xy 4.873599 -0.428319) (xy 4.885803 -0.414852)
    (xy 4.888848 -0.411059) (xy 4.937315 -0.329898) (xy 4.973629 -0.247383) (xy 4.998332 -0.161863)
    (xy 5.011968 -0.071686) (xy 5.01466 -0.028575) (xy 5.012852 0.066884) (xy 4.999911 0.156995)
    (xy 4.975459 0.243045) (xy 4.939116 0.326324) (xy 4.890503 0.408121) (xy 4.882993 0.4191)
    (xy 4.875729 0.42758) (xy 4.859803 0.444671) (xy 4.83555 0.470039) (xy 4.803305 0.503347)
    (xy 4.763405 0.544262) (xy 4.716184 0.592447) (xy 4.661977 0.647569) (xy 4.601119 0.709291)
    (xy 4.533946 0.777279) (xy 4.460793 0.851199) (xy 4.381995 0.930713) (xy 4.297887 1.015489)
    (xy 4.208805 1.10519) (xy 4.115084 1.199482) (xy 4.017058 1.298029) (xy 3.915064 1.400497)
    (xy 3.809436 1.50655) (xy 3.700509 1.615854) (xy 3.58862 1.728073) (xy 3.474102 1.842873)
    (xy 3.357292 1.959917) (xy 3.238524 2.078872) (xy 3.118133 2.199403) (xy 2.996456 2.321173)
    (xy 2.873826 2.443848) (xy 2.75058 2.567094) (xy 2.627052 2.690574) (xy 2.503578 2.813955)
    (xy 2.380493 2.9369) (xy 2.258132 3.059075) (xy 2.13683 3.180145) (xy 2.016922 3.299775)
    (xy 1.898745 3.417629) (xy 1.782632 3.533374) (xy 1.66892 3.646672) (xy 1.557942 3.757191)
    (xy 1.450036 3.864594) (xy 1.345535 3.968546) (xy 1.244775 4.068713) (xy 1.148092 4.164759)
    (xy 1.05582 4.25635) (xy 0.968294 4.34315) (xy 0.885851 4.424824) (xy 0.808824 4.501037)
    (xy 0.73755 4.571455) (xy 0.672363 4.635742) (xy 0.613598 4.693562) (xy 0.561592 4.744582)
    (xy 0.516679 4.788466) (xy 0.479194 4.824879) (xy 0.449473 4.853485) (xy 0.42785 4.87395)
    (xy 0.414661 4.88594) (xy 0.411058 4.888845) (xy 0.344303 4.92884) (xy 0.272003 4.963147)
    (xy 0.199351 4.989377) (xy 0.180975 4.994598) (xy 0.152014 5.001752) (xy 0.125253 5.006811)
    (xy 0.097012 5.010213) (xy 0.063611 5.012394) (xy 0.02137 5.013793) (xy 0.01905 5.013848)
    (xy -0.040867 5.014167) (xy -0.088777 5.012045) (xy -0.123825 5.007612) (xy -0.219442 4.982849)
    (xy -0.310597 4.946312) (xy -0.396409 4.898371) (xy -0.4191 4.883134) (xy -0.425604 4.877817)
    (xy -0.437177 4.867371) (xy -0.453973 4.851643) (xy -0.476149 4.830478) (xy -0.503859 4.803723)
    (xy -0.537257 4.771223) (xy -0.5765 4.732824) (xy -0.621742 4.688373) (xy -0.673137 4.637716)
    (xy -0.730842 4.580697) (xy -0.79501 4.517164) (xy -0.865797 4.446963) (xy -0.943359 4.369938)
    (xy -1.027849 4.285937) (xy -1.119423 4.194805) (xy -1.218236 4.096389) (xy -1.324443 3.990533)
    (xy -1.438199 3.877085) (xy -1.556373 3.759167) (xy -1.260355 3.759167) (xy -1.162067 3.857608)
    (xy -1.133249 3.886317) (xy -1.107448 3.911728) (xy -1.086001 3.932548) (xy -1.070245 3.947484)
    (xy -1.061518 3.955242) (xy -1.060262 3.95605) (xy -1.054332 3.951866) (xy -1.042354 3.940957)
    (xy -1.028628 3.927401) (xy -1.000511 3.898752) (xy -1.062201 3.836829) (xy -1.123892 3.774906)
    (xy -1.077971 3.728985) (xy -1.032049 3.683064) (xy -0.973204 3.741665) (xy -0.914359 3.800265)
    (xy -0.905076 3.790982) (xy 0.543045 3.790982) (xy 0.714391 3.962416) (xy 0.752728 4.000697)
    (xy 0.788233 4.036001) (xy 0.819911 4.067354) (xy 0.84677 4.093778) (xy 0.867817 4.114297)
    (xy 0.88206 4.127936) (xy 0.888506 4.133718) (xy 0.888756 4.13385) (xy 0.8944 4.129713)
    (xy 0.906535 4.118786) (xy 0.922707 4.103293) (xy 0.925369 4.100673) (xy 0.958963 4.067496)
    (xy 0.890761 3.999081) (xy 0.822558 3.930667) (xy 0.881161 3.871819) (xy 0.939764 3.812972)
    (xy 0.909721 3.782928) (xy 0.879677 3.752885) (xy 0.762045 3.870029) (xy 0.717541 3.825866)
    (xy 0.673037 3.781704) (xy 0.800231 3.654076) (xy 0.739481 3.59424) (xy 0.543045 3.790982)
    (xy -0.905076 3.790982) (xy -0.854285 3.740191) (xy -0.912957 3.681274) (xy -0.97163 3.622356)
    (xy -0.93345 3.584574) (xy -0.89527 3.546793) (xy -0.771172 3.670425) (xy -0.741256 3.640053)
    (xy -0.711341 3.609681) (xy -0.808183 3.51299) (xy -0.836972 3.484527) (xy -0.862944 3.45938)
    (xy -0.884704 3.438858) (xy -0.900856 3.424269) (xy -0.910005 3.416921) (xy -0.911344 3.4163)
    (xy -0.917101 3.420646) (xy -0.930784 3.433033) (xy -0.951378 3.45248) (xy -0.977869 3.47801)
    (xy -1.009241 3.508641) (xy -1.044479 3.543396) (xy -1.08257 3.581295) (xy -1.089009 3.587733)
    (xy -1.260355 3.759167) (xy -1.556373 3.759167) (xy -1.559658 3.75589) (xy -1.688977 3.626794)
    (xy -1.826309 3.489644) (xy -1.867175 3.448817) (xy -1.501279 3.448817) (xy -1.494301 3.494231)
    (xy -1.474776 3.538575) (xy -1.44277 3.581673) (xy -1.418619 3.605935) (xy -1.39684 3.624329)
    (xy -1.373161 3.641869) (xy -1.350504 3.656638) (xy -1.331789 3.66672) (xy -1.320562 3.670211)
    (xy -1.314715 3.666074) (xy -1.302699 3.655152) (xy -1.287395 3.640092) (xy -1.257642 3.609885)
    (xy -1.293209 3.591263) (xy -1.326852 3.570254) (xy -1.356628 3.545277) (xy -1.380055 3.518831)
    (xy -1.394652 3.493414) (xy -1.396763 3.487031) (xy -1.399664 3.452158) (xy -1.390301 3.415557)
    (xy -1.368909 3.377751) (xy -1.335726 3.339258) (xy -1.325294 3.329293) (xy -1.285395 3.298122)
    (xy -1.246736 3.279199) (xy -1.209596 3.272612) (xy -1.174254 3.278454) (xy -1.171597 3.279429)
    (xy -1.14141 3.29654) (xy -1.116091 3.323494) (xy -1.094528 3.361515) (xy -1.091995 3.367214)
    (xy -1.082863 3.386087) (xy -1.074737 3.399098) (xy -1.069975 3.403178) (xy -1.061259 3.400554)
    (xy -1.044852 3.393918) (xy -1.02675 3.385824) (xy -0.989874 3.368675) (xy -1.009971 3.32861)
    (xy -1.035247 3.287383) (xy -1.067235 3.249144) (xy -1.10281 3.217196) (xy -1.134541 3.196939)
    (xy -1.155248 3.1873) (xy -1.173413 3.181631) (xy -1.193917 3.178927) (xy -1.221646 3.17818)
    (xy -1.22555 3.178175) (xy -1.254588 3.178779) (xy -1.276282 3.181345) (xy -1.295961 3.186996)
    (xy -1.318953 3.19686) (xy -1.322996 3.198763) (xy -1.362333 3.221872) (xy -1.401017 3.25422)
    (xy -1.409218 3.262263) (xy -1.442594 3.298571) (xy -1.466845 3.332179) (xy -1.484022 3.366416)
    (xy -1.495644 3.402506) (xy -1.501279 3.448817) (xy -1.867175 3.448817) (xy -1.97181 3.344284)
    (xy -2.125636 3.190562) (xy -2.245798 3.070446) (xy -1.942264 3.070446) (xy -1.939657 3.076133)
    (xy -1.929766 3.088384) (xy -1.914463 3.104962) (xy -1.90726 3.112288) (xy -1.868836 3.150712)
    (xy -1.815221 3.121722) (xy -1.761605 3.092733) (xy -1.635125 3.219717) (xy -1.662959 3.274107)
    (xy -1.690792 3.328496) (xy -1.653633 3.366048) (xy -1.636226 3.383234) (xy -1.622299 3.396233)
    (xy -1.614143 3.402932) (xy -1.613099 3.4034) (xy -1.609725 3.397818) (xy -1.601513 3.381973)
    (xy -1.589061 3.357079) (xy -1.572964 3.324352) (xy -1.553819 3.285008) (xy -1.532223 3.240261)
    (xy -1.508771 3.191326) (xy -1.500129 3.173212) (xy -1.476204 3.122843) (xy -1.454083 3.075964)
    (xy -1.434348 3.03383) (xy -1.417581 2.997697) (xy -1.404363 2.968821) (xy -1.395277 2.948457)
    (xy -1.390902 2.93786) (xy -1.390592 2.936704) (xy -1.394868 2.929673) (xy -1.406308 2.916138)
    (xy -1.42291 2.898383) (xy -1.433848 2.887317) (xy -1.477046 2.84445) (xy -1.707945 2.955738)
    (xy -1.758262 2.980032) (xy -1.804965 3.002664) (xy -1.846825 3.02303) (xy -1.882611 3.040529)
    (xy -1.911093 3.054559) (xy -1.931039 3.064516) (xy -1.94122 3.069799) (xy -1.942264 3.070446)
    (xy -2.245798 3.070446) (xy -2.287939 3.028322) (xy -2.458877 2.857412) (xy -2.506638 2.809648)
    (xy -2.20966 2.809648) (xy -2.173374 2.846316) (xy -2.137088 2.882985) (xy -2.013968 2.760327)
    (xy -1.977105 2.793182) (xy -1.93233 2.827376) (xy -1.888871 2.848981) (xy -1.84676 2.857989)
    (xy -1.806028 2.854392) (xy -1.785734 2.847674) (xy -1.760523 2.83286) (xy -1.734228 2.810489)
    (xy -1.710974 2.784583) (xy -1.69489 2.759168) (xy -1.694847 2.759075) (xy -1.684602 2.729843)
    (xy -1.68203 2.701067) (xy -1.687663 2.671466) (xy -1.702033 2.63976) (xy -1.725672 2.604671)
    (xy -1.759112 2.564918) (xy -1.788508 2.533762) (xy -1.85991 2.460625) (xy -2.034785 2.635136)
    (xy -2.20966 2.809648) (xy -2.506638 2.809648) (xy -2.638604 2.677676) (xy -2.661131 2.655146)
    (xy -2.812281 2.503959) (xy -2.48216 2.503959) (xy -2.473334 2.525084) (xy -2.454058 2.560527)
    (xy -2.426373 2.597371) (xy -2.393491 2.631898) (xy -2.358625 2.660394) (xy -2.353089 2.664137)
    (xy -2.315461 2.681709) (xy -2.274841 2.68827) (xy -2.234327 2.683577) (xy -2.211178 2.675176)
    (xy -2.187141 2.658634) (xy -2.164459 2.634128) (xy -2.146881 2.606163) (xy -2.140521 2.5902)
    (xy -2.136585 2.571884) (xy -2.136023 2.552045) (xy -2.139186 2.528213) (xy -2.146425 2.497916)
    (xy -2.158089 2.458682) (xy -2.160055 2.452463) (xy -2.171187 2.413062) (xy -2.176168 2.383064)
    (xy -2.174968 2.360744) (xy -2.167556 2.344376) (xy -2.157966 2.335016) (xy -2.137144 2.326404)
    (xy -2.114984 2.329842) (xy -2.09224 2.344849) (xy -2.069666 2.370948) (xy -2.050173 2.403418)
    (xy -2.038884 2.42351) (xy -2.02891 2.438204) (xy -2.022221 2.444644) (xy -2.021735 2.444726)
    (xy -2.010677 2.442329) (xy -1.99413 2.436273) (xy -1.976005 2.428331) (xy -1.960213 2.420275)
    (xy -1.950667 2.413878) (xy -1.94945 2.411972) (xy -1.953075 2.398922) (xy -1.962713 2.378955)
    (xy -1.976509 2.355124) (xy -1.992608 2.330482) (xy -2.009156 2.308083) (xy -2.0208 2.294532)
    (xy -2.05811 2.261639) (xy -2.096573 2.240076) (xy -2.135171 2.230074) (xy -2.172885 2.231867)
    (xy -2.208695 2.245688) (xy -2.215714 2.250032) (xy -2.246302 2.275738) (xy -2.266662 2.3061)
    (xy -2.276979 2.341986) (xy -2.277439 2.384265) (xy -2.268227 2.433805) (xy -2.260531 2.460089)
    (xy -2.248841 2.499086) (xy -2.242328 2.528495) (xy -2.240937 2.550303) (xy -2.244613 2.566495)
    (xy -2.253301 2.579055) (xy -2.257145 2.582644) (xy -2.274416 2.594144) (xy -2.290779 2.595847)
    (xy -2.310421 2.587894) (xy -2.315971 2.584636) (xy -2.339719 2.56458) (xy -2.363844 2.533835)
    (xy -2.386952 2.494288) (xy -2.395251 2.477183) (xy -2.413946 2.436592) (xy -2.448053 2.470276)
    (xy -2.48216 2.503959) (xy -2.812281 2.503959) (xy -2.835257 2.480978) (xy -3.000597 2.315575)
    (xy -3.157352 2.158731) (xy -3.173062 2.143009) (xy -2.876522 2.143009) (xy -2.776669 2.243008)
    (xy -2.676817 2.343007) (xy -2.646446 2.313092) (xy -2.616075 2.283178) (xy -2.676463 2.222563)
    (xy -2.698672 2.199842) (xy -2.717204 2.180067) (xy -2.730398 2.165072) (xy -2.736591 2.156695)
    (xy -2.73685 2.15587) (xy -2.732637 2.149) (xy -2.72132 2.135541) (xy -2.704883 2.117775)
    (xy -2.694133 2.106746) (xy -2.651415 2.063698) (xy -2.592512 2.122357) (xy -2.533609 2.181015)
    (xy -2.473535 2.120941) (xy -2.532207 2.062024) (xy -2.59088 2.003106) (xy -2.5527 1.965324)
    (xy -2.51452 1.927543) (xy -2.451043 1.990782) (xy -2.387565 2.054022) (xy -2.357475 2.023931)
    (xy -2.327384 1.993841) (xy -2.527282 1.793943) (xy -2.876522 2.143009) (xy -3.173062 2.143009)
    (xy -3.305729 2.010241) (xy -3.445929 1.869898) (xy -3.493341 1.822424) (xy -3.197113 1.822424)
    (xy -3.124245 1.895292) (xy -2.990859 1.76236) (xy -2.95126 1.801959) (xy -2.97423 1.901634)
    (xy -2.982043 1.936158) (xy -2.988715 1.966833) (xy -2.993756 1.991302) (xy -2.996674 2.007209)
    (xy -2.9972 2.011708) (xy -2.99322 2.020486) (xy -2.982887 2.034232) (xy -2.968615 2.050461)
    (xy -2.952816 2.066693) (xy -2.937902 2.080442) (xy -2.926286 2.089226) (xy -2.920471 2.090677)
    (xy -2.917977 2.083168) (xy -2.913698 2.06529) (xy -2.908097 2.039177) (xy -2.901634 2.006959)
    (xy -2.896115 1.978025) (xy -2.889325 1.941958) (xy -2.883153 1.909797) (xy -2.878043 1.883813)
    (xy -2.874442 1.866276) (xy -2.872967 1.859924) (xy -2.86936 1.85469) (xy -2.860705 1.852079)
    (xy -2.844305 1.851698) (xy -2.823682 1.852742) (xy -2.784447 1.852014) (xy -2.752554 1.843206)
    (xy -2.724513 1.824867) (xy -2.702516 1.802368) (xy -2.682004 1.773484) (xy -2.670572 1.744487)
    (xy -2.668511 1.714399) (xy -2.676114 1.68224) (xy -2.693673 1.647032) (xy -2.72148 1.607797)
    (xy -2.759826 1.563556) (xy -2.780135 1.54223) (xy -2.847975 1.472587) (xy -3.022544 1.647505)
    (xy -3.197113 1.822424) (xy -3.493341 1.822424) (xy -3.578158 1.737498) (xy -3.702618 1.612836)
    (xy -3.819515 1.495706) (xy -3.819795 1.495425) (xy -3.524807 1.495425) (xy -3.443566 1.57506)
    (xy -3.404417 1.612425) (xy -3.37171 1.641044) (xy -3.343773 1.661944) (xy -3.318934 1.676148)
    (xy -3.295521 1.684681) (xy -3.271864 1.688569) (xy -3.257547 1.6891) (xy -3.231327 1.687255)
    (xy -3.209882 1.680272) (xy -3.192433 1.670389) (xy -3.165071 1.648093) (xy -3.142749 1.620512)
    (xy -3.128704 1.591802) (xy -3.127259 1.586652) (xy -3.1267 1.564193) (xy -3.133379 1.534593)
    (xy -3.14035 1.515323) (xy -3.142545 1.507268) (xy -3.137232 1.507868) (xy -3.131931 1.510561)
    (xy -3.111654 1.516313) (xy -3.085887 1.517097) (xy -3.060759 1.513067) (xy -3.048628 1.508449)
    (xy -3.02536 1.491338) (xy -3.003713 1.466846) (xy -2.987853 1.440032) (xy -2.984182 1.430191)
    (xy -2.980215 1.407047) (xy -2.982602 1.383053) (xy -2.992004 1.357035) (xy -3.009079 1.327814)
    (xy -3.034487 1.294215) (xy -3.068887 1.255059) (xy -3.1015 1.220812) (xy -3.17436 1.146175)
    (xy -3.349583 1.3208) (xy -3.524807 1.495425) (xy -3.819795 1.495425) (xy -3.929051 1.385903)
    (xy -3.981474 1.333325) (xy -3.685914 1.333325) (xy -3.651337 1.368337) (xy -3.634555 1.384913)
    (xy -3.62128 1.397249) (xy -3.61391 1.403138) (xy -3.613324 1.40335) (xy -3.608224 1.39901)
    (xy -3.595155 1.38664) (xy -3.57511 1.367211) (xy -3.549077 1.341695) (xy -3.518048 1.311062)
    (xy -3.483012 1.276285) (xy -3.444961 1.238335) (xy -3.436816 1.230191) (xy -3.263743 1.057032)
    (xy -3.300448 1.020711) (xy -3.337152 0.98439) (xy -3.511533 1.158857) (xy -3.685914 1.333325)
    (xy -3.981474 1.333325) (xy -4.03143 1.283222) (xy -4.126857 1.187456) (xy -4.215534 1.098402)
    (xy -4.253323 1.060421) (xy -3.95911 1.060421) (xy -3.854465 1.16521) (xy -3.824701 1.194871)
    (xy -3.797929 1.221275) (xy -3.775442 1.243169) (xy -3.758533 1.259301) (xy -3.748495 1.268418)
    (xy -3.746307 1.27) (xy -3.740379 1.265816) (xy -3.728403 1.254907) (xy -3.714673 1.241345)
    (xy -3.68655 1.212691) (xy -3.756132 1.142892) (xy -3.825714 1.073094) (xy -3.684507 0.931782)
    (xy -3.649847 0.896896) (xy -3.618271 0.86473) (xy -3.590859 0.836416) (xy -3.568692 0.813082)
    (xy -3.552848 0.795859) (xy -3.544407 0.785878) (xy -3.5433 0.783956) (xy -3.547535 0.776612)
    (xy -3.558706 0.763263) (xy -3.57452 0.746624) (xy -3.576759 0.744398) (xy -3.610217 0.711355)
    (xy -3.784664 0.885888) (xy -3.95911 1.060421) (xy -4.253323 1.060421) (xy -4.297667 1.015853)
    (xy -4.373458 0.939605) (xy -4.443112 0.869451) (xy -4.506832 0.805187) (xy -4.564823 0.746607)
    (xy -4.617287 0.693506) (xy -4.664429 0.645679) (xy -4.706453 0.60292) (xy -4.743563 0.565024)
    (xy -4.775962 0.531786) (xy -4.803854 0.503) (xy -4.827443 0.478461) (xy -4.846933 0.457964)
    (xy -4.862527 0.441303) (xy -4.87443 0.428273) (xy -4.882845 0.418669) (xy -4.887977 0.412285)
    (xy -4.888846 0.411058) (xy -4.926166 0.349208) (xy -4.959188 0.28163) (xy -4.985511 0.213518)
    (xy -4.99577 0.179561) (xy -5.001826 0.156041) (xy -5.006225 0.135372) (xy -5.009226 0.114754)
    (xy -5.011091 0.091387) (xy -5.012081 0.06247) (xy -5.012457 0.025203) (xy -5.012497 0)
    (xy -3.673373 0) (xy -3.67326 0.045174) (xy -3.672771 0.080266) (xy -3.671677 0.107892)
    (xy -3.669749 0.130671) (xy -3.666759 0.151217) (xy -3.662479 0.17215) (xy -3.65668 0.196085)
    (xy -3.656047 0.198589) (xy -3.628446 0.289065) (xy -3.592528 0.373501) (xy -3.546787 0.455078)
    (xy -3.506548 0.51435) (xy -3.498128 0.524207) (xy -3.480713 0.542986) (xy -3.454323 0.570665)
    (xy -3.418982 0.607222) (xy -3.37471 0.652636) (xy -3.321529 0.706885) (xy -3.25946 0.769947)
    (xy -3.188526 0.8418) (xy -3.108746 0.922422) (xy -3.020144 1.011793) (xy -2.92274 1.109889)
    (xy -2.816556 1.21669) (xy -2.701614 1.332173) (xy -2.577935 1.456318) (xy -2.445541 1.589101)
    (xy -2.304453 1.730501) (xy -2.154693 1.880498) (xy -2.067761 1.967527) (xy -1.955264 2.080115)
    (xy -1.844693 2.19074) (xy -1.736409 2.299041) (xy -1.630775 2.404656) (xy -1.528153 2.507224)
    (xy -1.428906 2.606384) (xy -1.333397 2.701774) (xy -1.241987 2.793033) (xy -1.15504 2.879799)
    (xy -1.072917 2.961712) (xy -0.995982 3.038409) (xy -0.924595 3.10953) (xy -0.859121 3.174713)
    (xy -0.799921 3.233597) (xy -0.747358 3.28582) (xy -0.701794 3.33102) (xy -0.663592 3.368838)
    (xy -0.633114 3.39891) (xy -0.610723 3.420877) (xy -0.59678 3.434376) (xy -0.593402 3.437552)
    (xy -0.564182 3.46359) (xy -0.533692 3.489388) (xy -0.505182 3.512279) (xy -0.481901 3.529598)
    (xy -0.477983 3.532276) (xy -0.398035 3.579702) (xy -0.313703 3.618523) (xy -0.228124 3.64742)
    (xy -0.174153 3.660095) (xy -0.148723 3.665064) (xy -0.126911 3.669462) (xy -0.112732 3.672475)
    (xy -0.111125 3.672849) (xy -0.100912 3.673718) (xy -0.080273 3.67426) (xy -0.051479 3.67446)
    (xy -0.0168 3.674301) (xy 0.01905 3.67381) (xy 0.063926 3.672783) (xy 0.099092 3.671321)
    (xy 0.127536 3.669118) (xy 0.152247 3.665871) (xy 0.176213 3.661273) (xy 0.201908 3.655151)
    (xy 0.29396 3.626846) (xy 0.380045 3.589605) (xy 0.463096 3.542036) (xy 0.475093 3.533775)
    (xy 0.879573 3.533775) (xy 0.88233 3.572092) (xy 0.891275 3.606486) (xy 0.907657 3.639515)
    (xy 0.932727 3.673741) (xy 0.9652 3.709158) (xy 1.013108 3.751521) (xy 1.060942 3.781186)
    (xy 1.108707 3.798155) (xy 1.156411 3.80243) (xy 1.204059 3.794012) (xy 1.236023 3.781239)
    (xy 1.269146 3.760507) (xy 1.303039 3.731575) (xy 1.333962 3.698117) (xy 1.358178 3.663805)
    (xy 1.361403 3.658067) (xy 1.377615 3.615517) (xy 1.38391 3.568896) (xy 1.379908 3.522521)
    (xy 1.374988 3.503919) (xy 1.355864 3.461653) (xy 1.327034 3.419018) (xy 1.291075 3.378881)
    (xy 1.250561 3.344111) (xy 1.208067 3.317576) (xy 1.207404 3.317244) (xy 1.180933 3.306073)
    (xy 1.153762 3.299716) (xy 1.122506 3.296832) (xy 1.09558 3.296039) (xy 1.075702 3.297672)
    (xy 1.057295 3.30278) (xy 1.034782 3.312414) (xy 1.031401 3.313989) (xy 0.990748 3.338579)
    (xy 0.952013 3.372141) (xy 0.918856 3.411066) (xy 0.897713 3.445831) (xy 0.887897 3.467946)
    (xy 0.882352 3.487704) (xy 0.879963 3.510508) (xy 0.879573 3.533775) (xy 0.475093 3.533775)
    (xy 0.51435 3.506745) (xy 0.523348 3.498951) (xy 0.540881 3.482565) (xy 0.566533 3.458002)
    (xy 0.599893 3.425675) (xy 0.640546 3.385998) (xy 0.688078 3.339383) (xy 0.742077 3.286245)
    (xy 0.802129 3.226997) (xy 0.86782 3.162053) (xy 0.889769 3.140317) (xy 1.193923 3.140317)
    (xy 1.319274 3.264984) (xy 1.35308 3.29822) (xy 1.385062 3.328939) (xy 1.413813 3.355845)
    (xy 1.437925 3.377644) (xy 1.455992 3.39304) (xy 1.466606 3.400736) (xy 1.46685 3.400862)
    (xy 1.507081 3.416033) (xy 1.546594 3.419798) (xy 1.587736 3.412151) (xy 1.617521 3.400579)
    (xy 1.650426 3.380535) (xy 1.683409 3.351773) (xy 1.713038 3.31778) (xy 1.73588 3.282044)
    (xy 1.737625 3.278577) (xy 1.749489 3.249955) (xy 1.754752 3.223385) (xy 1.755477 3.203575)
    (xy 1.754705 3.183296) (xy 1.752053 3.165012) (xy 1.746612 3.147379) (xy 1.737473 3.129052)
    (xy 1.723726 3.108685) (xy 1.704462 3.084934) (xy 1.67877 3.056454) (xy 1.645742 3.0219)
    (xy 1.604469 2.979927) (xy 1.603711 2.979163) (xy 1.480017 2.854325) (xy 1.443496 2.89068)
    (xy 1.406976 2.927036) (xy 1.518654 3.039905) (xy 1.55024 3.072168) (xy 1.579472 3.102668)
    (xy 1.604935 3.129876) (xy 1.625215 3.152268) (xy 1.638897 3.168316) (xy 1.643817 3.175)
    (xy 1.654425 3.201665) (xy 1.657326 3.224233) (xy 1.656193 3.240242) (xy 1.651364 3.253436)
    (xy 1.640746 3.267862) (xy 1.627187 3.282479) (xy 1.602853 3.304599) (xy 1.580849 3.316717)
    (xy 1.557804 3.320179) (xy 1.538325 3.318003) (xy 1.529863 3.315414) (xy 1.519858 3.310021)
    (xy 1.507169 3.300837) (xy 1.490654 3.286878) (xy 1.469173 3.267159) (xy 1.441585 3.240695)
    (xy 1.406748 3.2065) (xy 1.390463 3.190373) (xy 1.266291 3.067187) (xy 1.193923 3.140317)
    (xy 0.889769 3.140317) (xy 0.938737 3.091826) (xy 1.014466 3.016729) (xy 1.094594 2.937176)
    (xy 1.178707 2.853581) (xy 1.26115 2.771573) (xy 1.561983 2.771573) (xy 1.734958 2.944633)
    (xy 1.907933 3.117694) (xy 1.941869 3.084434) (xy 1.975805 3.051175) (xy 1.844881 2.922587)
    (xy 1.811667 2.889843) (xy 1.781811 2.860174) (xy 1.756403 2.834681) (xy 1.736533 2.814467)
    (xy 1.723292 2.800635) (xy 1.717771 2.794288) (xy 1.71773 2.794) (xy 1.724552 2.795596)
    (xy 1.742162 2.800127) (xy 1.769091 2.807201) (xy 1.803869 2.816431) (xy 1.845028 2.827427)
    (xy 1.891097 2.839798) (xy 1.922381 2.848232) (xy 2.123258 2.902464) (xy 2.216266 2.810076)
    (xy 2.04323 2.636954) (xy 1.870193 2.463832) (xy 1.806575 2.527504) (xy 1.935162 2.655665)
    (xy 1.968138 2.688562) (xy 1.997986 2.718395) (xy 2.023579 2.744035) (xy 2.04379 2.764348)
    (xy 2.05749 2.778204) (xy 2.063552 2.78447) (xy 2.06375 2.784716) (xy 2.05785 2.783367)
    (xy 2.041103 2.779128) (xy 2.014934 2.77237) (xy 1.98077 2.763465) (xy 1.940037 2.752784)
    (xy 1.89416 2.740699) (xy 1.860081 2.73169) (xy 1.656413 2.677773) (xy 1.561983 2.771573)
    (xy 1.26115 2.771573) (xy 1.266393 2.766358) (xy 1.357236 2.675918) (xy 1.450825 2.582677)
    (xy 1.546745 2.487048) (xy 1.644582 2.389444) (xy 1.659604 2.374448) (xy 1.958975 2.374448)
    (xy 2.13038 2.546124) (xy 2.168749 2.584453) (xy 2.204327 2.619803) (xy 2.236116 2.651197)
    (xy 2.263119 2.677657) (xy 2.284337 2.698207) (xy 2.298773 2.711869) (xy 2.305428 2.717666)
    (xy 2.305717 2.7178) (xy 2.311231 2.713465) (xy 2.323971 2.701478) (xy 2.342381 2.68336)
    (xy 2.364907 2.660634) (xy 2.381961 2.64314) (xy 2.418692 2.603795) (xy 2.44669 2.570154)
    (xy 2.467266 2.540156) (xy 2.481737 2.511739) (xy 2.491417 2.482841) (xy 2.495289 2.465387)
    (xy 2.497859 2.418072) (xy 2.488268 2.37021) (xy 2.466945 2.322942) (xy 2.434316 2.27741)
    (xy 2.418428 2.260175) (xy 2.375757 2.223081) (xy 2.332143 2.198031) (xy 2.286186 2.184379)
    (xy 2.2479 2.181225) (xy 2.215785 2.182948) (xy 2.186566 2.188823) (xy 2.158333 2.199907)
    (xy 2.129174 2.217257) (xy 2.097181 2.241931) (xy 2.060441 2.274986) (xy 2.036234 2.298387)
    (xy 1.958975 2.374448) (xy 1.659604 2.374448) (xy 1.743925 2.290279) (xy 1.844358 2.189965)
    (xy 1.945468 2.088918) (xy 2.046843 1.98755) (xy 2.099706 1.93466) (xy 2.4003 1.93466)
    (xy 2.402929 1.941976) (xy 2.410346 1.959071) (xy 2.421847 1.984469) (xy 2.436726 2.016694)
    (xy 2.454279 2.054267) (xy 2.4738 2.095713) (xy 2.494585 2.139555) (xy 2.515928 2.184316)
    (xy 2.537125 2.228519) (xy 2.55747 2.270688) (xy 2.576259 2.309345) (xy 2.592786 2.343015)
    (xy 2.606347 2.37022) (xy 2.616237 2.389483) (xy 2.621751 2.399328) (xy 2.622587 2.4003)
    (xy 2.628373 2.396094) (xy 2.640682 2.384898) (xy 2.657203 2.368846) (xy 2.663125 2.362906)
    (xy 2.700128 2.325513) (xy 2.674039 2.275366) (xy 2.662376 2.252287) (xy 2.653405 2.233269)
    (xy 2.648482 2.221252) (xy 2.64795 2.218972) (xy 2.652223 2.212416) (xy 2.663928 2.198843)
    (xy 2.681392 2.18009) (xy 2.702944 2.157994) (xy 2.708413 2.152524) (xy 2.768876 2.092325)
    (xy 2.877818 2.148079) (xy 2.916871 2.108386) (xy 2.933527 2.090516) (xy 2.945133 2.076201)
    (xy 2.95003 2.067585) (xy 2.949575 2.066127) (xy 2.942618 2.062897) (xy 2.925482 2.054777)
    (xy 2.899435 2.042373) (xy 2.865746 2.02629) (xy 2.825685 2.007136) (xy 2.780521 1.985516)
    (xy 2.731523 1.962036) (xy 2.718319 1.955705) (xy 2.668541 1.931913) (xy 2.622248 1.909939)
    (xy 2.58071 1.890374) (xy 2.545197 1.873811) (xy 2.516978 1.860839) (xy 2.497324 1.852051)
    (xy 2.487504 1.848038) (xy 2.486715 1.84785) (xy 2.478903 1.852202) (xy 2.465304 1.863541)
    (xy 2.448482 1.879289) (xy 2.431005 1.896866) (xy 2.415439 1.913695) (xy 2.40435 1.927198)
    (xy 2.4003 1.93466) (xy 2.099706 1.93466) (xy 2.148068 1.886274) (xy 2.248729 1.785505)
    (xy 2.319682 1.714435) (xy 2.619477 1.714435) (xy 2.649551 1.744508) (xy 2.679624 1.774582)
    (xy 2.727357 1.727167) (xy 2.775091 1.679752) (xy 2.91629 1.820951) (xy 2.95102 1.855576)
    (xy 2.982863 1.887124) (xy 3.010719 1.914518) (xy 3.033484 1.936682) (xy 3.050057 1.952541)
    (xy 3.059334 1.961016) (xy 3.060899 1.96215) (xy 3.06666 1.95795) (xy 3.078848 1.946825)
    (xy 3.095067 1.930983) (xy 3.098881 1.927142) (xy 3.133454 1.892134) (xy 2.99082 1.749395)
    (xy 2.848187 1.606656) (xy 2.895584 1.55894) (xy 2.942982 1.511224) (xy 2.912908 1.481151)
    (xy 2.882835 1.451077) (xy 2.619477 1.714435) (xy 2.319682 1.714435) (xy 2.348415 1.685656)
    (xy 2.44671 1.58714) (xy 2.543202 1.490371) (xy 2.636218 1.397024) (xy 2.936988 1.397024)
    (xy 3.108337 1.568462) (xy 3.14669 1.606748) (xy 3.182229 1.642057) (xy 3.213958 1.673413)
    (xy 3.24088 1.699838) (xy 3.262002 1.720357) (xy 3.276326 1.733993) (xy 3.282858 1.739769)
    (xy 3.283122 1.7399) (xy 3.288896 1.7357) (xy 3.301095 1.724573) (xy 3.317322 1.708728)
    (xy 3.32115 1.704873) (xy 3.355742 1.669846) (xy 3.009954 1.324058) (xy 2.936988 1.397024)
    (xy 2.636218 1.397024) (xy 2.637476 1.395762) (xy 2.729121 1.303727) (xy 2.768115 1.264535)
    (xy 3.167296 1.264535) (xy 3.179224 1.312502) (xy 3.203567 1.360232) (xy 3.240303 1.407257)
    (xy 3.260426 1.42764) (xy 3.30714 1.46712) (xy 3.35189 1.494487) (xy 3.395653 1.509986)
    (xy 3.439408 1.513859) (xy 3.48413 1.506348) (xy 3.521075 1.492394) (xy 3.570097 1.463294)
    (xy 3.611298 1.425599) (xy 3.643305 1.380925) (xy 3.664748 1.330892) (xy 3.66794 1.319212)
    (xy 3.673377 1.295029) (xy 3.675295 1.277075) (xy 3.673694 1.25938) (xy 3.668577 1.23597)
    (xy 3.667971 1.233487) (xy 3.651082 1.187746) (xy 3.623911 1.142136) (xy 3.588648 1.099192)
    (xy 3.547481 1.061446) (xy 3.502599 1.031431) (xy 3.48615 1.023097) (xy 3.461536 1.013441)
    (xy 3.437062 1.008408) (xy 3.40666 1.0068) (xy 3.403563 1.006783) (xy 3.35997 1.01085)
    (xy 3.320028 1.024041) (xy 3.28139 1.047429) (xy 3.244174 1.079658) (xy 3.206222 1.123892)
    (xy 3.180773 1.169761) (xy 3.167805 1.216798) (xy 3.167296 1.264535) (xy 2.768115 1.264535)
    (xy 2.817721 1.214679) (xy 2.902864 1.129033) (xy 2.984135 1.0472) (xy 3.061123 0.969596)
    (xy 3.133412 0.896633) (xy 3.178646 0.850907) (xy 3.48307 0.850907) (xy 3.654428 1.022353)
    (xy 3.692783 1.060641) (xy 3.728325 1.095951) (xy 3.760057 1.127308) (xy 3.786984 1.153735)
    (xy 3.808111 1.174255) (xy 3.822441 1.187892) (xy 3.828979 1.193669) (xy 3.829244 1.1938)
    (xy 3.835059 1.18959) (xy 3.847118 1.178511) (xy 3.862902 1.162885) (xy 3.864213 1.161546)
    (xy 3.895725 1.129293) (xy 3.762377 0.998334) (xy 3.729175 0.965533) (xy 3.699649 0.935992)
    (xy 3.674818 0.910758) (xy 3.655697 0.890878) (xy 3.643302 0.877401) (xy 3.638651 0.871372)
    (xy 3.639015 0.871206) (xy 3.648967 0.874323) (xy 3.669006 0.880049) (xy 3.697325 0.887903)
    (xy 3.732118 0.897403) (xy 3.771577 0.90807) (xy 3.813896 0.919422) (xy 3.857268 0.930979)
    (xy 3.899886 0.942259) (xy 3.939943 0.952782) (xy 3.975632 0.962066) (xy 4.005146 0.969632)
    (xy 4.026679 0.974997) (xy 4.038423 0.977682) (xy 4.039915 0.9779) (xy 4.047801 0.973625)
    (xy 4.062085 0.962125) (xy 4.080418 0.945379) (xy 4.092652 0.933371) (xy 4.136839 0.888843)
    (xy 3.791011 0.543015) (xy 3.759098 0.574927) (xy 3.727186 0.60684) (xy 3.856545 0.73522)
    (xy 3.889465 0.768014) (xy 3.919037 0.797711) (xy 3.944172 0.823199) (xy 3.963782 0.843366)
    (xy 3.97678 0.8571) (xy 3.982079 0.86329) (xy 3.982089 0.86353) (xy 3.975253 0.861925)
    (xy 3.957628 0.857407) (xy 3.930687 0.850363) (xy 3.895906 0.841181) (xy 3.854758 0.830251)
    (xy 3.808717 0.81796) (xy 3.77825 0.809798) (xy 3.578225 0.756136) (xy 3.530647 0.803521)
    (xy 3.48307 0.850907) (xy 3.178646 0.850907) (xy 3.20059 0.828725) (xy 3.262243 0.766285)
    (xy 3.317957 0.709728) (xy 3.36732 0.659466) (xy 3.409917 0.615912) (xy 3.445335 0.579482)
    (xy 3.473161 0.550587) (xy 3.492981 0.529642) (xy 3.504382 0.51706) (xy 3.506574 0.51435)
    (xy 3.560313 0.432947) (xy 3.603154 0.351063) (xy 3.636607 0.265507) (xy 3.656046 0.198589)
    (xy 3.662 0.174236) (xy 3.666413 0.153133) (xy 3.669515 0.132661) (xy 3.671533 0.110205)
    (xy 3.672696 0.083147) (xy 3.673233 0.04887) (xy 3.673371 0.004758) (xy 3.673372 0)
    (xy 3.673259 -0.045175) (xy 3.67277 -0.080267) (xy 3.671676 -0.107893) (xy 3.669748 -0.130672)
    (xy 3.666758 -0.151218) (xy 3.662478 -0.172151) (xy 3.656679 -0.196086) (xy 3.656046 -0.19859)
    (xy 3.628518 -0.288866) (xy 3.592708 -0.373131) (xy 3.547109 -0.454575) (xy 3.506574 -0.51435)
    (xy 3.498872 -0.523258) (xy 3.482575 -0.540705) (xy 3.458096 -0.566276) (xy 3.425849 -0.599559)
    (xy 3.386248 -0.64014) (xy 3.339706 -0.687605) (xy 3.286637 -0.741541) (xy 3.227454 -0.801535)
    (xy 3.16257 -0.867173) (xy 3.0924 -0.938041) (xy 3.017356 -1.013726) (xy 2.937852 -1.093815)
    (xy 2.854301 -1.177893) (xy 2.767118 -1.265548) (xy 2.676715 -1.356366) (xy 2.583506 -1.449933)
    (xy 2.573211 -1.460261) (xy 2.930889 -1.460261) (xy 3.051294 -1.339731) (xy 3.083289 -1.307828)
    (xy 3.112345 -1.279096) (xy 3.137263 -1.2547) (xy 3.156843 -1.235808) (xy 3.169887 -1.223586)
    (xy 3.175194 -1.219201) (xy 3.175202 -1.2192) (xy 3.181125 -1.223384) (xy 3.193097 -1.234293)
    (xy 3.206832 -1.247859) (xy 3.234959 -1.276518) (xy 3.160529 -1.351142) (xy 3.135774 -1.376138)
    (xy 3.114504 -1.397951) (xy 3.098205 -1.41503) (xy 3.088359 -1.425828) (xy 3.086098 -1.428846)
    (xy 3.092125 -1.429799) (xy 3.108914 -1.430632) (xy 3.134527 -1.431297) (xy 3.167028 -1.431743)
    (xy 3.204478 -1.431924) (xy 3.208336 -1.431925) (xy 3.251155 -1.432015) (xy 3.283446 -1.432422)
    (xy 3.307379 -1.433356) (xy 3.325124 -1.435027) (xy 3.338852 -1.437645) (xy 3.350733 -1.441419)
    (xy 3.36294 -1.446559) (xy 3.363766 -1.446932) (xy 3.399537 -1.468424) (xy 3.428019 -1.496253)
    (xy 3.44785 -1.528299) (xy 3.457672 -1.562438) (xy 3.456986 -1.592357) (xy 3.44348 -1.632988)
    (xy 3.419339 -1.670887) (xy 3.386594 -1.70427) (xy 3.347274 -1.73135) (xy 3.30341 -1.750344)
    (xy 3.268337 -1.758264) (xy 3.233558 -1.762984) (xy 3.229679 -1.734681) (xy 3.226334 -1.70786)
    (xy 3.226057 -1.690844) (xy 3.230062 -1.680873) (xy 3.239561 -1.675187) (xy 3.255769 -1.671027)
    (xy 3.257867 -1.670576) (xy 3.293425 -1.660424) (xy 3.320134 -1.646329) (xy 3.341691 -1.626316)
    (xy 3.342518 -1.625341) (xy 3.356007 -1.603461) (xy 3.357376 -1.582814) (xy 3.34661 -1.561221)
    (xy 3.341983 -1.555374) (xy 3.331326 -1.543631) (xy 3.320311 -1.5344) (xy 3.307276 -1.527346)
    (xy 3.29056 -1.522134) (xy 3.268499 -1.518429) (xy 3.239432 -1.515897) (xy 3.201698 -1.514202)
    (xy 3.153633 -1.51301) (xy 3.129615 -1.512572) (xy 2.979455 -1.509998) (xy 2.955172 -1.48513)
    (xy 2.930889 -1.460261) (xy 2.573211 -1.460261) (xy 2.487905 -1.545836) (xy 2.390324 -1.643661)
    (xy 2.291178 -1.742995) (xy 2.19088 -1.843424) (xy 2.120074 -1.914283) (xy 2.476342 -1.914283)
    (xy 2.549834 -1.841559) (xy 2.609879 -1.901855) (xy 2.635595 -1.927201) (xy 2.654565 -1.944524)
    (xy 2.668591 -1.955194) (xy 2.679477 -1.960581) (xy 2.689023 -1.962054) (xy 2.689099 -1.962053)
    (xy 2.701899 -1.961686) (xy 2.711039 -1.959676) (xy 2.716629 -1.954441) (xy 2.718781 -1.944396)
    (xy 2.717603 -1.927958) (xy 2.713208 -1.903543) (xy 2.705705 -1.869568) (xy 2.697893 -1.835954)
    (xy 2.670907 -1.720481) (xy 2.71177 -1.679252) (xy 2.729855 -1.662026) (xy 2.744401 -1.650094)
    (xy 2.753376 -1.645028) (xy 2.75518 -1.645666) (xy 2.757265 -1.653804) (xy 2.761736 -1.672496)
    (xy 2.768165 -1.69991) (xy 2.773294 -1.722023) (xy 2.868364 -1.722023) (xy 2.928019 -1.661473)
    (xy 2.950513 -1.639093) (xy 2.970154 -1.620393) (xy 2.985097 -1.607069) (xy 2.993494 -1.600819)
    (xy 2.99429 -1.600562) (xy 3.001961 -1.604589) (xy 3.015101 -1.6154) (xy 3.027567 -1.627367)
    (xy 3.054229 -1.654534) (xy 2.990772 -1.717753) (xy 2.927314 -1.780973) (xy 2.868364 -1.722023)
    (xy 2.773294 -1.722023) (xy 2.776123 -1.734215) (xy 2.785183 -1.773581) (xy 2.790991 -1.798955)
    (xy 2.800679 -1.840285) (xy 2.809861 -1.877433) (xy 2.818058 -1.908614) (xy 2.82479 -1.932046)
    (xy 2.829578 -1.945945) (xy 2.831341 -1.948982) (xy 2.839564 -1.950995) (xy 2.858402 -1.954072)
    (xy 2.885842 -1.957935) (xy 2.919871 -1.962302) (xy 2.958474 -1.966893) (xy 2.967027 -1.967866)
    (xy 3.005881 -1.972304) (xy 3.040162 -1.976326) (xy 3.067972 -1.979702) (xy 3.087411 -1.9822)
    (xy 3.096578 -1.983587) (xy 3.097038 -1.983728) (xy 3.093489 -1.988463) (xy 3.082798 -2.000003)
    (xy 3.066911 -2.01628) (xy 3.058054 -2.025126) (xy 3.017656 -2.065165) (xy 2.901065 -2.051439)
    (xy 2.862336 -2.046831) (xy 2.826518 -2.04248) (xy 2.796107 -2.038696) (xy 2.7736 -2.035789)
    (xy 2.76225 -2.034193) (xy 2.754669 -2.03334) (xy 2.750901 -2.034477) (xy 2.751817 -2.038779)
    (xy 2.758287 -2.047423) (xy 2.771182 -2.061582) (xy 2.791372 -2.082432) (xy 2.817866 -2.10927)
    (xy 2.895707 -2.187867) (xy 2.859027 -2.224164) (xy 2.822348 -2.26046) (xy 2.649345 -2.087372)
    (xy 2.476342 -1.914283) (xy 2.120074 -1.914283) (xy 2.089844 -1.944535) (xy 1.988482 -2.045914)
    (xy 1.957731 -2.076654) (xy 2.314807 -2.076654) (xy 2.349399 -2.041627) (xy 2.366184 -2.025048)
    (xy 2.379463 -2.012707) (xy 2.386839 -2.006813) (xy 2.387427 -2.0066) (xy 2.39253 -2.010939)
    (xy 2.405596 -2.023304) (xy 2.425629 -2.042718) (xy 2.451633 -2.068205) (xy 2.482612 -2.098789)
    (xy 2.517572 -2.133493) (xy 2.555516 -2.171341) (xy 2.562212 -2.178038) (xy 2.733561 -2.349476)
    (xy 2.660595 -2.422442) (xy 2.314807 -2.076654) (xy 1.957731 -2.076654) (xy 1.887209 -2.147148)
    (xy 1.786438 -2.247824) (xy 1.686583 -2.347527) (xy 1.630381 -2.40361) (xy 1.987598 -2.40361)
    (xy 2.065361 -2.325442) (xy 2.099319 -2.291734) (xy 2.126451 -2.266019) (xy 2.148523 -2.246935)
    (xy 2.167301 -2.233123) (xy 2.18455 -2.223222) (xy 2.202037 -2.215872) (xy 2.211858 -2.212591)
    (xy 2.237435 -2.205869) (xy 2.258071 -2.204472) (xy 2.280267 -2.20821) (xy 2.288417 -2.210364)
    (xy 2.31207 -2.221728) (xy 2.336874 -2.241254) (xy 2.359244 -2.265318) (xy 2.375594 -2.290298)
    (xy 2.380927 -2.303852) (xy 2.384562 -2.325808) (xy 2.381625 -2.346702) (xy 2.378479 -2.35674)
    (xy 2.373229 -2.373319) (xy 2.370749 -2.38391) (xy 2.370837 -2.385655) (xy 2.377272 -2.38484)
    (xy 2.390645 -2.380546) (xy 2.392209 -2.379964) (xy 2.417256 -2.376794) (xy 2.445299 -2.383274)
    (xy 2.473379 -2.397833) (xy 2.498538 -2.418901) (xy 2.517819 -2.44491) (xy 2.519081 -2.447276)
    (xy 2.528241 -2.472096) (xy 2.529806 -2.497799) (xy 2.523271 -2.525448) (xy 2.508132 -2.556108)
    (xy 2.483885 -2.590839) (xy 2.450025 -2.630707) (xy 2.414006 -2.668716) (xy 2.334178 -2.750018)
    (xy 1.987598 -2.40361) (xy 1.630381 -2.40361) (xy 1.588056 -2.445844) (xy 1.491272 -2.542362)
    (xy 1.396643 -2.636667) (xy 1.304584 -2.728346) (xy 1.215508 -2.816985) (xy 1.129828 -2.90217)
    (xy 1.047958 -2.983489) (xy 0.970312 -3.060527) (xy 0.897302 -3.132871) (xy 0.853938 -3.175775)
    (xy 1.302286 -3.175775) (xy 1.30507 -3.130337) (xy 1.319794 -3.0855) (xy 1.34673 -3.04002)
    (xy 1.352483 -3.032213) (xy 1.382412 -2.992672) (xy 1.375972 -2.9247) (xy 1.369531 -2.856728)
    (xy 1.413132 -2.812791) (xy 1.43588 -2.790917) (xy 1.451315 -2.778605) (xy 1.459989 -2.775448)
    (xy 1.461693 -2.776665) (xy 1.461832 -2.77722) (xy 1.684766 -2.77722) (xy 1.689381 -2.733588)
    (xy 1.705874 -2.690372) (xy 1.733901 -2.648686) (xy 1.75175 -2.629145) (xy 1.794126 -2.5929)
    (xy 1.83643 -2.569221) (xy 1.879135 -2.557984) (xy 1.922712 -2.559067) (xy 1.967633 -2.572346)
    (xy 1.9685 -2.572715) (xy 1.981033 -2.579801) (xy 1.997992 -2.592504) (xy 2.020229 -2.611583)
    (xy 2.048597 -2.637799) (xy 2.083949 -2.671912) (xy 2.122425 -2.709979) (xy 2.247776 -2.835033)
    (xy 2.175408 -2.908163) (xy 2.051236 -2.784977) (xy 2.013168 -2.747402) (xy 1.982806 -2.717952)
    (xy 1.959009 -2.695643) (xy 1.940638 -2.679489) (xy 1.92655 -2.668506) (xy 1.915604 -2.661709)
    (xy 1.906659 -2.658113) (xy 1.903374 -2.657347) (xy 1.875327 -2.655451) (xy 1.851208 -2.662463)
    (xy 1.826593 -2.679709) (xy 1.825417 -2.680735) (xy 1.800676 -2.708405) (xy 1.786835 -2.737617)
    (xy 1.7844 -2.766751) (xy 1.791376 -2.789655) (xy 1.797616 -2.797749) (xy 1.811605 -2.813456)
    (xy 1.832082 -2.83544) (xy 1.857784 -2.862365) (xy 1.887452 -2.892894) (xy 1.918445 -2.924305)
    (xy 2.038489 -3.045085) (xy 2.001649 -3.081541) (xy 1.964808 -3.117997) (xy 1.834192 -2.986161)
    (xy 1.795931 -2.947411) (xy 1.765665 -2.916354) (xy 1.742346 -2.891763) (xy 1.724927 -2.872414)
    (xy 1.71236 -2.857078) (xy 1.703599 -2.844532) (xy 1.697596 -2.83355) (xy 1.693303 -2.822904)
    (xy 1.692377 -2.820158) (xy 1.684766 -2.77722) (xy 1.461832 -2.77722) (xy 1.464203 -2.786621)
    (xy 1.466038 -2.805266) (xy 1.466806 -2.828589) (xy 1.466807 -2.828925) (xy 1.467501 -2.857731)
    (xy 1.469145 -2.887081) (xy 1.470908 -2.906241) (xy 1.473571 -2.925244) (xy 1.476823 -2.934205)
    (xy 1.482528 -2.935717) (xy 1.490316 -2.933228) (xy 1.514409 -2.928335) (xy 1.545408 -2.928004)
    (xy 1.578428 -2.932077) (xy 1.597747 -2.936735) (xy 1.637068 -2.95356) (xy 1.677645 -2.979948)
    (xy 1.716702 -3.013421) (xy 1.751461 -3.0515) (xy 1.779147 -3.091707) (xy 1.786276 -3.105056)
    (xy 1.79662 -3.127524) (xy 1.802709 -3.146255) (xy 1.805618 -3.166334) (xy 1.806422 -3.192846)
    (xy 1.806422 -3.200306) (xy 1.805756 -3.22922) (xy 1.8033 -3.250192) (xy 1.798078 -3.267957)
    (xy 1.789114 -3.287246) (xy 1.788083 -3.289231) (xy 1.766509 -3.322036) (xy 1.736768 -3.355683)
    (xy 1.702561 -3.386492) (xy 1.66759 -3.410784) (xy 1.663446 -3.413125) (xy 1.644442 -3.422772)
    (xy 1.627805 -3.428498) (xy 1.608923 -3.431293) (xy 1.583184 -3.432149) (xy 1.574705 -3.432175)
    (xy 1.5459 -3.431604) (xy 1.524654 -3.429163) (xy 1.505852 -3.423765) (xy 1.484377 -3.414321)
    (xy 1.47942 -3.411904) (xy 1.441076 -3.388338) (xy 1.403229 -3.356661) (xy 1.368401 -3.319704)
    (xy 1.339115 -3.280302) (xy 1.317895 -3.241284) (xy 1.311175 -3.22306) (xy 1.302286 -3.175775)
    (xy 0.853938 -3.175775) (xy 0.829343 -3.200108) (xy 0.766847 -3.261824) (xy 0.710229 -3.317606)
    (xy 0.659902 -3.367039) (xy 0.616279 -3.409711) (xy 0.579774 -3.445208) (xy 0.5508 -3.473117)
    (xy 0.529771 -3.493023) (xy 0.5171 -3.504514) (xy 0.51435 -3.506746) (xy 0.433207 -3.560561)
    (xy 0.351062 -3.60344) (xy 0.264622 -3.636938) (xy 0.198589 -3.655942) (xy 0.173412 -3.662033)
    (xy 0.151523 -3.666503) (xy 0.130152 -3.669605) (xy 0.106527 -3.671588) (xy 0.077878 -3.672702)
    (xy 0.041432 -3.6732) (xy 0.00635 -3.673319) (xy -0.043472 -3.673065) (xy -0.083147 -3.672054)
    (xy -0.115212 -3.670123) (xy -0.142207 -3.66711) (xy -0.16667 -3.66285) (xy -0.170978 -3.661944)
    (xy -0.265784 -3.63648) (xy -0.353928 -3.602019) (xy -0.437228 -3.557608) (xy -0.517502 -3.502294)
    (xy -0.586999 -3.44392) (xy -0.600577 -3.431149) (xy -0.622395 -3.410068) (xy -0.652039 -3.381093)
    (xy -0.689096 -3.344637) (xy -0.733154 -3.301116) (xy -0.783797 -3.250945) (xy -0.840614 -3.194538)
    (xy -0.90319 -3.132311) (xy -0.971112 -3.064677) (xy -1.043968 -2.992053) (xy -1.121342 -2.914853)
    (xy -1.202823 -2.833491) (xy -1.287996 -2.748383) (xy -1.376448 -2.659943) (xy -1.467767 -2.568586)
    (xy -1.561537 -2.474728) (xy -1.657347 -2.378782) (xy -1.754782 -2.281164) (xy -1.85343 -2.182288)
    (xy -1.952876 -2.08257) (xy -2.052708 -1.982425) (xy -2.152511 -1.882266) (xy -2.251874 -1.782509)
    (xy -2.350381 -1.683569) (xy -2.447621 -1.585861) (xy -2.543178 -1.489799) (xy -2.636641 -1.395798)
    (xy -2.727596 -1.304274) (xy -2.815628 -1.21564) (xy -2.900326 -1.130313) (xy -2.981275 -1.048706)
    (xy -3.058062 -0.971234) (xy -3.130273 -0.898313) (xy -3.197496 -0.830357) (xy -3.259317 -0.767781)
    (xy -3.315322 -0.711) (xy -3.365098 -0.660428) (xy -3.408232 -0.616482) (xy -3.44431 -0.579574)
    (xy -3.472918 -0.550121) (xy -3.493645 -0.528537) (xy -3.506075 -0.515236) (xy -3.50955 -0.511175)
    (xy -3.562622 -0.429775) (xy -3.60488 -0.347739) (xy -3.637909 -0.261686) (xy -3.656047 -0.19859)
    (xy -3.662001 -0.174237) (xy -3.666414 -0.153134) (xy -3.669516 -0.132662) (xy -3.671534 -0.110206)
    (xy -3.672697 -0.083148) (xy -3.673234 -0.048871) (xy -3.673372 -0.004759) (xy -3.673373 0)
    (xy -5.012497 0) (xy -5.012348 -0.043084) (xy -5.01173 -0.076271) (xy -5.010381 -0.102359)
    (xy -5.00804 -0.12415) (xy -5.004446 -0.144445) (xy -4.999338 -0.166043) (xy -4.99577 -0.179562)
    (xy -4.973889 -0.245886) (xy -4.94406 -0.314384) (xy -4.908683 -0.379865) (xy -4.888849 -0.411059)
    (xy -4.881665 -0.419535) (xy -4.86581 -0.436633) (xy -4.841621 -0.462015) (xy -4.809434 -0.495347)
    (xy -4.769582 -0.536294) (xy -4.722402 -0.58452) (xy -4.668228 -0.639691) (xy -4.607397 -0.70147)
    (xy -4.540242 -0.769524) (xy -4.4671 -0.843515) (xy -4.388306 -0.92311) (xy -4.304194 -1.007973)
    (xy -4.215101 -1.097768) (xy -4.121361 -1.192161) (xy -4.02331 -1.290816) (xy -3.921282 -1.393399)
    (xy -3.815614 -1.499572) (xy -3.70664 -1.609003) (xy -3.699594 -1.616075) (xy -3.413125 -1.616075)
    (xy -3.411376 -1.578349) (xy -3.405159 -1.546803) (xy -3.393018 -1.517715) (xy -3.373497 -1.487357)
    (xy -3.35239 -1.460615) (xy -3.309711 -1.416623) (xy -3.264039 -1.382985) (xy -3.216512 -1.360124)
    (xy -3.168269 -1.348464) (xy -3.120451 -1.348428) (xy -3.078401 -1.358804) (xy -3.054782 -1.37007)
    (xy -3.028706 -1.386059) (xy -3.011584 -1.398734) (xy -2.978343 -1.426062) (xy -2.908473 -1.419242)
    (xy -2.838603 -1.412423) (xy -2.793543 -1.457786) (xy -2.748482 -1.503149) (xy -2.76886 -1.507225)
    (xy -2.78614 -1.509399) (xy -2.810302 -1.510905) (xy -2.831307 -1.51137) (xy -2.857374 -1.512)
    (xy -2.881926 -1.513562) (xy -2.896357 -1.515241) (xy -2.919338 -1.519042) (xy -2.913274 -1.545334)
    (xy -2.909852 -1.587837) (xy -2.918071 -1.634233) (xy -2.933705 -1.675227) (xy -2.953443 -1.708287)
    (xy -2.981577 -1.743435) (xy -3.01495 -1.777488) (xy -3.050403 -1.807265) (xy -3.084776 -1.829585)
    (xy -3.089275 -1.83191) (xy -3.110549 -1.841672) (xy -3.129043 -1.847404) (xy -3.149721 -1.850129)
    (xy -3.177547 -1.850867) (xy -3.18135 -1.850871) (xy -3.210136 -1.850285) (xy -3.230976 -1.847908)
    (xy -3.248598 -1.842769) (xy -3.267731 -1.833893) (xy -3.27025 -1.832585) (xy -3.299925 -1.81321)
    (xy -3.331402 -1.786325) (xy -3.361113 -1.755521) (xy -3.385491 -1.72439) (xy -3.39725 -1.704768)
    (xy -3.405317 -1.686662) (xy -3.410138 -1.668998) (xy -3.412484 -1.647476) (xy -3.413124 -1.617795)
    (xy -3.413125 -1.616075) (xy -3.699594 -1.616075) (xy -3.594696 -1.721355) (xy -3.480116 -1.836292)
    (xy -3.363237 -1.953481) (xy -3.310238 -2.006596) (xy -3.101842 -2.006596) (xy -2.984434 -1.888823)
    (xy -2.944705 -1.849185) (xy -2.912444 -1.817615) (xy -2.886331 -1.793009) (xy -2.865048 -1.774265)
    (xy -2.847274 -1.760279) (xy -2.831691 -1.749951) (xy -2.816979 -1.742175) (xy -2.80182 -1.735851)
    (xy -2.801098 -1.73558) (xy -2.770328 -1.729487) (xy -2.734387 -1.730786) (xy -2.698071 -1.738999)
    (xy -2.676128 -1.748025) (xy -2.636318 -1.773739) (xy -2.601249 -1.807049) (xy -2.572605 -1.845497)
    (xy -2.552071 -1.886627) (xy -2.541332 -1.927983) (xy -2.540145 -1.946275) (xy -2.540814 -1.965876)
    (xy -2.543282 -1.983496) (xy -2.54846 -2.000471) (xy -2.557261 -2.018132) (xy -2.570595 -2.037815)
    (xy -2.589374 -2.060853) (xy -2.614512 -2.08858) (xy -2.646918 -2.12233) (xy -2.687506 -2.163437)
    (xy -2.691002 -2.16695) (xy -2.815832 -2.292375) (xy -2.852534 -2.256056) (xy -2.889237 -2.219737)
    (xy -2.772517 -2.102056) (xy -2.732756 -2.061667) (xy -2.701282 -2.028869) (xy -2.677179 -2.002496)
    (xy -2.659535 -1.981383) (xy -2.647434 -1.964367) (xy -2.639963 -1.950281) (xy -2.636209 -1.937961)
    (xy -2.63525 -1.927123) (xy -2.641035 -1.900739) (xy -2.656487 -1.874973) (xy -2.678757 -1.852584)
    (xy -2.704996 -1.83633) (xy -2.732351 -1.828969) (xy -2.73685 -1.8288) (xy -2.74931 -1.829779)
    (xy -2.761962 -1.833336) (xy -2.776018 -1.840404) (xy -2.792693 -1.851917) (xy -2.813199 -1.868807)
    (xy -2.83875 -1.892008) (xy -2.87056 -1.922452) (xy -2.909841 -1.961071) (xy -2.913141 -1.964343)
    (xy -3.029107 -2.079331) (xy -3.101842 -2.006596) (xy -3.310238 -2.006596) (xy -3.244393 -2.072584)
    (xy -3.123919 -2.193269) (xy -3.002151 -2.315198) (xy -2.938779 -2.378629) (xy -2.730968 -2.378629)
    (xy -2.557697 -2.205119) (xy -2.384425 -2.031609) (xy -2.30151 -2.115942) (xy -2.263274 -2.155942)
    (xy -2.233998 -2.189014) (xy -2.214003 -2.214778) (xy -2.204673 -2.230369) (xy -2.192549 -2.269515)
    (xy -2.191081 -2.309285) (xy -2.200205 -2.346471) (xy -2.207182 -2.360548) (xy -2.229825 -2.389181)
    (xy -2.258361 -2.410212) (xy -2.290139 -2.422642) (xy -2.322505 -2.425469) (xy -2.352808 -2.417692)
    (xy -2.35533 -2.416444) (xy -2.37323 -2.407188) (xy -2.364957 -2.431201) (xy -2.360431 -2.462376)
    (xy -2.36666 -2.493505) (xy -2.381898 -2.522284) (xy -2.404404 -2.546409) (xy -2.432433 -2.563577)
    (xy -2.464242 -2.571483) (xy -2.471314 -2.57175) (xy -2.494172 -2.569829) (xy -2.516711 -2.563402)
    (xy -2.540496 -2.551476) (xy -2.56709 -2.533058) (xy -2.598057 -2.507154) (xy -2.634961 -2.472772)
    (xy -2.649666 -2.458457) (xy -2.730968 -2.378629) (xy -2.938779 -2.378629) (xy -2.879425 -2.438037)
    (xy -2.756075 -2.56145) (xy -2.632436 -2.685103) (xy -2.612458 -2.705076) (xy -2.403362 -2.705076)
    (xy -2.232013 -2.533638) (xy -2.19366 -2.495352) (xy -2.158121 -2.460043) (xy -2.126392 -2.428687)
    (xy -2.09947 -2.402262) (xy -2.078348 -2.381743) (xy -2.064024 -2.368107) (xy -2.057492 -2.362331)
    (xy -2.057228 -2.3622) (xy -2.051454 -2.3664) (xy -2.039255 -2.377527) (xy -2.023028 -2.393372)
    (xy -2.0192 -2.397227) (xy -1.984608 -2.432254) (xy -2.330396 -2.778042) (xy -2.403362 -2.705076)
    (xy -2.612458 -2.705076) (xy -2.508844 -2.80866) (xy -2.453772 -2.863695) (xy -2.244482 -2.863695)
    (xy -2.073198 -2.692323) (xy -2.034867 -2.654049) (xy -1.99937 -2.618752) (xy -1.9677 -2.587407)
    (xy -1.940849 -2.560991) (xy -1.91981 -2.54048) (xy -1.905576 -2.526851) (xy -1.899141 -2.52108)
    (xy -1.898894 -2.52095) (xy -1.893249 -2.525087) (xy -1.881116 -2.536012) (xy -1.864951 -2.551499)
    (xy -1.862338 -2.554071) (xy -1.846071 -2.570981) (xy -1.834153 -2.584982) (xy -1.828879 -2.59335)
    (xy -1.8288 -2.593884) (xy -1.833075 -2.600634) (xy -1.844767 -2.614349) (xy -1.862182 -2.63315)
    (xy -1.883626 -2.655157) (xy -1.88783 -2.659361) (xy -1.911965 -2.68364) (xy -1.928344 -2.701091)
    (xy -1.938353 -2.713699) (xy -1.943379 -2.72345) (xy -1.944808 -2.732332) (xy -1.944279 -2.740257)
    (xy -1.941236 -2.755897) (xy -1.937191 -2.765042) (xy -1.936652 -2.765486) (xy -1.929108 -2.765108)
    (xy -1.91134 -2.762116) (xy -1.885457 -2.756928) (xy -1.853567 -2.749962) (xy -1.824641 -2.74327)
    (xy -1.788978 -2.734948) (xy -1.757204 -2.727767) (xy -1.731551 -2.722213) (xy -1.714252 -2.718773)
    (xy -1.707967 -2.717868) (xy -1.699429 -2.722121) (xy -1.684744 -2.733563) (xy -1.666459 -2.750121)
    (xy -1.65735 -2.759075) (xy -1.640243 -2.776976) (xy -1.628085 -2.790961) (xy -1.622503 -2.799085)
    (xy -1.622812 -2.80035) (xy -1.630102 -2.801683) (xy -1.647727 -2.805376) (xy -1.673638 -2.810974)
    (xy -1.705788 -2.818021) (xy -1.742128 -2.826063) (xy -1.780609 -2.834643) (xy -1.819182 -2.843306)
    (xy -1.8558 -2.851596) (xy -1.888413 -2.859058) (xy -1.914974 -2.865235) (xy -1.921274 -2.866727)
    (xy -1.92573 -2.868604) (xy -1.92941 -2.872947) (xy -1.932646 -2.881366) (xy -1.935772 -2.895469)
    (xy -1.939121 -2.916865) (xy -1.943026 -2.947164) (xy -1.945937 -2.971948) (xy -1.76174 -2.971948)
    (xy -1.705282 -2.914422) (xy -1.578098 -3.041606) (xy -1.635328 -3.098836) (xy -1.76174 -2.971948)
    (xy -1.945937 -2.971948) (xy -1.94782 -2.987973) (xy -1.949581 -3.003373) (xy -1.954246 -3.042896)
    (xy -1.958677 -3.077774) (xy -1.962614 -3.106171) (xy -1.965797 -3.126249) (xy -1.967967 -3.136168)
    (xy -1.968431 -3.1369) (xy -1.974258 -3.132691) (xy -1.986621 -3.121476) (xy -2.003222 -3.10537)
    (xy -2.009641 -3.098937) (xy -2.047208 -3.060973) (xy -2.033201 -2.938599) (xy -2.028624 -2.89953)
    (xy -2.024256 -2.863928) (xy -2.02039 -2.834059) (xy -2.01732 -2.812187) (xy -2.01534 -2.800579)
    (xy -2.015285 -2.80035) (xy -2.016539 -2.797014) (xy -2.024073 -2.801069) (xy -2.038472 -2.812999)
    (xy -2.060322 -2.83329) (xy -2.090096 -2.862317) (xy -2.168817 -2.940158) (xy -2.206649 -2.901926)
    (xy -2.244482 -2.863695) (xy -2.453772 -2.863695) (xy -2.385634 -2.931785) (xy -2.263142 -3.054145)
    (xy -2.141702 -3.175402) (xy -2.07259 -3.244382) (xy -1.688386 -3.244382) (xy -1.688157 -3.242143)
    (xy -1.681146 -3.240473) (xy -1.665328 -3.238101) (xy -1.649705 -3.236186) (xy -1.613484 -3.232108)
    (xy -1.610295 -3.252767) (xy -1.607599 -3.270945) (xy -1.604159 -3.295037) (xy -1.602066 -3.310076)
    (xy -1.597025 -3.346727) (xy -1.466909 -3.216414) (xy -1.433618 -3.183188) (xy -1.403239 -3.153087)
    (xy -1.376922 -3.127233) (xy -1.355816 -3.106748) (xy -1.341072 -3.092755) (xy -1.333839 -3.086374)
    (xy -1.333342 -3.0861) (xy -1.327561 -3.0903) (xy -1.315357 -3.101427) (xy -1.299127 -3.117273)
    (xy -1.2953 -3.121127) (xy -1.260708 -3.156154) (xy -1.606489 -3.501935) (xy -1.668969 -3.438525)
    (xy -1.679679 -3.341274) (xy -1.683229 -3.307678) (xy -1.685989 -3.27886) (xy -1.687771 -3.257026)
    (xy -1.688386 -3.244382) (xy -2.07259 -3.244382) (xy -2.02165 -3.295223) (xy -1.903321 -3.413271)
    (xy -1.78705 -3.529212) (xy -1.673172 -3.64271) (xy -1.562024 -3.753431) (xy -1.453939 -3.861038)
    (xy -1.349254 -3.965197) (xy -1.248303 -4.065572) (xy -1.151422 -4.161828) (xy -1.058946 -4.25363)
    (xy -0.97121 -4.340643) (xy -0.88855 -4.422531) (xy -0.8113 -4.498959) (xy -0.739797 -4.569592)
    (xy -0.674374 -4.634095) (xy -0.615368 -4.692132) (xy -0.563114 -4.743369) (xy -0.517947 -4.787469)
    (xy -0.480202 -4.824098) (xy -0.450214 -4.85292) (xy -0.428319 -4.8736) (xy -0.414852 -4.885804)
    (xy -0.411059 -4.888849) (xy -0.349209 -4.926167) (xy -0.281635 -4.959186) (xy -0.21353 -4.985508)
    (xy -0.179562 -4.99577) (xy -0.156042 -5.001826) (xy -0.135373 -5.006225) (xy -0.114755 -5.009226)
    (xy -0.091388 -5.011091) (xy -0.062471 -5.012081) (xy -0.025204 -5.012457) (xy 0 -5.012497)
    (xy 0.043083 -5.012348)) (layer F.SilkS) (width 0.01))
  (fp_poly (pts (xy 1.114476 3.395433) (xy 1.148643 3.408069) (xy 1.185389 3.431741) (xy 1.221643 3.463426)
    (xy 1.250696 3.497644) (xy 1.271485 3.532552) (xy 1.282948 3.566304) (xy 1.284024 3.597059)
    (xy 1.28318 3.601493) (xy 1.275586 3.626312) (xy 1.263691 3.646534) (xy 1.244246 3.667639)
    (xy 1.243533 3.668323) (xy 1.211971 3.691092) (xy 1.178051 3.701396) (xy 1.142049 3.699194)
    (xy 1.11125 3.688068) (xy 1.086658 3.672475) (xy 1.059101 3.64946) (xy 1.031979 3.622435)
    (xy 1.008697 3.594814) (xy 0.992658 3.570008) (xy 0.991806 3.568282) (xy 0.979483 3.530631)
    (xy 0.979668 3.49517) (xy 0.992353 3.461941) (xy 1.017531 3.43098) (xy 1.020984 3.427785)
    (xy 1.051867 3.40532) (xy 1.082624 3.394526) (xy 1.114476 3.395433)) (layer F.SilkS) (width 0.01))
  (fp_poly (pts (xy 0.077063 -3.420209) (xy 0.157349 -3.40289) (xy 0.23558 -3.373611) (xy 0.310702 -3.332373)
    (xy 0.318274 -3.327412) (xy 0.32658 -3.320379) (xy 0.343427 -3.304746) (xy 0.368403 -3.280924)
    (xy 0.401099 -3.249323) (xy 0.441104 -3.210353) (xy 0.488007 -3.164426) (xy 0.541398 -3.11195)
    (xy 0.600868 -3.053338) (xy 0.666005 -2.988998) (xy 0.736399 -2.919341) (xy 0.811639 -2.844778)
    (xy 0.891316 -2.76572) (xy 0.97502 -2.682575) (xy 1.062339 -2.595756) (xy 1.152863 -2.505671)
    (xy 1.246182 -2.412732) (xy 1.341885 -2.317349) (xy 1.439563 -2.219932) (xy 1.538805 -2.120892)
    (xy 1.6392 -2.020639) (xy 1.740338 -1.919583) (xy 1.841809 -1.818135) (xy 1.943203 -1.716705)
    (xy 2.044108 -1.615703) (xy 2.144115 -1.51554) (xy 2.242813 -1.416627) (xy 2.339792 -1.319373)
    (xy 2.434642 -1.224188) (xy 2.526952 -1.131485) (xy 2.616312 -1.041671) (xy 2.702311 -0.955159)
    (xy 2.784539 -0.872358) (xy 2.862586 -0.793679) (xy 2.936041 -0.719532) (xy 3.004494 -0.650328)
    (xy 3.067535 -0.586476) (xy 3.124753 -0.528388) (xy 3.175738 -0.476473) (xy 3.220079 -0.431142)
    (xy 3.257367 -0.392805) (xy 3.28719 -0.361873) (xy 3.309138 -0.338756) (xy 3.322802 -0.323865)
    (xy 3.327411 -0.318275) (xy 3.369889 -0.243535) (xy 3.400408 -0.165577) (xy 3.418967 -0.085455)
    (xy 3.425567 -0.004224) (xy 3.420208 0.077063) (xy 3.402889 0.157349) (xy 3.37361 0.23558)
    (xy 3.332372 0.310702) (xy 3.327411 0.318274) (xy 3.320378 0.32658) (xy 3.304745 0.343427)
    (xy 3.280923 0.368403) (xy 3.249322 0.401099) (xy 3.210352 0.441104) (xy 3.164425 0.488007)
    (xy 3.111949 0.541398) (xy 3.053337 0.600868) (xy 2.988997 0.666005) (xy 2.91934 0.736399)
    (xy 2.844777 0.811639) (xy 2.765719 0.891316) (xy 2.682574 0.97502) (xy 2.595755 1.062339)
    (xy 2.50567 1.152863) (xy 2.412731 1.246182) (xy 2.317348 1.341885) (xy 2.219931 1.439563)
    (xy 2.120891 1.538805) (xy 2.020638 1.6392) (xy 1.919582 1.740338) (xy 1.818134 1.841809)
    (xy 1.716704 1.943203) (xy 1.615702 2.044108) (xy 1.515539 2.144115) (xy 1.416626 2.242813)
    (xy 1.319372 2.339792) (xy 1.224187 2.434642) (xy 1.131484 2.526952) (xy 1.04167 2.616312)
    (xy 0.955158 2.702311) (xy 0.872357 2.784539) (xy 0.793678 2.862586) (xy 0.719531 2.936041)
    (xy 0.650327 3.004494) (xy 0.586475 3.067535) (xy 0.528387 3.124753) (xy 0.476472 3.175738)
    (xy 0.431141 3.220079) (xy 0.392804 3.257367) (xy 0.361872 3.28719) (xy 0.338755 3.309138)
    (xy 0.323864 3.322802) (xy 0.318274 3.327411) (xy 0.251771 3.365351) (xy 0.180095 3.39476)
    (xy 0.105767 3.415015) (xy 0.031309 3.425492) (xy -0.040757 3.425565) (xy -0.066853 3.422754)
    (xy -0.152634 3.404555) (xy -0.23346 3.374689) (xy -0.309724 3.333005) (xy -0.318275 3.327411)
    (xy -0.326581 3.320378) (xy -0.343428 3.304745) (xy -0.368404 3.280923) (xy -0.4011 3.249322)
    (xy -0.441105 3.210352) (xy -0.488008 3.164425) (xy -0.541399 3.111949) (xy -0.600869 3.053337)
    (xy -0.666006 2.988997) (xy -0.7364 2.91934) (xy -0.81164 2.844777) (xy -0.891317 2.765719)
    (xy -0.975021 2.682574) (xy -1.06234 2.595755) (xy -1.152864 2.50567) (xy -1.246183 2.412731)
    (xy -1.341886 2.317348) (xy -1.439564 2.219931) (xy -1.538806 2.120891) (xy -1.639201 2.020638)
    (xy -1.740339 1.919582) (xy -1.84181 1.818134) (xy -1.943204 1.716704) (xy -2.044109 1.615702)
    (xy -2.144116 1.515539) (xy -2.242814 1.416626) (xy -2.339793 1.319372) (xy -2.434643 1.224187)
    (xy -2.526953 1.131484) (xy -2.616313 1.04167) (xy -2.702312 0.955158) (xy -2.78454 0.872357)
    (xy -2.862587 0.793678) (xy -2.936042 0.719531) (xy -3.004495 0.650327) (xy -3.067536 0.586475)
    (xy -3.124754 0.528387) (xy -3.175739 0.476472) (xy -3.22008 0.431141) (xy -3.257368 0.392804)
    (xy -3.287191 0.361872) (xy -3.309139 0.338755) (xy -3.322803 0.323864) (xy -3.327412 0.318274)
    (xy -3.36989 0.243534) (xy -3.400409 0.165576) (xy -3.418968 0.085454) (xy -3.425568 0.004223)
    (xy -3.42529 0) (xy -3.310738 0) (xy -3.30739 0.064302) (xy -3.296614 0.122047)
    (xy -3.277312 0.1768) (xy -3.248383 0.232124) (xy -3.230476 0.26035) (xy -3.224364 0.267289)
    (xy -3.209668 0.282783) (xy -3.186797 0.306421) (xy -3.156162 0.337792) (xy -3.118173 0.376484)
    (xy -3.073241 0.422088) (xy -3.021776 0.474193) (xy -2.964188 0.532387) (xy -2.900888 0.59626)
    (xy -2.832287 0.665401) (xy -2.758795 0.739399) (xy -2.680821 0.817844) (xy -2.598777 0.900325)
    (xy -2.513073 0.986431) (xy -2.42412 1.07575) (xy -2.332327 1.167874) (xy -2.238105 1.26239)
    (xy -2.141864 1.358887) (xy -2.044016 1.456956) (xy -1.94497 1.556185) (xy -1.845136 1.656163)
    (xy -1.744926 1.756481) (xy -1.644749 1.856726) (xy -1.545016 1.956488) (xy -1.446138 2.055356)
    (xy -1.348524 2.15292) (xy -1.252585 2.248769) (xy -1.158732 2.342491) (xy -1.067375 2.433677)
    (xy -0.978924 2.521915) (xy -0.893789 2.606795) (xy -0.812382 2.687906) (xy -0.735112 2.764836)
    (xy -0.662391 2.837176) (xy -0.594627 2.904514) (xy -0.532232 2.96644) (xy -0.475617 3.022543)
    (xy -0.425191 3.072412) (xy -0.381364 3.115636) (xy -0.344549 3.151805) (xy -0.315153 3.180507)
    (xy -0.293589 3.201332) (xy -0.280267 3.21387) (xy -0.276268 3.217345) (xy -0.211968 3.258662)
    (xy -0.142439 3.289516) (xy -0.071353 3.308575) (xy -0.044005 3.311375) (xy -0.008678 3.311931)
    (xy 0.030151 3.310463) (xy 0.068003 3.307193) (xy 0.100401 3.302341) (xy 0.112828 3.29948)
    (xy 0.150769 3.286632) (xy 0.192932 3.26828) (xy 0.23375 3.247012) (xy 0.258632 3.231714)
    (xy 0.265632 3.225555) (xy 0.281187 3.210811) (xy 0.304886 3.187894) (xy 0.336319 3.157214)
    (xy 0.375074 3.119181) (xy 0.42074 3.074206) (xy 0.472907 3.022698) (xy 0.531165 2.965069)
    (xy 0.595101 2.901728) (xy 0.664305 2.833087) (xy 0.738366 2.759555) (xy 0.816874 2.681543)
    (xy 0.899417 2.599461) (xy 0.985584 2.51372) (xy 1.074965 2.42473) (xy 1.167149 2.332902)
    (xy 1.261725 2.238646) (xy 1.358282 2.142371) (xy 1.456409 2.04449) (xy 1.555695 1.945412)
    (xy 1.655729 1.845547) (xy 1.756101 1.745306) (xy 1.856399 1.645099) (xy 1.956213 1.545337)
    (xy 2.055132 1.44643) (xy 2.152745 1.348789) (xy 2.248641 1.252823) (xy 2.342409 1.158944)
    (xy 2.433638 1.067562) (xy 2.521917 0.979086) (xy 2.606836 0.893928) (xy 2.687984 0.812498)
    (xy 2.764949 0.735207) (xy 2.837322 0.662464) (xy 2.90469 0.59468) (xy 2.966643 0.532265)
    (xy 3.02277 0.47563) (xy 3.072661 0.425186) (xy 3.115904 0.381342) (xy 3.152088 0.34451)
    (xy 3.180804 0.315099) (xy 3.201638 0.293519) (xy 3.214182 0.280182) (xy 3.217622 0.276225)
    (xy 3.241364 0.240855) (xy 3.26447 0.198795) (xy 3.284584 0.154876) (xy 3.299353 0.113929)
    (xy 3.302725 0.1016) (xy 3.307502 0.07247) (xy 3.310251 0.035209) (xy 3.310974 -0.005808)
    (xy 3.309671 -0.046203) (xy 3.306343 -0.0816) (xy 3.302678 -0.1016) (xy 3.291569 -0.136939)
    (xy 3.275122 -0.177344) (xy 3.255632 -0.217734) (xy 3.235393 -0.253025) (xy 3.231954 -0.258285)
    (xy 3.225783 -0.265301) (xy 3.211028 -0.280873) (xy 3.188099 -0.304589) (xy 3.157407 -0.336039)
    (xy 3.119363 -0.37481) (xy 3.074376 -0.420494) (xy 3.022857 -0.472678) (xy 2.965217 -0.530951)
    (xy 2.901865 -0.594904) (xy 2.833213 -0.664124) (xy 2.759671 -0.738201) (xy 2.681649 -0.816724)
    (xy 2.599557 -0.899282) (xy 2.513806 -0.985464) (xy 2.424807 -1.07486) (xy 2.332969 -1.167058)
    (xy 2.238704 -1.261647) (xy 2.142421 -1.358217) (xy 2.044531 -1.456356) (xy 1.945445 -1.555654)
    (xy 1.845573 -1.6557) (xy 1.745325 -1.756083) (xy 1.645111 -1.856391) (xy 1.545343 -1.956215)
    (xy 1.44643 -2.055142) (xy 1.348784 -2.152763) (xy 1.252813 -2.248666) (xy 1.158929 -2.342441)
    (xy 1.067543 -2.433676) (xy 0.979064 -2.52196) (xy 0.893903 -2.606883) (xy 0.812471 -2.688034)
    (xy 0.735177 -2.765002) (xy 0.662433 -2.837375) (xy 0.594648 -2.904743) (xy 0.532233 -2.966696)
    (xy 0.475599 -3.022821) (xy 0.425156 -3.072709) (xy 0.381314 -3.115947) (xy 0.344484 -3.152127)
    (xy 0.315076 -3.180835) (xy 0.293501 -3.201663) (xy 0.280168 -3.214198) (xy 0.276225 -3.217623)
    (xy 0.240799 -3.241396) (xy 0.198637 -3.264549) (xy 0.154599 -3.284712) (xy 0.113544 -3.299513)
    (xy 0.1016 -3.302788) (xy 0.06841 -3.308227) (xy 0.02736 -3.310872) (xy -0.017065 -3.310803)
    (xy -0.060378 -3.308097) (xy -0.098094 -3.302832) (xy -0.1143 -3.299025) (xy -0.174984 -3.276705)
    (xy -0.234797 -3.245417) (xy -0.276229 -3.217375) (xy -0.284095 -3.210324) (xy -0.300464 -3.194724)
    (xy -0.324925 -3.170985) (xy -0.357068 -3.139519) (xy -0.396483 -3.100735) (xy -0.442759 -3.055046)
    (xy -0.495485 -3.002861) (xy -0.554251 -2.944592) (xy -0.618648 -2.880649) (xy -0.688263 -2.811443)
    (xy -0.762688 -2.737385) (xy -0.841511 -2.658886) (xy -0.924323 -2.576356) (xy -1.010712 -2.490207)
    (xy -1.100269 -2.400848) (xy -1.192583 -2.308691) (xy -1.287243 -2.214147) (xy -1.38384 -2.117626)
    (xy -1.481963 -2.019539) (xy -1.581201 -1.920298) (xy -1.681143 -1.820312) (xy -1.781381 -1.719992)
    (xy -1.881503 -1.61975) (xy -1.981098 -1.519996) (xy -2.079757 -1.421141) (xy -2.177069 -1.323595)
    (xy -2.272624 -1.22777) (xy -2.36601 -1.134076) (xy -2.456819 -1.042925) (xy -2.544639 -0.954726)
    (xy -2.62906 -0.86989) (xy -2.709671 -0.788829) (xy -2.786063 -0.711954) (xy -2.857825 -0.639674)
    (xy -2.924545 -0.572401) (xy -2.985815 -0.510545) (xy -3.041224 -0.454518) (xy -3.09036 -0.40473)
    (xy -3.132815 -0.361592) (xy -3.168177 -0.325515) (xy -3.196036 -0.296909) (xy -3.215981 -0.276185)
    (xy -3.227603 -0.263755) (xy -3.230476 -0.26035) (xy -3.264492 -0.203456) (xy -3.288346 -0.14887)
    (xy -3.303137 -0.093028) (xy -3.309966 -0.032364) (xy -3.310738 0) (xy -3.42529 0)
    (xy -3.420209 -0.077064) (xy -3.40289 -0.15735) (xy -3.373611 -0.235581) (xy -3.332373 -0.310703)
    (xy -3.327412 -0.318275) (xy -3.320379 -0.326581) (xy -3.304746 -0.343428) (xy -3.280924 -0.368404)
    (xy -3.249323 -0.4011) (xy -3.210353 -0.441105) (xy -3.164426 -0.488008) (xy -3.11195 -0.541399)
    (xy -3.053338 -0.600869) (xy -2.988998 -0.666006) (xy -2.919341 -0.7364) (xy -2.844778 -0.81164)
    (xy -2.76572 -0.891317) (xy -2.682575 -0.975021) (xy -2.595756 -1.06234) (xy -2.505671 -1.152864)
    (xy -2.412732 -1.246183) (xy -2.317349 -1.341886) (xy -2.219932 -1.439564) (xy -2.120892 -1.538806)
    (xy -2.020639 -1.639201) (xy -1.919583 -1.740339) (xy -1.818135 -1.84181) (xy -1.716705 -1.943204)
    (xy -1.615703 -2.044109) (xy -1.51554 -2.144116) (xy -1.416627 -2.242814) (xy -1.319373 -2.339793)
    (xy -1.224188 -2.434643) (xy -1.131485 -2.526953) (xy -1.041671 -2.616313) (xy -0.955159 -2.702312)
    (xy -0.872358 -2.78454) (xy -0.793679 -2.862587) (xy -0.719532 -2.936042) (xy -0.650328 -3.004495)
    (xy -0.586476 -3.067536) (xy -0.528388 -3.124754) (xy -0.476473 -3.175739) (xy -0.431142 -3.22008)
    (xy -0.392805 -3.257368) (xy -0.361873 -3.287191) (xy -0.338756 -3.309139) (xy -0.323865 -3.322803)
    (xy -0.318275 -3.327412) (xy -0.243535 -3.36989) (xy -0.165577 -3.400409) (xy -0.085455 -3.418968)
    (xy -0.004224 -3.425568) (xy 0.077063 -3.420209)) (layer F.SilkS) (width 0.01))
  (fp_poly (pts (xy -1.492596 2.952224) (xy -1.498952 2.965815) (xy -1.509028 2.986169) (xy -1.521677 3.011077)
    (xy -1.535749 3.038328) (xy -1.550098 3.065712) (xy -1.563574 3.091018) (xy -1.575029 3.112037)
    (xy -1.583315 3.126558) (xy -1.586938 3.132063) (xy -1.592884 3.129884) (xy -1.605458 3.120218)
    (xy -1.622546 3.104793) (xy -1.634342 3.09324) (xy -1.67752 3.049727) (xy -1.656323 3.037083)
    (xy -1.644714 3.030469) (xy -1.625232 3.019682) (xy -1.600535 3.006163) (xy -1.573282 2.991351)
    (xy -1.546131 2.976685) (xy -1.521741 2.963606) (xy -1.502769 2.953554) (xy -1.491874 2.947967)
    (xy -1.49111 2.947607) (xy -1.492596 2.952224)) (layer F.SilkS) (width 0.01))
  (fp_poly (pts (xy -1.834512 2.607014) (xy -1.813401 2.629335) (xy -1.796624 2.653841) (xy -1.786412 2.676873)
    (xy -1.78435 2.689321) (xy -1.790229 2.713541) (xy -1.806111 2.735576) (xy -1.829366 2.751945)
    (xy -1.832838 2.753494) (xy -1.848411 2.759628) (xy -1.859337 2.761361) (xy -1.870858 2.758316)
    (xy -1.888218 2.750116) (xy -1.889663 2.7494) (xy -1.910806 2.736538) (xy -1.9304 2.720907)
    (xy -1.933885 2.717476) (xy -1.95217 2.698391) (xy -1.900302 2.646522) (xy -1.848433 2.594654)
    (xy -1.834512 2.607014)) (layer F.SilkS) (width 0.01))
  (fp_poly (pts (xy 2.266341 2.284336) (xy 2.303506 2.303726) (xy 2.341511 2.335766) (xy 2.341981 2.336236)
    (xy 2.373552 2.374145) (xy 2.393048 2.412402) (xy 2.400304 2.450464) (xy 2.395156 2.487788)
    (xy 2.391155 2.498794) (xy 2.383684 2.511824) (xy 2.371193 2.529122) (xy 2.356088 2.547853)
    (xy 2.340775 2.565187) (xy 2.327661 2.578289) (xy 2.31915 2.584328) (xy 2.3184 2.58445)
    (xy 2.313006 2.580142) (xy 2.299933 2.56803) (xy 2.28044 2.549331) (xy 2.255784 2.525262)
    (xy 2.227227 2.497041) (xy 2.203549 2.473424) (xy 2.09266 2.362399) (xy 2.121067 2.3332)
    (xy 2.157377 2.302027) (xy 2.193526 2.28349) (xy 2.229764 2.277591) (xy 2.266341 2.284336)) (layer F.SilkS) (width 0.01))
  (fp_poly (pts (xy 2.509946 1.95371) (xy 2.524876 1.960657) (xy 2.546283 1.971421) (xy 2.571883 1.984772)
    (xy 2.599394 1.999478) (xy 2.626534 2.014309) (xy 2.651022 2.028036) (xy 2.670573 2.039428)
    (xy 2.682907 2.047254) (xy 2.68605 2.050073) (xy 2.681813 2.056319) (xy 2.670793 2.06867)
    (xy 2.655522 2.084598) (xy 2.638532 2.101578) (xy 2.622357 2.117082) (xy 2.609529 2.128584)
    (xy 2.60258 2.133558) (xy 2.602319 2.1336) (xy 2.598108 2.128299) (xy 2.589057 2.113651)
    (xy 2.576262 2.091534) (xy 2.560819 2.063828) (xy 2.549934 2.04381) (xy 2.533746 2.013389)
    (xy 2.520138 1.987102) (xy 2.510072 1.966865) (xy 2.504513 1.9546) (xy 2.503773 1.95181)
    (xy 2.509946 1.95371)) (layer F.SilkS) (width 0.01))
  (fp_poly (pts (xy -2.808329 1.636088) (xy -2.785921 1.664739) (xy -2.774115 1.688956) (xy -2.772357 1.710376)
    (xy -2.777725 1.726425) (xy -2.795317 1.750626) (xy -2.816792 1.762738) (xy -2.842114 1.762756)
    (xy -2.87125 1.75067) (xy -2.876895 1.74721) (xy -2.895865 1.733899) (xy -2.912028 1.720606)
    (xy -2.917434 1.715226) (xy -2.929743 1.701331) (xy -2.835275 1.605743) (xy -2.808329 1.636088)) (layer F.SilkS) (width 0.01))
  (fp_poly (pts (xy -3.268359 1.446236) (xy -3.240081 1.47764) (xy -3.223613 1.505393) (xy -3.218807 1.530117)
    (xy -3.225514 1.552437) (xy -3.239172 1.569077) (xy -3.258728 1.583317) (xy -3.278171 1.587951)
    (xy -3.299527 1.5827) (xy -3.32482 1.567286) (xy -3.340194 1.555166) (xy -3.359039 1.538708)
    (xy -3.37389 1.524296) (xy -3.382061 1.514573) (xy -3.382684 1.513355) (xy -3.379994 1.503762)
    (xy -3.367825 1.487071) (xy -3.346711 1.463994) (xy -3.342767 1.459987) (xy -3.299213 1.416097)
    (xy -3.268359 1.446236)) (layer F.SilkS) (width 0.01))
  (fp_poly (pts (xy -3.148963 1.292571) (xy -3.128772 1.312981) (xy -3.110339 1.335953) (xy -3.095821 1.358337)
    (xy -3.087376 1.376984) (xy -3.0861 1.384305) (xy -3.091578 1.401664) (xy -3.105333 1.41843)
    (xy -3.123353 1.430819) (xy -3.139992 1.4351) (xy -3.152746 1.431264) (xy -3.1706 1.421326)
    (xy -3.185543 1.410621) (xy -3.204333 1.394991) (xy -3.220699 1.380242) (xy -3.228629 1.372237)
    (xy -3.240982 1.358333) (xy -3.201924 1.319276) (xy -3.162867 1.280218) (xy -3.148963 1.292571)) (layer F.SilkS) (width 0.01))
  (fp_poly (pts (xy 3.428456 1.115396) (xy 3.465612 1.137251) (xy 3.504867 1.171572) (xy 3.510786 1.177628)
    (xy 3.544141 1.217199) (xy 3.565354 1.253951) (xy 3.574573 1.288267) (xy 3.571947 1.32053)
    (xy 3.569125 1.329206) (xy 3.55424 1.354905) (xy 3.531381 1.379016) (xy 3.504011 1.398933)
    (xy 3.475596 1.412052) (xy 3.453826 1.41591) (xy 3.439696 1.413187) (xy 3.419166 1.40595)
    (xy 3.399121 1.396933) (xy 3.361264 1.372574) (xy 3.325448 1.339692) (xy 3.295453 1.302189)
    (xy 3.278773 1.272771) (xy 3.267109 1.238601) (xy 3.26637 1.208521) (xy 3.276968 1.179847)
    (xy 3.297262 1.1522) (xy 3.327802 1.124408) (xy 3.359729 1.108995) (xy 3.393221 1.105984)
    (xy 3.428456 1.115396)) (layer F.SilkS) (width 0.01))
  (fp_poly (pts (xy -3.153527 -1.743136) (xy -3.116018 -1.721359) (xy -3.07728 -1.687599) (xy -3.042663 -1.647508)
    (xy -3.020389 -1.609304) (xy -3.010487 -1.573112) (xy -3.012986 -1.539058) (xy -3.027916 -1.507269)
    (xy -3.033394 -1.499938) (xy -3.063895 -1.469917) (xy -3.096981 -1.452205) (xy -3.132278 -1.446896)
    (xy -3.169412 -1.454084) (xy -3.186421 -1.461321) (xy -3.211198 -1.47726) (xy -3.238763 -1.500724)
    (xy -3.265642 -1.528187) (xy -3.288361 -1.556126) (xy -3.3026 -1.579215) (xy -3.31533 -1.617836)
    (xy -3.315698 -1.654455) (xy -3.304006 -1.688018) (xy -3.280555 -1.717466) (xy -3.258488 -1.734321)
    (xy -3.22449 -1.749546) (xy -3.189594 -1.752508) (xy -3.153527 -1.743136)) (layer F.SilkS) (width 0.01))
  (fp_poly (pts (xy -2.331912 -2.332432) (xy -2.313405 -2.318753) (xy -2.311889 -2.317262) (xy -2.29649 -2.296162)
    (xy -2.292033 -2.273847) (xy -2.298737 -2.249403) (xy -2.316822 -2.221921) (xy -2.341253 -2.195542)
    (xy -2.372102 -2.165409) (xy -2.418441 -2.21206) (xy -2.464781 -2.258711) (xy -2.427778 -2.291981)
    (xy -2.397303 -2.317074) (xy -2.372244 -2.331945) (xy -2.350986 -2.336947) (xy -2.331912 -2.332432)) (layer F.SilkS) (width 0.01))
  (fp_poly (pts (xy -2.48505 -2.466758) (xy -2.466408 -2.456394) (xy -2.452574 -2.439177) (xy -2.44621 -2.418027)
    (xy -2.447414 -2.403252) (xy -2.452961 -2.392394) (xy -2.464286 -2.376399) (xy -2.478935 -2.358137)
    (xy -2.494454 -2.340481) (xy -2.508391 -2.3263) (xy -2.518292 -2.318466) (xy -2.520483 -2.31775)
    (xy -2.526517 -2.321961) (xy -2.539007 -2.333157) (xy -2.555587 -2.349187) (xy -2.561059 -2.354672)
    (xy -2.597595 -2.391593) (xy -2.560085 -2.427372) (xy -2.540292 -2.444837) (xy -2.521739 -2.458787)
    (xy -2.507861 -2.466691) (xy -2.505841 -2.467351) (xy -2.48505 -2.466758)) (layer F.SilkS) (width 0.01))
  (fp_poly (pts (xy 2.242013 -2.447721) (xy 2.269871 -2.417462) (xy 2.28654 -2.391521) (xy 2.292318 -2.368796)
    (xy 2.287502 -2.348186) (xy 2.273788 -2.329962) (xy 2.256384 -2.316498) (xy 2.2369 -2.311634)
    (xy 2.229396 -2.3114) (xy 2.21589 -2.312334) (xy 2.204025 -2.316299) (xy 2.190823 -2.325047)
    (xy 2.17331 -2.340325) (xy 2.161872 -2.351088) (xy 2.120179 -2.390775) (xy 2.164955 -2.435021)
    (xy 2.20973 -2.479266) (xy 2.242013 -2.447721)) (layer F.SilkS) (width 0.01))
  (fp_poly (pts (xy 2.376777 -2.586028) (xy 2.403363 -2.557539) (xy 2.419235 -2.533853) (xy 2.424799 -2.513636)
    (xy 2.420462 -2.495559) (xy 2.408959 -2.480541) (xy 2.390476 -2.466624) (xy 2.371578 -2.462686)
    (xy 2.350703 -2.469057) (xy 2.326288 -2.486066) (xy 2.30918 -2.501622) (xy 2.270125 -2.539444)
    (xy 2.308016 -2.577813) (xy 2.345908 -2.616181) (xy 2.376777 -2.586028)) (layer F.SilkS) (width 0.01))
  (fp_poly (pts (xy 1.633352 -3.325534) (xy 1.648422 -3.31706) (xy 1.68106 -3.28922) (xy 1.701384 -3.258517)
    (xy 1.709394 -3.225202) (xy 1.70509 -3.189521) (xy 1.688472 -3.151725) (xy 1.659539 -3.112062)
    (xy 1.648711 -3.100104) (xy 1.609452 -3.064178) (xy 1.571401 -3.040836) (xy 1.53447 -3.030032)
    (xy 1.520825 -3.029203) (xy 1.499493 -3.030655) (xy 1.481796 -3.034182) (xy 1.476375 -3.03633)
    (xy 1.457628 -3.04967) (xy 1.437305 -3.06855) (xy 1.42001 -3.088384) (xy 1.412333 -3.100073)
    (xy 1.40484 -3.125846) (xy 1.404749 -3.157025) (xy 1.411884 -3.188819) (xy 1.415923 -3.198911)
    (xy 1.431432 -3.224699) (xy 1.45463 -3.253249) (xy 1.482163 -3.281051) (xy 1.510678 -3.304592)
    (xy 1.527175 -3.315391) (xy 1.564026 -3.33066) (xy 1.599868 -3.334047) (xy 1.633352 -3.325534)) (layer F.SilkS) (width 0.01))
  (fp_poly (pts (xy 0.903621 -2.299736) (xy 0.94415 -2.294233) (xy 0.983625 -2.283359) (xy 1.026834 -2.266032)
    (xy 1.0414 -2.259339) (xy 1.095375 -2.233978) (xy 2.096077 -1.232877) (xy 3.09678 -0.231775)
    (xy 3.123355 -0.1778) (xy 3.142852 -0.130889) (xy 3.157678 -0.080423) (xy 3.166591 -0.031303)
    (xy 3.16865 0.000826) (xy 3.165163 0.04145) (xy 3.155498 0.087789) (xy 3.140847 0.135218)
    (xy 3.123042 0.1778) (xy 3.096795 0.231775) (xy 1.095375 2.233327) (xy 1.0414 2.258987)
    (xy 1.013756 2.271362) (xy 0.9867 2.28218) (xy 0.964762 2.289672) (xy 0.95885 2.291246)
    (xy 0.923266 2.297344) (xy 0.883104 2.300915) (xy 0.843833 2.301674) (xy 0.81092 2.299338)
    (xy 0.808871 2.299031) (xy 0.753671 2.286012) (xy 0.698689 2.265186) (xy 0.65284 2.24062)
    (xy 0.643577 2.233076) (xy 0.62589 2.217007) (xy 0.600284 2.192919) (xy 0.567266 2.161318)
    (xy 0.52734 2.122708) (xy 0.481012 2.077597) (xy 0.428788 2.026488) (xy 0.371173 1.969889)
    (xy 0.308673 1.908305) (xy 0.241794 1.842241) (xy 0.171041 1.772203) (xy 0.09692 1.698696)
    (xy 0.019936 1.622227) (xy -0.059404 1.543301) (xy -0.140597 1.462423) (xy -0.223135 1.3801)
    (xy -0.306514 1.296837) (xy -0.390227 1.213139) (xy -0.473769 1.129513) (xy -0.556635 1.046463)
    (xy -0.638319 0.964496) (xy -0.718315 0.884118) (xy -0.796118 0.805833) (xy -0.871222 0.730147)
    (xy -0.943122 0.657567) (xy -1.011312 0.588597) (xy -1.075286 0.523744) (xy -1.134539 0.463513)
    (xy -1.188565 0.40841) (xy -1.236858 0.35894) (xy -1.278914 0.31561) (xy -1.314227 0.278924)
    (xy -1.34229 0.249388) (xy -1.362598 0.227509) (xy -1.374646 0.213791) (xy -1.377481 0.210047)
    (xy -1.408311 0.150229) (xy -1.428087 0.086059) (xy -1.436808 0.019439) (xy -1.435737 -0.011414)
    (xy -1.325489 -0.011414) (xy -1.321675 0.045848) (xy -1.305175 0.103326) (xy -1.295065 0.126353)
    (xy -1.292368 0.131502) (xy -1.288785 0.137345) (xy -1.283961 0.144246) (xy -1.27754 0.152568)
    (xy -1.269166 0.162673) (xy -1.258485 0.174925) (xy -1.24514 0.189687) (xy -1.228776 0.207321)
    (xy -1.209038 0.228191) (xy -1.185571 0.25266) (xy -1.158018 0.28109) (xy -1.126025 0.313844)
    (xy -1.089236 0.351286) (xy -1.047295 0.393779) (xy -0.999847 0.441685) (xy -0.946537 0.495368)
    (xy -0.887009 0.55519) (xy -0.820907 0.621514) (xy -0.747877 0.694704) (xy -0.667563 0.775123)
    (xy -0.579608 0.863132) (xy -0.483659 0.959096) (xy -0.379359 1.063378) (xy -0.289769 1.152935)
    (xy -0.172964 1.269658) (xy -0.064822 1.377657) (xy 0.034947 1.477218) (xy 0.12663 1.568625)
    (xy 0.210518 1.652163) (xy 0.2869 1.728116) (xy 0.356066 1.79677) (xy 0.418303 1.858408)
    (xy 0.473902 1.913316) (xy 0.523152 1.961779) (xy 0.566342 2.00408) (xy 0.603762 2.040505)
    (xy 0.6357 2.071339) (xy 0.662446 2.096866) (xy 0.684289 2.117371) (xy 0.701518 2.133138)
    (xy 0.714422 2.144453) (xy 0.723292 2.1516) (xy 0.727739 2.154541) (xy 0.78519 2.178105)
    (xy 0.843152 2.188982) (xy 0.901657 2.187178) (xy 0.922024 2.183604) (xy 0.931034 2.181816)
    (xy 0.939251 2.180266) (xy 0.947048 2.178606) (xy 0.954794 2.176486) (xy 0.96286 2.173558)
    (xy 0.971618 2.169474) (xy 0.981437 2.163884) (xy 0.99269 2.15644) (xy 1.005745 2.146792)
    (xy 1.020975 2.134594) (xy 1.03875 2.119494) (xy 1.059441 2.101146) (xy 1.083418 2.079199)
    (xy 1.111053 2.053306) (xy 1.142716 2.023117) (xy 1.178777 1.988285) (xy 1.219608 1.948459)
    (xy 1.265579 1.903292) (xy 1.317062 1.852434) (xy 1.374426 1.795537) (xy 1.438043 1.732253)
    (xy 1.508284 1.662232) (xy 1.585518 1.585125) (xy 1.670118 1.500585) (xy 1.762453 1.408261)
    (xy 1.862895 1.307806) (xy 1.971814 1.198871) (xy 2.017136 1.153547) (xy 2.129174 1.041514)
    (xy 2.232593 0.9381) (xy 2.327746 0.842933) (xy 2.414984 0.755642) (xy 2.494657 0.675854)
    (xy 2.567119 0.603199) (xy 2.632721 0.537305) (xy 2.691814 0.4778) (xy 2.74475 0.424312)
    (xy 2.79188 0.376471) (xy 2.833557 0.333904) (xy 2.870132 0.29624) (xy 2.901957 0.263108)
    (xy 2.929382 0.234135) (xy 2.952761 0.20895) (xy 2.972444 0.187181) (xy 2.988784 0.168458)
    (xy 3.002131 0.152408) (xy 3.012837 0.13866) (xy 3.021255 0.126842) (xy 3.027736 0.116583)
    (xy 3.032631 0.10751) (xy 3.036292 0.099253) (xy 3.039071 0.091441) (xy 3.04132 0.0837)
    (xy 3.043389 0.07566) (xy 3.045632 0.066949) (xy 3.045705 0.066675) (xy 3.054002 0.011341)
    (xy 3.049797 -0.045486) (xy 3.033144 -0.103393) (xy 3.019804 -0.13335) (xy 3.016655 -0.138514)
    (xy 3.011152 -0.145878) (xy 3.002962 -0.15578) (xy 2.991752 -0.168558) (xy 2.977191 -0.184551)
    (xy 2.958946 -0.204095) (xy 2.936685 -0.227529) (xy 2.910076 -0.255192) (xy 2.878787 -0.28742)
    (xy 2.842485 -0.324553) (xy 2.800838 -0.366928) (xy 2.753514 -0.414883) (xy 2.700181 -0.468757)
    (xy 2.640507 -0.528886) (xy 2.574159 -0.59561) (xy 2.500805 -0.669266) (xy 2.420114 -0.750192)
    (xy 2.331752 -0.838727) (xy 2.235387 -0.935208) (xy 2.130688 -1.039973) (xy 2.017322 -1.153361)
    (xy 2.017136 -1.153548) (xy 1.904524 -1.266176) (xy 1.800542 -1.37019) (xy 1.704815 -1.465938)
    (xy 1.616971 -1.553764) (xy 1.53664 -1.634016) (xy 1.463448 -1.70704) (xy 1.397023 -1.773182)
    (xy 1.336993 -1.832789) (xy 1.282986 -1.886208) (xy 1.23463 -1.933784) (xy 1.191552 -1.975864)
    (xy 1.153381 -2.012794) (xy 1.119744 -2.044922) (xy 1.090269 -2.072593) (xy 1.064583 -2.096154)
    (xy 1.042315 -2.115951) (xy 1.023093 -2.13233) (xy 1.006544 -2.145639) (xy 0.992296 -2.156223)
    (xy 0.979977 -2.164429) (xy 0.969215 -2.170604) (xy 0.959637 -2.175093) (xy 0.950872 -2.178243)
    (xy 0.942547 -2.180401) (xy 0.93429 -2.181913) (xy 0.925728 -2.183126) (xy 0.916491 -2.184385)
    (xy 0.908271 -2.185675) (xy 0.851791 -2.189258) (xy 0.795381 -2.180459) (xy 0.738296 -2.159161)
    (xy 0.737246 -2.158657) (xy 0.732095 -2.155957) (xy 0.726245 -2.152367) (xy 0.719332 -2.147531)
    (xy 0.710993 -2.141095) (xy 0.700865 -2.132701) (xy 0.688586 -2.121996) (xy 0.673793 -2.108624)
    (xy 0.656121 -2.09223) (xy 0.63521 -2.072458) (xy 0.610694 -2.048953) (xy 0.582212 -2.02136)
    (xy 0.549401 -1.989324) (xy 0.511897 -1.952488) (xy 0.469337 -1.910499) (xy 0.421359 -1.863)
    (xy 0.3676 -1.809636) (xy 0.307696 -1.750052) (xy 0.241285 -1.683893) (xy 0.168003 -1.610803)
    (xy 0.087488 -1.530427) (xy -0.000623 -1.44241) (xy -0.096694 -1.346396) (xy -0.201087 -1.24203)
    (xy -0.289761 -1.153361) (xy -0.400982 -1.042131) (xy -0.503571 -0.939509) (xy -0.597882 -0.845135)
    (xy -0.68427 -0.758643) (xy -0.763092 -0.679672) (xy -0.834702 -0.607859) (xy -0.899455 -0.542839)
    (xy -0.957708 -0.484252) (xy -1.009815 -0.431732) (xy -1.056131 -0.384919) (xy -1.097013 -0.343447)
    (xy -1.132814 -0.306956) (xy -1.163891 -0.27508) (xy -1.190599 -0.247459) (xy -1.213294 -0.223727)
    (xy -1.232329 -0.203524) (xy -1.248061 -0.186485) (xy -1.260846 -0.172248) (xy -1.271037 -0.160449)
    (xy -1.278992 -0.150726) (xy -1.285064 -0.142715) (xy -1.28961 -0.136055) (xy -1.292984 -0.130381)
    (xy -1.295057 -0.126354) (xy -1.316616 -0.068725) (xy -1.325489 -0.011414) (xy -1.435737 -0.011414)
    (xy -1.434476 -0.047731) (xy -1.421089 -0.113549) (xy -1.396649 -0.176114) (xy -1.377481 -0.210048)
    (xy -1.3699 -0.219369) (xy -1.353794 -0.237113) (xy -1.329669 -0.262775) (xy -1.298031 -0.29585)
    (xy -1.259385 -0.335832) (xy -1.214238 -0.382214) (xy -1.163095 -0.434491) (xy -1.106461 -0.492158)
    (xy -1.044844 -0.554709) (xy -0.978747 -0.621637) (xy -0.908678 -0.692438) (xy -0.835141 -0.766605)
    (xy -0.758643 -0.843632) (xy -0.67969 -0.923015) (xy -0.598787 -1.004246) (xy -0.516439 -1.086821)
    (xy -0.433154 -1.170233) (xy -0.349436 -1.253977) (xy -0.265791 -1.337547) (xy -0.182725 -1.420437)
    (xy -0.100743 -1.502142) (xy -0.020353 -1.582155) (xy 0.057942 -1.659972) (xy 0.133634 -1.735085)
    (xy 0.206219 -1.80699) (xy 0.27519 -1.875181) (xy 0.340042 -1.939151) (xy 0.400269 -1.998396)
    (xy 0.455365 -2.052409) (xy 0.504824 -2.100685) (xy 0.548141 -2.142718) (xy 0.58481 -2.178001)
    (xy 0.614325 -2.206031) (xy 0.636181 -2.226299) (xy 0.649871 -2.238302) (xy 0.653552 -2.241081)
    (xy 0.714974 -2.272836) (xy 0.780933 -2.292826) (xy 0.850655 -2.300826) (xy 0.85725 -2.300952)
    (xy 0.903621 -2.299736)) (layer F.SilkS) (width 0.01))
  (fp_poly (pts (xy 1.380281 -1.5486) (xy 1.437313 -1.531537) (xy 1.449058 -1.526643) (xy 1.454876 -1.523904)
    (xy 1.461199 -1.52037) (xy 1.468478 -1.515604) (xy 1.477165 -1.509172) (xy 1.487711 -1.500636)
    (xy 1.500567 -1.489562) (xy 1.516185 -1.475513) (xy 1.535016 -1.458053) (xy 1.55751 -1.436746)
    (xy 1.58412 -1.411156) (xy 1.615296 -1.380847) (xy 1.651491 -1.345384) (xy 1.693154 -1.304329)
    (xy 1.740737 -1.257248) (xy 1.794693 -1.203704) (xy 1.855471 -1.143261) (xy 1.923523 -1.075483)
    (xy 1.9993 -0.999935) (xy 2.083254 -0.91618) (xy 2.154475 -0.845102) (xy 2.231499 -0.768154)
    (xy 2.306258 -0.693328) (xy 2.378238 -0.621147) (xy 2.446923 -0.552132) (xy 2.511797 -0.486806)
    (xy 2.572345 -0.425693) (xy 2.628052 -0.369313) (xy 2.678402 -0.318191) (xy 2.72288 -0.272847)
    (xy 2.760971 -0.233806) (xy 2.792158 -0.201588) (xy 2.815928 -0.176718) (xy 2.831763 -0.159717)
    (xy 2.83915 -0.151107) (xy 2.839357 -0.150801) (xy 2.852409 -0.127097) (xy 2.864854 -0.098872)
    (xy 2.870869 -0.081973) (xy 2.881457 -0.027619) (xy 2.88096 0.02883) (xy 2.8698 0.084271)
    (xy 2.848395 0.135604) (xy 2.839357 0.1508) (xy 2.832658 0.158727) (xy 2.817468 0.175087)
    (xy 2.794304 0.199357) (xy 2.763682 0.231015) (xy 2.726116 0.269539) (xy 2.682122 0.314405)
    (xy 2.632215 0.365092) (xy 2.576911 0.421077) (xy 2.516725 0.481837) (xy 2.452172 0.54685)
    (xy 2.383769 0.615593) (xy 2.31203 0.687545) (xy 2.237471 0.762182) (xy 2.160607 0.838981)
    (xy 2.154475 0.845101) (xy 2.063754 0.935635) (xy 1.98156 1.017619) (xy 1.907444 1.09149)
    (xy 1.840956 1.157682) (xy 1.781646 1.21663) (xy 1.729065 1.268768) (xy 1.682763 1.314532)
    (xy 1.64229 1.354356) (xy 1.607197 1.388675) (xy 1.577033 1.417924) (xy 1.55135 1.442538)
    (xy 1.529698 1.462951) (xy 1.511626 1.479599) (xy 1.496686 1.492916) (xy 1.484427 1.503336)
    (xy 1.4744 1.511296) (xy 1.466155 1.517228) (xy 1.459242 1.52157) (xy 1.453213 1.524754)
    (xy 1.450127 1.526163) (xy 1.396437 1.545256) (xy 1.34617 1.553763) (xy 1.296369 1.552074)
    (xy 1.277847 1.54902) (xy 1.257285 1.543503) (xy 1.231556 1.534638) (xy 1.211172 1.526432)
    (xy 1.205384 1.52369) (xy 1.199036 1.5201) (xy 1.191676 1.515228) (xy 1.182855 1.508637)
    (xy 1.172121 1.499894) (xy 1.159024 1.488561) (xy 1.143114 1.474204) (xy 1.123939 1.456387)
    (xy 1.101049 1.434674) (xy 1.073994 1.40863) (xy 1.042322 1.377819) (xy 1.005583 1.341806)
    (xy 0.963327 1.300156) (xy 0.915102 1.252432) (xy 0.860458 1.198199) (xy 0.798945 1.137022)
    (xy 0.730111 1.068465) (xy 0.653507 0.992093) (xy 0.568681 0.907469) (xy 0.506162 0.845079)
    (xy 0.429136 0.768134) (xy 0.354376 0.69331) (xy 0.282395 0.62113) (xy 0.21371 0.552118)
    (xy 0.148835 0.486794) (xy 0.088286 0.425682) (xy 0.032579 0.369305) (xy -0.017771 0.318184)
    (xy -0.062249 0.272842) (xy -0.100339 0.233801) (xy -0.131526 0.201585) (xy -0.155294 0.176716)
    (xy -0.171128 0.159715) (xy -0.178513 0.151106) (xy -0.17872 0.1508) (xy -0.203826 0.100574)
    (xy -0.218097 0.046073) (xy -0.220903 0) (xy -0.10795 0) (xy -0.106114 0.031079)
    (xy -0.099649 0.056554) (xy -0.09224 0.073365) (xy -0.088073 0.079785) (xy -0.08006 0.089837)
    (xy -0.067843 0.103885) (xy -0.051064 0.122297) (xy -0.029365 0.145439) (xy -0.002386 0.173677)
    (xy 0.03023 0.207378) (xy 0.068842 0.246907) (xy 0.113808 0.292631) (xy 0.165487 0.344916)
    (xy 0.224237 0.404129) (xy 0.290417 0.470635) (xy 0.364384 0.544802) (xy 0.446497 0.626994)
    (xy 0.537116 0.71758) (xy 0.582447 0.76286) (xy 0.673613 0.853916) (xy 0.756233 0.93644)
    (xy 0.830768 1.010849) (xy 0.897679 1.077563) (xy 0.957427 1.137003) (xy 1.010472 1.189587)
    (xy 1.057276 1.235735) (xy 1.098301 1.275866) (xy 1.134006 1.310401) (xy 1.164853 1.339758)
    (xy 1.191304 1.364357) (xy 1.213818 1.384618) (xy 1.232858 1.40096) (xy 1.248883 1.413802)
    (xy 1.262356 1.423565) (xy 1.273737 1.430668) (xy 1.283487 1.43553) (xy 1.292067 1.438571)
    (xy 1.299939 1.44021) (xy 1.307563 1.440868) (xy 1.3154 1.440962) (xy 1.323912 1.440914)
    (xy 1.327606 1.440948) (xy 1.351938 1.439089) (xy 1.378739 1.433822) (xy 1.387931 1.431147)
    (xy 1.392743 1.429213) (xy 1.398474 1.42609) (xy 1.405568 1.421345) (xy 1.41447 1.41455)
    (xy 1.425624 1.405273) (xy 1.439475 1.393085) (xy 1.456467 1.377554) (xy 1.477045 1.358251)
    (xy 1.501654 1.334745) (xy 1.530737 1.306605) (xy 1.564741 1.273402) (xy 1.604108 1.234704)
    (xy 1.649284 1.190082) (xy 1.700713 1.139105) (xy 1.75884 1.081342) (xy 1.82411 1.016364)
    (xy 1.896967 0.943739) (xy 1.977855 0.863038) (xy 2.067219 0.773829) (xy 2.078256 0.76281)
    (xy 2.17038 0.670836) (xy 2.253951 0.587395) (xy 2.329385 0.512029) (xy 2.397099 0.444278)
    (xy 2.457508 0.383684) (xy 2.511028 0.329787) (xy 2.558076 0.28213) (xy 2.599066 0.240253)
    (xy 2.634415 0.203698) (xy 2.66454 0.172005) (xy 2.689855 0.144716) (xy 2.710777 0.121373)
    (xy 2.727722 0.101516) (xy 2.741106 0.084687) (xy 2.751345 0.070426) (xy 2.758855 0.058275)
    (xy 2.764051 0.047776) (xy 2.767351 0.038469) (xy 2.769168 0.029896) (xy 2.769921 0.021598)
    (xy 2.770024 0.013116) (xy 2.769894 0.003991) (xy 2.76987 0) (xy 2.769976 -0.009517)
    (xy 2.770018 -0.018205) (xy 2.769579 -0.026522) (xy 2.768244 -0.034928) (xy 2.765596 -0.043882)
    (xy 2.761219 -0.053842) (xy 2.754699 -0.065267) (xy 2.745618 -0.078616) (xy 2.73356 -0.094347)
    (xy 2.718111 -0.11292) (xy 2.698853 -0.134794) (xy 2.67537 -0.160426) (xy 2.647248 -0.190276)
    (xy 2.614069 -0.224802) (xy 2.575419 -0.264464) (xy 2.53088 -0.30972) (xy 2.480037 -0.361029)
    (xy 2.422474 -0.418849) (xy 2.357775 -0.48364) (xy 2.285524 -0.555861) (xy 2.205305 -0.635969)
    (xy 2.116703 -0.724424) (xy 2.078256 -0.762811) (xy 1.98787 -0.853043) (xy 1.906013 -0.934718)
    (xy 1.832239 -1.008266) (xy 1.766104 -1.074117) (xy 1.707164 -1.132702) (xy 1.654973 -1.184452)
    (xy 1.609088 -1.229796) (xy 1.569064 -1.269165) (xy 1.534455 -1.302989) (xy 1.504819 -1.331699)
    (xy 1.479709 -1.355726) (xy 1.458682 -1.375499) (xy 1.441293 -1.391449) (xy 1.427098 -1.404006)
    (xy 1.415651 -1.413602) (xy 1.406509 -1.420665) (xy 1.399226 -1.425627) (xy 1.393358 -1.428919)
    (xy 1.388461 -1.430969) (xy 1.387931 -1.431148) (xy 1.342338 -1.44051) (xy 1.297511 -1.437697)
    (xy 1.272718 -1.431148) (xy 1.267906 -1.429215) (xy 1.262175 -1.426091) (xy 1.255082 -1.421348)
    (xy 1.246182 -1.414554) (xy 1.23503 -1.405279) (xy 1.221182 -1.393092) (xy 1.204193 -1.377563)
    (xy 1.183619 -1.358262) (xy 1.159014 -1.334758) (xy 1.129936 -1.306621) (xy 1.095938 -1.27342)
    (xy 1.056576 -1.234725) (xy 1.011406 -1.190105) (xy 0.959983 -1.13913) (xy 0.901863 -1.08137)
    (xy 0.836602 -1.016394) (xy 0.763753 -0.943772) (xy 0.682874 -0.863073) (xy 0.593519 -0.773867)
    (xy 0.582447 -0.762811) (xy 0.487737 -0.66819) (xy 0.401698 -0.582132) (xy 0.323974 -0.504271)
    (xy 0.254204 -0.434241) (xy 0.192032 -0.371675) (xy 0.137097 -0.316207) (xy 0.089043 -0.26747)
    (xy 0.047509 -0.225098) (xy 0.012139 -0.188725) (xy -0.017428 -0.157984) (xy -0.041549 -0.132509)
    (xy -0.060582 -0.111935) (xy -0.074887 -0.095893) (xy -0.084821 -0.084019) (xy -0.090744 -0.075945)
    (xy -0.09224 -0.073366) (xy -0.102503 -0.047943) (xy -0.107202 -0.021283) (xy -0.10795 0)
    (xy -0.220903 0) (xy -0.221534 -0.01035) (xy -0.214136 -0.066343) (xy -0.195905 -0.119554)
    (xy -0.17872 -0.150801) (xy -0.172022 -0.158728) (xy -0.156834 -0.175088) (xy -0.133671 -0.199357)
    (xy -0.103048 -0.231014) (xy -0.065483 -0.269537) (xy -0.021489 -0.314402) (xy 0.028418 -0.365088)
    (xy 0.083723 -0.421071) (xy 0.143909 -0.481829) (xy 0.208462 -0.54684) (xy 0.276867 -0.615582)
    (xy 0.348607 -0.687531) (xy 0.423168 -0.762166) (xy 0.500033 -0.838963) (xy 0.506162 -0.84508)
    (xy 0.596832 -0.935559) (xy 0.678975 -1.017492) (xy 0.753042 -1.091313) (xy 0.819481 -1.157458)
    (xy 0.878745 -1.216362) (xy 0.931284 -1.268462) (xy 0.977548 -1.314192) (xy 1.017987 -1.353989)
    (xy 1.053053 -1.388287) (xy 1.083197 -1.417521) (xy 1.108868 -1.442129) (xy 1.130517 -1.462544)
    (xy 1.148594 -1.479202) (xy 1.163552 -1.49254) (xy 1.175839 -1.502991) (xy 1.185906 -1.510993)
    (xy 1.194205 -1.51698) (xy 1.201185 -1.521388) (xy 1.207298 -1.524652) (xy 1.21112 -1.52641)
    (xy 1.268785 -1.546038) (xy 1.324638 -1.553434) (xy 1.380281 -1.5486)) (layer F.SilkS) (width 0.01))
  (fp_poly (pts (xy 1.58009 -1.048107) (xy 1.603375 -1.041289) (xy 1.609876 -1.03871) (xy 1.616575 -1.035485)
    (xy 1.624034 -1.031081) (xy 1.632815 -1.024965) (xy 1.643477 -1.016604) (xy 1.656583 -1.005467)
    (xy 1.672694 -0.991021) (xy 1.692372 -0.972733) (xy 1.716177 -0.95007) (xy 1.744671 -0.922501)
    (xy 1.778416 -0.889493) (xy 1.817972 -0.850513) (xy 1.863902 -0.805029) (xy 1.916766 -0.752508)
    (xy 1.977126 -0.692419) (xy 2.045542 -0.624227) (xy 2.09438 -0.575525) (xy 2.175184 -0.494847)
    (xy 2.247259 -0.422689) (xy 2.310955 -0.358691) (xy 2.366624 -0.30249) (xy 2.414616 -0.253727)
    (xy 2.455281 -0.212042) (xy 2.488969 -0.177073) (xy 2.516032 -0.14846) (xy 2.536819 -0.125843)
    (xy 2.551682 -0.10886) (xy 2.56097 -0.097151) (xy 2.56425 -0.092075) (xy 2.572463 -0.0752)
    (xy 2.577528 -0.05947) (xy 2.580181 -0.040904) (xy 2.581156 -0.015517) (xy 2.581244 0)
    (xy 2.580881 0.0296) (xy 2.579247 0.050467) (xy 2.575579 0.06656) (xy 2.569113 0.081836)
    (xy 2.563371 0.092619) (xy 2.556958 0.101642) (xy 2.544402 0.116508) (xy 2.525414 0.137514)
    (xy 2.499703 0.164959) (xy 2.46698 0.199141) (xy 2.426955 0.240358) (xy 2.379338 0.288909)
    (xy 2.323839 0.345091) (xy 2.260168 0.409203) (xy 2.188035 0.481544) (xy 2.107152 0.56241)
    (xy 2.093471 0.576068) (xy 2.019564 0.649819) (xy 1.954074 0.715117) (xy 1.89644 0.772494)
    (xy 1.846103 0.822482) (xy 1.802502 0.865613) (xy 1.76508 0.902418) (xy 1.733275 0.93343)
    (xy 1.706528 0.959181) (xy 1.68428 0.980202) (xy 1.665971 0.997026) (xy 1.651041 1.010184)
    (xy 1.638931 1.020209) (xy 1.629082 1.027632) (xy 1.620933 1.032986) (xy 1.613925 1.036801)
    (xy 1.607499 1.039611) (xy 1.604724 1.040661) (xy 1.560802 1.051264) (xy 1.514546 1.053002)
    (xy 1.47135 1.0457) (xy 1.469366 1.045094) (xy 1.448162 1.0363) (xy 1.424709 1.023508)
    (xy 1.415391 1.017442) (xy 1.406996 1.010227) (xy 1.390313 0.994644) (xy 1.365999 0.971341)
    (xy 1.33471 0.940965) (xy 1.297103 0.904162) (xy 1.253836 0.86158) (xy 1.205565 0.813867)
    (xy 1.152947 0.761668) (xy 1.096639 0.705633) (xy 1.037299 0.646407) (xy 0.975583 0.584639)
    (xy 0.94873 0.55771) (xy 0.873762 0.482514) (xy 0.807218 0.415755) (xy 0.748597 0.356835)
    (xy 0.697398 0.305157) (xy 0.65312 0.260121) (xy 0.615264 0.221128) (xy 0.583328 0.18758)
    (xy 0.556813 0.158879) (xy 0.535217 0.134426) (xy 0.51804 0.113622) (xy 0.504782 0.095869)
    (xy 0.494943 0.080568) (xy 0.488021 0.067121) (xy 0.483516 0.054929) (xy 0.480928 0.043393)
    (xy 0.479757 0.031916) (xy 0.479501 0.019897) (xy 0.47966 0.00674) (xy 0.479708 0.001372)
    (xy 0.589462 0.001372) (xy 0.590073 0.009397) (xy 0.592495 0.018205) (xy 0.597232 0.028379)
    (xy 0.604786 0.040499) (xy 0.61566 0.055148) (xy 0.630358 0.072906) (xy 0.649382 0.094354)
    (xy 0.673235 0.120075) (xy 0.702421 0.150649) (xy 0.737441 0.186659) (xy 0.778799 0.228685)
    (xy 0.826998 0.277308) (xy 0.882541 0.333111) (xy 0.94593 0.396674) (xy 1.017669 0.468579)
    (xy 1.030741 0.481684) (xy 1.092649 0.543681) (xy 1.152301 0.603278) (xy 1.20905 0.659836)
    (xy 1.262251 0.71272) (xy 1.311259 0.761291) (xy 1.355428 0.804914) (xy 1.394112 0.84295)
    (xy 1.426665 0.874762) (xy 1.452443 0.899714) (xy 1.470799 0.917168) (xy 1.481089 0.926488)
    (xy 1.482725 0.927748) (xy 1.507107 0.936992) (xy 1.536188 0.939396) (xy 1.563839 0.934763)
    (xy 1.573527 0.930684) (xy 1.580376 0.924971) (xy 1.595542 0.910883) (xy 1.618387 0.889049)
    (xy 1.648272 0.860098) (xy 1.684558 0.824658) (xy 1.726605 0.783356) (xy 1.773774 0.736823)
    (xy 1.825426 0.685687) (xy 1.880922 0.630575) (xy 1.939622 0.572117) (xy 2.000887 0.51094)
    (xy 2.027643 0.484173) (xy 2.101439 0.410316) (xy 2.16678 0.344893) (xy 2.224168 0.287331)
    (xy 2.274101 0.237056) (xy 2.317078 0.193497) (xy 2.353599 0.156078) (xy 2.384163 0.124227)
    (xy 2.409271 0.097372) (xy 2.429421 0.074938) (xy 2.445112 0.056353) (xy 2.456844 0.041043)
    (xy 2.465117 0.028435) (xy 2.47043 0.017956) (xy 2.473283 0.009033) (xy 2.474174 0.001093)
    (xy 2.473603 -0.006438) (xy 2.47207 -0.014133) (xy 2.470075 -0.022565) (xy 2.469887 -0.02339)
    (xy 2.467947 -0.028388) (xy 2.463679 -0.035363) (xy 2.456578 -0.044841) (xy 2.44614 -0.057346)
    (xy 2.43186 -0.073405) (xy 2.413233 -0.093544) (xy 2.389755 -0.118287) (xy 2.360921 -0.148162)
    (xy 2.326227 -0.183694) (xy 2.285168 -0.225408) (xy 2.23724 -0.27383) (xy 2.181938 -0.329486)
    (xy 2.118757 -0.392902) (xy 2.047192 -0.464603) (xy 2.027643 -0.484174) (xy 1.965478 -0.546319)
    (xy 1.905605 -0.606013) (xy 1.848665 -0.662629) (xy 1.795295 -0.715539) (xy 1.746135 -0.764112)
    (xy 1.701825 -0.807722) (xy 1.663004 -0.845739) (xy 1.630311 -0.877535) (xy 1.604385 -0.902482)
    (xy 1.585865 -0.91995) (xy 1.57539 -0.929313) (xy 1.573527 -0.930685) (xy 1.549335 -0.938049)
    (xy 1.520728 -0.939107) (xy 1.494316 -0.933856) (xy 1.487172 -0.93072) (xy 1.480324 -0.925008)
    (xy 1.465164 -0.910918) (xy 1.44233 -0.889078) (xy 1.412461 -0.860118) (xy 1.376198 -0.824667)
    (xy 1.334179 -0.783354) (xy 1.287044 -0.736809) (xy 1.235433 -0.68566) (xy 1.179983 -0.630537)
    (xy 1.121336 -0.57207) (xy 1.06013 -0.510886) (xy 1.033915 -0.484632) (xy 0.960866 -0.411398)
    (xy 0.8963 -0.346582) (xy 0.839701 -0.289641) (xy 0.790549 -0.240035) (xy 0.748329 -0.197221)
    (xy 0.712521 -0.160659) (xy 0.682609 -0.129805) (xy 0.658074 -0.104119) (xy 0.638399 -0.08306)
    (xy 0.623067 -0.066084) (xy 0.611559 -0.052652) (xy 0.603358 -0.042221) (xy 0.597946 -0.034249)
    (xy 0.594806 -0.028195) (xy 0.593471 -0.023813) (xy 0.591664 -0.014651) (xy 0.59016 -0.00645)
    (xy 0.589462 0.001372) (xy 0.479708 0.001372) (xy 0.47975 -0.003175) (xy 0.479709 -0.01671)
    (xy 0.479867 -0.028942) (xy 0.480721 -0.040455) (xy 0.482765 -0.051829) (xy 0.486495 -0.063649)
    (xy 0.492408 -0.076496) (xy 0.500999 -0.090953) (xy 0.512764 -0.107603) (xy 0.528198 -0.127029)
    (xy 0.547798 -0.149812) (xy 0.57206 -0.176535) (xy 0.601478 -0.207781) (xy 0.63655 -0.244133)
    (xy 0.67777 -0.286173) (xy 0.725635 -0.334483) (xy 0.78064 -0.389646) (xy 0.843281 -0.452245)
    (xy 0.914054 -0.522862) (xy 0.966989 -0.57567) (xy 1.043743 -0.652189) (xy 1.11205 -0.720141)
    (xy 1.17239 -0.779991) (xy 1.225247 -0.832204) (xy 1.271101 -0.877244) (xy 1.310436 -0.915575)
    (xy 1.343733 -0.947661) (xy 1.371473 -0.973967) (xy 1.394139 -0.994957) (xy 1.412213 -1.011095)
    (xy 1.426177 -1.022845) (xy 1.436512 -1.030673) (xy 1.443701 -1.035041) (xy 1.443959 -1.035164)
    (xy 1.486688 -1.048919) (xy 1.53359 -1.053292) (xy 1.58009 -1.048107)) (layer F.SilkS) (width 0.01))
)
