#VRML V2.0 utf8
#modeled using blender3d http://blender.org

# 'Shape_IndexedFaceSet'
Shape {
	appearance Appearance {
		material Material {
		}
	}
	geometry IndexedFaceSet {
		coord Coordinate {
			point [ -2.374800 1.391240 2.604215 -2.374800 1.391240 0.005794 -2.374800 0.761320 2.604215 -2.374800 0.761320 1.383744 -2.374800 0.760565 1.368348 -2.374800 0.758295 1.353028 -2.374800 0.756968 1.346977 -2.374800 0.754532 1.338008 -2.374800 0.749343 1.323503 -2.374800 0.744159 1.312257 -2.374800 0.742750 1.309556 -2.374800 0.734786 1.296262 -2.374800 0.725556 1.283820 -2.374800 0.723583 1.281463 -2.374800 0.715207 1.272401 -2.374800 0.703782 1.262041 -2.374800 0.696408 1.256343 -2.374800 0.691336 1.252808 -2.374800 0.678047 1.244844 -2.374800 0.664113 1.238255 -2.374800 0.664105 1.238252 -2.374800 0.649595 1.233058 -2.374800 0.634565 1.229291 -2.374800 0.619239 1.227019 -2.374800 0.603840 1.226264 -2.374800 0.588444 1.227019 -2.374800 0.573124 1.229289 -2.374800 0.573118 1.229290 -2.374800 0.558104 1.233052 -2.374800 0.543599 1.238242 -2.374800 0.543576 1.238252 -2.374800 0.529652 1.244834 -2.374800 0.516358 1.252799 -2.374800 0.511272 1.256343 -2.374800 0.503916 1.262028 -2.374800 0.492497 1.272377 -2.374800 0.484096 1.281463 -2.374800 0.482137 1.283803 -2.374800 0.472904 1.296248 -2.374800 0.464940 1.309537 -2.374800 0.463520 1.312258 -2.374800 0.458351 1.323471 -2.374800 0.453154 1.337989 -2.374800 0.450713 1.346977 -2.374800 0.449386 1.353019 -2.374800 0.447115 1.368346 -2.374800 0.446360 2.604215 -2.374800 0.446360 1.383744 -2.374800 -0.341040 0.399494 -2.374800 -0.341040 0.005794 -2.374800 -0.577260 2.604214 -2.374800 -0.577260 0.399494 -2.099210 1.233760 2.604215 -2.099210 1.233760 0.635714 -2.099210 0.761320 2.604215 -2.099210 0.761320 1.383744 -2.099210 0.760565 1.368346 -2.099210 0.758294 1.353019 -2.099210 0.754526 1.337989 -2.099210 0.749332 1.323479 -2.099210 0.749329 1.323471 -2.099210 0.742740 1.309537 -2.099210 0.734776 1.296248 -2.099210 0.731242 1.291177 -2.099210 0.725543 1.283803 -2.099210 0.715183 1.272377 -2.099210 0.706122 1.264001 -2.099210 0.703765 1.262028 -2.099210 0.691323 1.252799 -2.099210 0.678028 1.244834 -2.099210 0.675327 1.243425 -2.099210 0.664081 1.238242 -2.099210 0.649576 1.233052 -2.099210 0.640608 1.230617 -2.099210 0.634557 1.229289 -2.099210 0.619236 1.227019 -2.099210 0.603840 1.226264 -2.099210 0.588442 1.227019 -2.099210 0.573115 1.229291 -2.099210 0.558085 1.233058 -2.099210 0.543575 1.238252 -2.099210 0.543567 1.238255 -2.099210 0.529633 1.244844 -2.099210 0.516343 1.252808 -2.099210 0.511272 1.256343 -2.099210 0.503898 1.262041 -2.099210 0.492473 1.272401 -2.099210 0.484097 1.281463 -2.099210 0.482123 1.283820 -2.099210 0.472894 1.296262 -2.099210 0.464930 1.309556 -2.099210 0.463521 1.312257 -2.099210 0.458337 1.323503 -2.099210 0.453148 1.338008 -2.099210 0.450713 1.346977 -2.099210 0.449385 1.353028 -2.099210 0.447114 1.368348 -2.099210 0.446360 2.604214 -2.099210 0.446360 1.383744 -2.099210 -0.419780 1.836499 -2.099210 -0.419780 0.635714 -2.099210 -0.577260 2.604214 -2.099210 -0.577260 1.836499 -1.981100 1.391240 0.064849 -1.981100 1.391240 0.005794 -1.981100 -0.341040 0.064849 -1.981100 -0.341040 0.005794 -1.941730 1.391240 2.604215 -1.941730 1.391240 1.836499 -1.941730 1.233760 2.604215 -1.941730 1.233760 1.836499 -1.685825 0.899115 1.659334 -1.685825 0.899115 0.635714 -1.685825 0.899115 0.064849 -1.685825 0.899115 -1.017826 -1.685825 0.702265 1.659334 -1.685825 0.702265 0.635714 -1.685825 0.702265 0.064849 -1.685825 0.702265 -1.017826 -1.685825 0.111715 1.659334 -1.685825 0.111715 0.635714 -1.685825 0.111715 0.064849 -1.685825 0.111715 -1.017826 -1.685825 -0.085135 1.659334 -1.685825 -0.085135 0.635714 -1.685825 -0.085135 0.064849 -1.685825 -0.085135 -1.017826 -1.646455 0.859745 1.816814 -1.646455 0.859745 -1.175306 -1.646455 0.741635 1.816814 -1.646455 0.741635 -1.175306 -1.646455 0.072345 1.816814 -1.646455 0.072345 -1.175306 -1.646455 -0.045765 1.816814 -1.646455 -0.045765 -1.175306 -1.528345 0.859745 1.816814 -1.528345 0.859745 -1.175306 -1.528345 0.741635 1.816814 -1.528345 0.741635 -1.175306 -1.528345 0.072345 1.816814 -1.528345 0.072345 -1.175306 -1.528345 -0.045765 1.816814 -1.528345 -0.045765 -1.175306 -1.488975 0.899115 1.659334 -1.488975 0.899115 0.635714 -1.488975 0.899115 0.064849 -1.488975 0.899115 -1.017826 -1.488975 0.702265 1.659334 -1.488975 0.702265 0.635714 -1.488975 0.702265 0.064849 -1.488975 0.702265 -1.017826 -1.488975 0.111715 1.659334 -1.488975 0.111715 0.635714 -1.488975 0.111715 0.064849 -1.488975 0.111715 -1.017826 -1.488975 -0.085135 1.659334 -1.488975 -0.085135 0.635714 -1.488975 -0.085135 0.064849 -1.488975 -0.085135 -1.017826 -1.390550 1.391240 0.064849 -1.390550 1.391240 0.005794 -1.390550 0.603840 0.064849 -1.390550 0.603840 0.005794 -1.390550 0.210140 0.064849 -1.390550 0.210140 0.005794 -1.390550 -0.341040 0.064849 -1.390550 -0.341040 0.005794 -0.996850 1.391240 0.064849 -0.996850 1.391240 0.005794 -0.996850 0.603840 0.064849 -0.996850 0.603840 0.005794 -0.996850 0.210140 0.064849 -0.996850 0.210140 0.005794 -0.996850 -0.341040 0.064849 -0.996850 -0.341040 0.005794 -0.898425 0.899115 1.659334 -0.898425 0.899115 0.635714 -0.898425 0.899115 0.064849 -0.898425 0.899115 -1.017826 -0.898425 0.702265 1.659334 -0.898425 0.702265 0.635714 -0.898425 0.702265 0.064849 -0.898425 0.702265 -1.017826 -0.898425 0.111715 1.659334 -0.898425 0.111715 0.635714 -0.898425 0.111715 0.064849 -0.898425 0.111715 -1.017826 -0.898425 -0.085135 1.659334 -0.898425 -0.085135 0.635714 -0.898425 -0.085135 0.064849 -0.898425 -0.085135 -1.017826 -0.859055 0.859745 1.816814 -0.859055 0.859745 -1.175306 -0.859055 0.741635 1.816814 -0.859055 0.741635 -1.175306 -0.859055 0.072345 1.816814 -0.859055 0.072345 -1.175306 -0.859055 -0.045765 1.816814 -0.859055 -0.045765 -1.175306 -0.740945 0.859745 1.816814 -0.740945 0.859745 -1.175306 -0.740945 0.741635 1.816814 -0.740945 0.741635 -1.175306 -0.740945 0.072345 1.816814 -0.740945 0.072345 -1.175306 -0.740945 -0.045765 1.816814 -0.740945 -0.045765 -1.175306 -0.701575 0.899115 1.659334 -0.701575 0.899115 0.635714 -0.701575 0.899115 0.064849 -0.701575 0.899115 -1.017826 -0.701575 0.702265 1.659334 -0.701575 0.702265 0.635714 -0.701575 0.702265 0.064849 -0.701575 0.702265 -1.017826 -0.701575 0.111715 1.659334 -0.701575 0.111715 0.635714 -0.701575 0.111715 0.064849 -0.701575 0.111715 -1.017826 -0.701575 -0.085135 1.659334 -0.701575 -0.085135 0.635714 -0.701575 -0.085135 0.064849 -0.701575 -0.085135 -1.017826 -0.603150 1.391240 0.064849 -0.603150 1.391240 0.005794 -0.603150 0.603840 0.064849 -0.603150 0.603840 0.005794 -0.603150 0.210140 0.064849 -0.603150 0.210140 0.005794 -0.603150 -0.341040 0.064849 -0.603150 -0.341040 0.005794 -0.209450 1.391240 0.064849 -0.209450 1.391240 0.005794 -0.209450 0.603840 0.064849 -0.209450 0.603840 0.005794 -0.209450 0.210140 0.064849 -0.209450 0.210140 0.005794 -0.209450 -0.341040 0.064849 -0.209450 -0.341040 0.005794 -0.111025 0.899115 1.659334 -0.111025 0.899115 0.635714 -0.111025 0.899115 0.064849 -0.111025 0.899115 -1.017826 -0.111025 0.702265 1.659334 -0.111025 0.702265 0.635714 -0.111025 0.702265 0.064849 -0.111025 0.702265 -1.017826 -0.111025 0.111715 1.659334 -0.111025 0.111715 0.635714 -0.111025 0.111715 0.064849 -0.111025 0.111715 -1.017826 -0.111025 -0.085135 1.659334 -0.111025 -0.085135 0.635714 -0.111025 -0.085135 0.064849 -0.111025 -0.085135 -1.017826 -0.071655 0.859745 1.816814 -0.071655 0.859745 -1.175306 -0.071655 0.741635 1.816814 -0.071655 0.741635 -1.175306 -0.071655 0.072345 1.816814 -0.071655 0.072345 -1.175306 -0.071655 -0.045765 1.816814 -0.071655 -0.045765 -1.175306 0.046455 0.859745 1.816814 0.046455 0.859745 -1.175306 0.046455 0.741635 1.816814 0.046455 0.741635 -1.175306 0.046455 0.072345 1.816814 0.046455 0.072345 -1.175306 0.046455 -0.045765 1.816814 0.046455 -0.045765 -1.175306 0.085825 0.899115 1.659334 0.085825 0.899115 0.635714 0.085825 0.899115 0.064849 0.085825 0.899115 -1.017826 0.085825 0.702265 1.659334 0.085825 0.702265 0.635714 0.085825 0.702265 0.064849 0.085825 0.702265 -1.017826 0.085825 0.111715 1.659334 0.085825 0.111715 0.635714 0.085825 0.111715 0.064849 0.085825 0.111715 -1.017826 0.085825 -0.085135 1.659334 0.085825 -0.085135 0.635714 0.085825 -0.085135 0.064849 0.085825 -0.085135 -1.017826 0.341730 1.391240 2.604214 0.341730 1.391240 1.836499 0.341730 1.233760 2.604214 0.341730 1.233760 1.836499 0.381100 1.391240 0.064849 0.381100 1.391240 0.005794 0.381100 -0.341040 0.064849 0.381100 -0.341040 0.005794 0.499210 1.233760 2.604214 0.499210 1.233760 0.635714 0.499210 0.761320 2.604214 0.499210 0.761320 1.383744 0.499210 0.760565 1.368346 0.499210 0.758294 1.353019 0.499210 0.754526 1.337989 0.499210 0.749332 1.323479 0.499210 0.749329 1.323471 0.499210 0.742740 1.309537 0.499210 0.734776 1.296248 0.499210 0.731242 1.291177 0.499210 0.725543 1.283803 0.499210 0.715183 1.272377 0.499210 0.706122 1.264001 0.499210 0.703765 1.262028 0.499210 0.691323 1.252799 0.499210 0.678028 1.244834 0.499210 0.675327 1.243425 0.499210 0.664081 1.238242 0.499210 0.649576 1.233052 0.499210 0.640608 1.230617 0.499210 0.634557 1.229289 0.499210 0.619236 1.227019 0.499210 0.603840 1.226264 0.499210 0.588442 1.227019 0.499210 0.573115 1.229290 0.499210 0.558085 1.233058 0.499210 0.543575 1.238252 0.499210 0.543567 1.238255 0.499210 0.529633 1.244844 0.499210 0.516343 1.252808 0.499210 0.511272 1.256343 0.499210 0.503898 1.262041 0.499210 0.492473 1.272401 0.499210 0.484097 1.281462 0.499210 0.482123 1.283819 0.499210 0.472894 1.296262 0.499210 0.464930 1.309556 0.499210 0.463521 1.312257 0.499210 0.458337 1.323503 0.499210 0.453148 1.338008 0.499210 0.450713 1.346977 0.499210 0.449385 1.353028 0.499210 0.447114 1.368348 0.499210 0.446360 2.604214 0.499210 0.446360 1.383744 0.499210 -0.419780 1.836499 0.499210 -0.419780 0.635714 0.499210 -0.577260 2.604214 0.499210 -0.577260 1.836499 0.774800 1.391240 2.604214 0.774800 1.391240 0.005794 0.774800 0.761320 2.604214 0.774800 0.761320 1.383744 0.774800 0.760565 1.368348 0.774800 0.758295 1.353028 0.774800 0.756968 1.346977 0.774800 0.754532 1.338008 0.774800 0.749343 1.323503 0.774800 0.744159 1.312257 0.774800 0.742750 1.309556 0.774800 0.734786 1.296262 0.774800 0.725556 1.283819 0.774800 0.723583 1.281462 0.774800 0.715207 1.272401 0.774800 0.703782 1.262041 0.774800 0.696408 1.256343 0.774800 0.691336 1.252808 0.774800 0.678047 1.244844 0.774800 0.664113 1.238255 0.774800 0.664105 1.238252 0.774800 0.649595 1.233058 0.774800 0.634565 1.229290 0.774800 0.619239 1.227019 0.774800 0.603840 1.226264 0.774800 0.588444 1.227019 0.774800 0.573124 1.229289 0.774800 0.573118 1.229290 0.774800 0.558104 1.233052 0.774800 0.543599 1.238242 0.774800 0.543576 1.238252 0.774800 0.529652 1.244834 0.774800 0.516358 1.252799 0.774800 0.511272 1.256343 0.774800 0.503916 1.262028 0.774800 0.492497 1.272377 0.774800 0.484096 1.281463 0.774800 0.482137 1.283803 0.774800 0.472904 1.296248 0.774800 0.464940 1.309537 0.774800 0.463520 1.312258 0.774800 0.458351 1.323471 0.774800 0.453154 1.337989 0.774800 0.450713 1.346977 0.774800 0.449386 1.353019 0.774800 0.447115 1.368346 0.774800 0.446360 2.604214 0.774800 0.446360 1.383744 0.774800 -0.341040 0.399494 0.774800 -0.341040 0.005794 0.774800 -0.577260 2.604214 0.774800 -0.577260 0.399494 ]
		}
		colorPerVertex TRUE
		color Color {
			color [ 0.31 0.31 0.31 0.31 0.31 0.31 0.31 0.31 0.31 0.31 0.31 0.31 0.31 0.31 0.31 0.31 0.31 0.31 0.31 0.31 0.31 0.31 0.31 0.31 0.31 0.31 0.31 0.31 0.31 0.31 0.31 0.31 0.31 0.31 0.31 0.31 0.31 0.31 0.31 0.31 0.31 0.31 0.31 0.31 0.31 0.31 0.31 0.31 0.31 0.31 0.31 0.31 0.31 0.31 0.31 0.31 0.31 0.31 0.31 0.31 0.31 0.31 0.31 0.31 0.31 0.31 0.31 0.31 0.31 0.31 0.31 0.31 0.31 0.31 0.31 0.31 0.31 0.31 0.31 0.31 0.31 0.31 0.31 0.31 0.31 0.31 0.31 0.31 0.31 0.31 0.31 0.31 0.31 0.31 0.31 0.31 0.31 0.31 0.31 0.31 0.31 0.31 0.31 0.31 0.31 0.31 0.31 0.31 0.31 0.31 0.31 0.31 0.31 0.31 0.31 0.31 0.31 0.31 0.31 0.31 0.31 0.31 0.31 0.31 0.31 0.31 0.31 0.31 0.31 0.31 0.31 0.31 0.31 0.31 0.31 0.31 0.31 0.31 0.31 0.31 0.31 0.31 0.31 0.31 0.31 0.31 0.31 0.31 0.31 0.31 0.31 0.31 0.31 0.31 0.31 0.31 0.31 0.31 0.31 0.31 0.31 0.31 0.31 0.31 0.31 0.31 0.31 0.31 0.31 0.31 0.31 0.31 0.31 0.31 0.31 0.31 0.31 0.31 0.31 0.31 0.31 0.31 0.31 0.31 0.31 0.31 0.31 0.31 0.31 0.31 0.31 0.31 0.31 0.31 0.31 0.31 0.31 0.31 0.31 0.31 0.31 0.31 0.31 0.31 0.31 0.31 0.31 0.31 0.31 0.31 0.31 0.31 0.31 0.31 0.31 0.31 0.31 0.31 0.31 0.31 0.31 0.31 0.31 0.31 0.31 0.31 0.31 0.31 0.31 0.31 0.31 0.31 0.31 0.31 0.31 0.31 0.31 0.31 0.31 0.31 0.31 0.31 0.31 0.31 0.31 0.31 0.31 0.31 0.31 0.31 0.31 0.31 0.31 0.31 0.31 0.31 0.31 0.31 0.31 0.31 0.31 0.31 0.31 0.31 0.31 0.31 0.31 0.31 0.31 0.31 0.31 0.31 0.31 0.31 0.31 0.31 0.31 0.31 0.31 0.31 0.31 0.31 0.31 0.31 0.31 0.31 0.31 0.31 0.31 0.31 0.31 0.31 0.31 0.31 0.31 0.31 0.31 0.31 0.31 0.31 0.31 0.31 0.31 0.31 0.31 0.31 0.31 0.31 0.31 0.31 0.31 0.31 0.31 0.31 0.31 0.31 0.31 0.31 0.31 0.31 0.31 0.31 0.31 0.31 0.31 0.31 0.31 0.31 0.31 0.31 0.31 0.31 0.31 1.00 1.00 0.00 0.31 0.31 0.31 1.00 1.00 0.00 1.00 1.00 0.00 1.00 1.00 0.00 0.31 0.31 0.31 0.31 0.31 0.31 1.00 1.00 0.00 1.00 1.00 0.00 1.00 1.00 0.00 1.00 1.00 0.00 1.00 1.00 0.00 1.00 1.00 0.00 1.00 1.00 0.00 0.31 0.31 0.31 1.00 1.00 0.00 1.00 1.00 0.00 1.00 1.00 0.00 1.00 1.00 0.00 1.00 1.00 0.00 1.00 1.00 0.00 1.00 1.00 0.00 1.00 1.00 0.00 1.00 1.00 0.00 1.00 1.00 0.00 1.00 1.00 0.00 1.00 1.00 0.00 1.00 1.00 0.00 1.00 1.00 0.00 1.00 1.00 0.00 1.00 1.00 0.00 1.00 1.00 0.00 1.00 1.00 0.00 1.00 1.00 0.00 1.00 1.00 0.00 1.00 1.00 0.00 1.00 1.00 0.00 0.31 0.31 0.31 0.31 0.31 0.31 1.00 1.00 0.00 1.00 1.00 0.00 1.00 1.00 0.00 1.00 1.00 0.00 1.00 1.00 0.00 1.00 1.00 0.00 0.31 0.31 0.31 0.31 0.31 0.31 1.00 1.00 0.00 0.31 0.31 0.31 0.31 0.31 0.31 0.31 0.31 0.31 0.31 0.31 0.31 0.31 0.31 0.31 0.31 0.31 0.31 0.31 0.31 0.31 0.31 0.31 0.31 0.31 0.31 0.31 0.31 0.31 0.31 0.31 0.31 0.31 0.31 0.31 0.31 0.31 0.31 0.31 0.31 0.31 0.31 0.31 0.31 0.31 0.31 0.31 0.31 1.00 1.00 0.00 1.00 1.00 0.00 1.00 1.00 0.00 1.00 1.00 0.00 1.00 1.00 0.00 0.31 0.31 0.31 1.00 1.00 0.00 1.00 1.00 0.00 1.00 1.00 0.00 1.00 1.00 0.00 1.00 1.00 0.00 1.00 1.00 0.00 1.00 1.00 0.00 1.00 1.00 0.00 1.00 1.00 0.00 1.00 1.00 0.00 1.00 1.00 0.00 1.00 1.00 0.00 1.00 1.00 0.00 1.00 1.00 0.00 1.00 1.00 0.00 1.00 1.00 0.00 1.00 1.00 0.00 1.00 1.00 0.00 1.00 1.00 0.00 1.00 1.00 0.00 1.00 1.00 0.00 1.00 1.00 0.00 1.00 1.00 0.00 1.00 1.00 0.00 1.00 1.00 0.00 1.00 1.00 0.00 1.00 1.00 0.00 0.31 0.31 0.31 1.00 1.00 0.00 1.00 1.00 0.00 1.00 1.00 0.00 0.31 0.31 0.31 0.31 0.31 0.31 1.00 1.00 0.00 1.00 1.00 0.00 1.00 1.00 0.00 0.31 0.31 0.31 1.00 1.00 0.00 1.00 1.00 0.00 0.31 0.31 0.31 0.31 0.31 0.31 1.00 1.00 0.00 0.31 0.31 0.31 0.31 0.31 0.31 0.31 0.31 0.31 0.31 0.31 0.31 0.31 0.31 0.31 0.31 0.31 0.31 0.31 0.31 0.31 0.31 0.31 0.31 0.31 0.31 0.31 0.31 0.31 0.31 0.31 0.31 0.31 0.31 0.31 0.31 0.31 0.31 0.31 0.31 0.31 0.31 0.31 0.31 0.31 0.31 0.31 0.31 1.00 1.00 0.00 1.00 1.00 0.00 1.00 1.00 0.00 1.00 1.00 0.00 1.00 1.00 0.00 1.00 1.00 0.00 1.00 1.00 0.00 1.00 1.00 0.00 1.00 1.00 0.00 1.00 1.00 0.00 1.00 1.00 0.00 1.00 1.00 0.00 1.00 1.00 0.00 1.00 1.00 0.00 0.31 0.31 0.31 1.00 1.00 0.00 1.00 1.00 0.00 1.00 1.00 0.00 1.00 1.00 0.00 1.00 1.00 0.00 1.00 1.00 0.00 1.00 1.00 0.00 1.00 1.00 0.00 1.00 1.00 0.00 1.00 1.00 0.00 1.00 1.00 0.00 1.00 1.00 0.00 1.00 1.00 0.00 1.00 1.00 0.00 1.00 1.00 0.00 1.00 1.00 0.00 1.00 1.00 0.00 1.00 1.00 0.00 0.31 0.31 0.31 1.00 1.00 0.00 1.00 1.00 0.00 1.00 1.00 0.00 1.00 1.00 0.00 0.31 0.31 0.31 1.00 1.00 0.00 1.00 1.00 0.00 0.31 0.31 0.31 1.00 1.00 0.00 1.00 1.00 0.00 1.00 1.00 0.00 0.31 0.31 0.31 0.31 0.31 0.31 1.00 1.00 0.00 0.31 0.31 0.31 0.31 0.31 0.31 0.31 0.31 0.31 0.31 0.31 0.31 0.31 0.31 0.31 0.31 0.31 0.31 0.31 0.31 0.31 0.31 0.31 0.31 0.31 0.31 0.31 0.31 0.31 0.31 0.31 0.31 0.31 0.31 0.31 0.31 0.31 0.31 0.31 0.31 0.31 0.31 0.31 0.31 0.31 0.31 0.31 0.31 0.31 0.31 0.31 0.31 0.31 0.31 0.31 0.31 0.31 0.31 0.31 0.31 0.31 0.31 0.31 0.31 0.31 0.31 0.31 0.31 0.31 0.31 0.31 0.31 0.31 0.31 0.31 0.31 0.31 0.31 0.31 0.31 0.31 0.31 0.31 0.31 0.31 0.31 0.31 0.31 0.31 0.31 0.31 0.31 0.31 0.31 0.31 0.31 0.31 0.31 0.31 0.31 0.31 0.31 0.31 0.31 0.31 0.31 0.31 0.31 0.31 0.31 0.31 0.31 0.31 0.31 0.31 0.31 0.31 0.31 0.31 0.31 0.31 0.31 0.31 0.31 0.31 0.31 0.31 0.31 0.31 0.31 0.31 0.31 0.31 0.31 0.31 0.31 0.31 0.31 0.31 0.31 0.31 0.31 0.31 0.31 0.31 0.31 0.31 0.31 0.31 0.31 0.31 0.31 0.31 0.31 0.31 0.31 0.31 0.31 0.31 0.31 0.31 0.31 0.31 0.31 0.31 0.31 0.31 0.31 0.31 0.31 0.31 0.31 0.31 0.31 0.31 0.31 0.31 0.31 0.31 0.31 0.31 0.31 0.31 0.31 0.31 0.31 0.31 0.31 0.31 0.31 0.31 0.31 0.31 0.31 0.31 0.31 0.31 0.31 0.31 0.31 0.31 0.31 0.31 0.31 0.31 0.31 0.31 0.31 0.31 0.31 0.31 0.31 0.31 0.31 0.31 0.31 0.31 0.31 0.31 0.31 0.31 0.31 0.31 0.31 0.31 0.31 0.31 0.31 0.31 0.31 0.31 0.31 0.31 0.31 0.31 0.31 0.31 0.31 0.31 0.31 0.31 0.31 0.31 0.31 0.31 0.31 0.31 0.31 0.31 0.31 0.31 0.31 0.31 0.31 0.31 0.31 0.31 0.31 0.31 0.31 0.31 0.31 0.31 0.31 0.31 0.31 0.31 0.31 0.31 0.31 0.31 0.31 0.31 0.31 0.31 0.31 0.31 0.31 0.31 0.31 0.31 0.31 0.31 0.31 0.31 0.31 0.31 0.31 0.31 0.31 0.31 0.31 0.31 0.31 0.31 0.31 0.31 0.31 0.31 0.31 0.31 0.31 0.31 0.31 0.31 0.31 0.31 0.31 0.31 0.31 0.31 0.31 0.31 0.31 0.31 0.31 0.31 0.31 0.31 0.31 0.31 0.31 0.31 0.31 0.31 0.31 0.31 0.31 0.31 0.31 0.31 0.31 0.31 ]
		}
		coordIndex [ 0 1 3 -1 0 2 52 -1 0 3 2 -1 0 52 107 -1 0 107 108 -1 0 108 1 -1 1 4 3 -1 1 5 4 -1 1 6 5 -1 1 7 6 -1 1 8 7 -1 1 9 8 -1 1 10 9 -1 1 11 10 -1 1 12 11 -1 1 13 12 -1 1 14 13 -1 1 15 14 -1 1 16 15 -1 1 17 16 -1 1 18 17 -1 1 19 18 -1 1 21 19 -1 1 22 21 -1 1 23 22 -1 1 24 23 -1 1 48 24 -1 1 49 48 -1 1 103 104 -1 1 104 49 -1 1 108 103 -1 2 3 54 -1 2 54 52 -1 3 4 55 -1 3 55 54 -1 4 5 56 -1 4 56 55 -1 5 6 57 -1 5 57 56 -1 6 7 58 -1 6 58 57 -1 7 8 58 -1 8 9 60 -1 8 59 58 -1 8 60 59 -1 9 10 61 -1 9 61 60 -1 10 11 61 -1 11 12 63 -1 11 62 61 -1 11 63 62 -1 12 13 64 -1 12 64 63 -1 13 14 65 -1 13 65 64 -1 14 15 66 -1 14 66 65 -1 15 16 67 -1 15 67 66 -1 16 17 68 -1 16 68 67 -1 17 18 68 -1 18 19 70 -1 18 69 68 -1 18 70 69 -1 19 20 71 -1 19 71 70 -1 20 21 71 -1 21 22 73 -1 21 72 71 -1 21 73 72 -1 22 23 74 -1 22 74 73 -1 23 24 75 -1 23 75 74 -1 24 25 76 -1 24 48 25 -1 24 76 75 -1 25 26 77 -1 25 48 27 -1 25 77 76 -1 26 27 78 -1 26 78 77 -1 27 28 78 -1 27 48 28 -1 28 29 79 -1 28 48 29 -1 28 79 78 -1 29 30 80 -1 29 48 30 -1 29 80 79 -1 30 31 81 -1 30 48 31 -1 30 81 80 -1 31 32 82 -1 31 48 32 -1 31 82 81 -1 32 33 83 -1 32 48 33 -1 32 83 82 -1 33 34 84 -1 33 48 34 -1 33 84 83 -1 34 35 85 -1 34 48 35 -1 34 85 84 -1 35 36 86 -1 35 48 36 -1 35 86 85 -1 36 37 87 -1 36 48 37 -1 36 87 86 -1 37 38 88 -1 37 48 38 -1 37 88 87 -1 38 39 89 -1 38 48 39 -1 38 89 88 -1 39 40 90 -1 39 48 40 -1 39 90 89 -1 40 41 91 -1 40 48 41 -1 40 91 90 -1 41 42 92 -1 41 48 42 -1 41 92 91 -1 42 43 93 -1 42 48 43 -1 42 93 92 -1 43 44 94 -1 43 48 44 -1 43 94 93 -1 44 45 95 -1 44 48 45 -1 44 95 94 -1 45 47 96 -1 45 48 51 -1 45 51 47 -1 45 96 95 -1 46 47 50 -1 46 50 101 -1 46 97 47 -1 46 101 97 -1 47 51 50 -1 47 97 98 -1 47 98 96 -1 48 49 105 -1 48 105 165 -1 48 165 173 -1 48 173 229 -1 48 229 394 -1 48 394 51 -1 49 104 106 -1 49 106 105 -1 50 51 102 -1 50 102 101 -1 51 345 102 -1 51 394 397 -1 51 397 345 -1 52 53 110 -1 52 54 55 -1 52 55 53 -1 52 109 107 -1 52 110 109 -1 53 55 56 -1 53 56 57 -1 53 57 58 -1 53 58 60 -1 53 60 61 -1 53 61 62 -1 53 62 63 -1 53 63 64 -1 53 64 65 -1 53 65 66 -1 53 66 67 -1 53 67 68 -1 53 68 69 -1 53 69 70 -1 53 70 71 -1 53 71 72 -1 53 72 73 -1 53 73 74 -1 53 74 75 -1 53 75 76 -1 53 76 77 -1 53 77 78 -1 53 78 100 -1 53 100 120 -1 53 112 144 -1 53 116 112 -1 53 120 116 -1 53 144 176 -1 53 176 208 -1 53 208 296 -1 53 296 110 -1 78 79 100 -1 79 81 100 -1 81 82 100 -1 82 83 100 -1 83 84 100 -1 84 85 100 -1 85 86 100 -1 86 87 100 -1 87 88 100 -1 88 89 100 -1 89 90 100 -1 90 91 100 -1 91 92 100 -1 92 93 100 -1 93 94 100 -1 94 95 100 -1 95 96 99 -1 95 99 100 -1 96 98 99 -1 97 99 98 -1 97 101 99 -1 99 101 102 -1 99 102 345 -1 99 342 343 -1 99 343 100 -1 99 345 342 -1 100 124 120 -1 100 156 124 -1 100 188 156 -1 100 220 188 -1 100 343 220 -1 103 105 104 -1 103 108 159 -1 103 113 117 -1 103 117 105 -1 103 159 113 -1 104 105 106 -1 105 117 121 -1 105 121 125 -1 105 125 165 -1 107 109 110 -1 107 110 108 -1 108 110 288 -1 108 167 159 -1 108 223 167 -1 108 288 223 -1 110 290 288 -1 110 296 290 -1 111 112 116 -1 111 115 129 -1 111 116 115 -1 111 127 143 -1 111 129 127 -1 111 143 112 -1 112 143 144 -1 113 114 117 -1 113 145 146 -1 113 146 114 -1 113 159 145 -1 114 118 117 -1 114 128 130 -1 114 130 118 -1 114 146 128 -1 115 116 148 -1 115 147 129 -1 115 148 147 -1 116 120 152 -1 116 152 148 -1 117 118 149 -1 117 149 161 -1 117 161 121 -1 118 130 150 -1 118 150 149 -1 119 120 123 -1 119 123 131 -1 119 131 151 -1 119 151 120 -1 120 124 123 -1 120 151 152 -1 121 122 125 -1 121 153 154 -1 121 154 122 -1 121 161 163 -1 121 163 153 -1 122 126 125 -1 122 132 126 -1 122 154 132 -1 123 124 156 -1 123 133 131 -1 123 155 133 -1 123 156 155 -1 125 126 157 -1 125 157 165 -1 126 132 134 -1 126 134 158 -1 126 158 157 -1 127 129 137 -1 127 135 143 -1 127 137 135 -1 128 136 130 -1 128 146 136 -1 129 147 137 -1 130 136 138 -1 130 138 150 -1 131 133 139 -1 131 139 151 -1 132 140 134 -1 132 154 140 -1 133 141 139 -1 133 155 141 -1 134 140 142 -1 134 142 158 -1 135 137 143 -1 136 146 138 -1 137 147 143 -1 138 146 150 -1 139 141 155 -1 139 155 151 -1 140 154 158 -1 140 158 142 -1 143 147 144 -1 144 147 148 -1 144 148 180 -1 144 180 176 -1 145 149 150 -1 145 150 146 -1 145 159 161 -1 145 161 149 -1 148 152 184 -1 148 184 180 -1 151 155 152 -1 152 155 156 -1 152 156 184 -1 153 157 158 -1 153 158 154 -1 153 163 157 -1 156 188 184 -1 157 163 165 -1 159 160 162 -1 159 162 161 -1 159 167 168 -1 159 168 160 -1 160 168 170 -1 160 170 162 -1 161 162 170 -1 161 169 163 -1 161 170 169 -1 163 164 165 -1 163 169 171 -1 163 171 164 -1 164 166 165 -1 164 171 172 -1 164 172 174 -1 164 174 166 -1 165 166 173 -1 166 174 173 -1 167 169 170 -1 167 170 168 -1 167 177 169 -1 167 209 177 -1 167 223 209 -1 169 177 181 -1 169 181 225 -1 169 225 227 -1 169 227 171 -1 171 173 172 -1 171 185 189 -1 171 189 173 -1 171 227 185 -1 172 173 174 -1 173 189 229 -1 175 176 180 -1 175 179 193 -1 175 180 179 -1 175 191 207 -1 175 193 191 -1 175 207 176 -1 176 207 208 -1 177 178 181 -1 177 209 210 -1 177 210 178 -1 178 182 181 -1 178 192 194 -1 178 194 182 -1 178 210 192 -1 179 180 212 -1 179 211 193 -1 179 212 211 -1 180 184 216 -1 180 216 212 -1 181 182 213 -1 181 213 225 -1 182 194 214 -1 182 214 213 -1 183 184 187 -1 183 187 195 -1 183 195 215 -1 183 215 184 -1 184 188 187 -1 184 215 216 -1 185 186 189 -1 185 217 218 -1 185 218 186 -1 185 227 217 -1 186 190 189 -1 186 196 190 -1 186 218 196 -1 187 188 220 -1 187 197 195 -1 187 219 197 -1 187 220 219 -1 189 190 221 -1 189 221 229 -1 190 196 198 -1 190 198 222 -1 190 222 221 -1 191 193 201 -1 191 199 207 -1 191 201 199 -1 192 200 194 -1 192 210 200 -1 193 211 201 -1 194 200 202 -1 194 202 214 -1 195 197 203 -1 195 203 215 -1 196 204 198 -1 196 218 204 -1 197 205 203 -1 197 219 205 -1 198 204 206 -1 198 206 222 -1 199 201 207 -1 200 210 202 -1 201 211 207 -1 202 210 214 -1 203 205 219 -1 203 219 215 -1 204 218 222 -1 204 222 206 -1 207 211 208 -1 208 211 212 -1 208 212 244 -1 208 240 296 -1 208 244 240 -1 209 213 214 -1 209 214 210 -1 209 223 225 -1 209 225 213 -1 212 216 248 -1 212 248 244 -1 215 219 216 -1 216 219 220 -1 216 220 248 -1 217 221 222 -1 217 222 218 -1 217 227 221 -1 220 252 248 -1 220 343 252 -1 221 227 229 -1 223 224 225 -1 223 231 224 -1 223 288 231 -1 224 226 225 -1 224 231 232 -1 224 232 226 -1 225 226 233 -1 225 233 227 -1 226 232 234 -1 226 234 233 -1 227 228 229 -1 227 233 235 -1 227 235 236 -1 227 236 228 -1 228 230 229 -1 228 236 230 -1 229 230 237 -1 229 237 394 -1 230 236 238 -1 230 238 237 -1 231 233 234 -1 231 234 232 -1 231 241 233 -1 231 273 241 -1 231 288 291 -1 231 291 273 -1 233 241 245 -1 233 245 277 -1 233 277 281 -1 233 281 235 -1 235 237 236 -1 235 249 253 -1 235 253 237 -1 235 281 249 -1 236 237 238 -1 237 253 285 -1 237 285 293 -1 237 293 394 -1 239 240 244 -1 239 243 257 -1 239 244 243 -1 239 255 271 -1 239 257 255 -1 239 271 240 -1 240 271 272 -1 240 272 296 -1 241 242 245 -1 241 273 274 -1 241 274 242 -1 242 246 245 -1 242 256 258 -1 242 258 246 -1 242 274 256 -1 243 244 276 -1 243 275 257 -1 243 276 275 -1 244 248 280 -1 244 280 276 -1 245 246 277 -1 246 258 278 -1 246 278 277 -1 247 248 251 -1 247 251 259 -1 247 259 279 -1 247 279 248 -1 248 252 251 -1 248 279 280 -1 249 250 253 -1 249 281 282 -1 249 282 250 -1 250 254 253 -1 250 260 254 -1 250 282 260 -1 251 252 284 -1 251 261 259 -1 251 283 261 -1 251 284 283 -1 252 343 284 -1 253 254 285 -1 254 260 262 -1 254 262 286 -1 254 286 285 -1 255 257 265 -1 255 263 271 -1 255 265 263 -1 256 264 258 -1 256 274 264 -1 257 275 265 -1 258 264 266 -1 258 266 278 -1 259 261 267 -1 259 267 279 -1 260 268 262 -1 260 282 268 -1 261 269 267 -1 261 283 269 -1 262 268 270 -1 262 270 286 -1 263 265 271 -1 264 274 266 -1 265 275 271 -1 266 274 278 -1 267 269 283 -1 267 283 279 -1 268 282 286 -1 268 286 270 -1 271 275 272 -1 272 275 276 -1 272 276 296 -1 273 277 278 -1 273 278 274 -1 273 291 277 -1 276 280 296 -1 277 291 293 -1 277 293 281 -1 279 283 280 -1 280 283 284 -1 280 284 343 -1 280 343 296 -1 281 285 286 -1 281 286 282 -1 281 293 285 -1 287 288 290 -1 287 289 295 -1 287 290 289 -1 287 295 346 -1 287 346 288 -1 288 346 347 -1 288 347 291 -1 289 290 295 -1 290 296 295 -1 291 292 293 -1 291 347 292 -1 292 294 293 -1 292 347 395 -1 292 395 294 -1 293 294 395 -1 293 395 394 -1 295 296 298 -1 295 297 348 -1 295 298 297 -1 295 348 346 -1 296 299 298 -1 296 300 299 -1 296 301 300 -1 296 303 301 -1 296 304 303 -1 296 305 304 -1 296 306 305 -1 296 307 306 -1 296 308 307 -1 296 309 308 -1 296 310 309 -1 296 311 310 -1 296 312 311 -1 296 313 312 -1 296 314 313 -1 296 315 314 -1 296 316 315 -1 296 317 316 -1 296 318 317 -1 296 319 318 -1 296 320 319 -1 296 321 320 -1 296 343 321 -1 297 298 349 -1 297 349 348 -1 298 299 350 -1 298 350 349 -1 299 300 351 -1 299 351 350 -1 300 301 352 -1 300 352 351 -1 301 302 354 -1 301 353 352 -1 301 354 353 -1 302 303 354 -1 303 304 355 -1 303 355 354 -1 304 305 357 -1 304 356 355 -1 304 357 356 -1 305 306 357 -1 306 307 358 -1 306 358 357 -1 307 308 359 -1 307 359 358 -1 308 309 360 -1 308 360 359 -1 309 310 361 -1 309 361 360 -1 310 311 362 -1 310 362 361 -1 311 312 364 -1 311 363 362 -1 311 364 363 -1 312 313 364 -1 313 314 365 -1 313 365 364 -1 314 315 367 -1 314 366 365 -1 314 367 366 -1 315 316 367 -1 316 317 368 -1 316 368 367 -1 317 318 369 -1 317 369 368 -1 318 319 370 -1 318 370 369 -1 319 320 371 -1 319 371 370 -1 320 321 372 -1 320 372 371 -1 321 322 374 -1 321 343 322 -1 321 373 372 -1 321 374 373 -1 322 323 375 -1 322 343 324 -1 322 375 374 -1 323 324 376 -1 323 376 375 -1 324 325 377 -1 324 343 325 -1 324 377 376 -1 325 326 378 -1 325 343 326 -1 325 378 377 -1 326 327 379 -1 326 343 327 -1 326 379 378 -1 327 328 380 -1 327 343 328 -1 327 380 379 -1 328 329 381 -1 328 343 329 -1 328 381 380 -1 329 330 382 -1 329 343 330 -1 329 382 381 -1 330 331 383 -1 330 343 331 -1 330 383 382 -1 331 332 384 -1 331 343 332 -1 331 384 383 -1 332 333 385 -1 332 343 333 -1 332 385 384 -1 333 334 386 -1 333 343 334 -1 333 386 385 -1 334 335 387 -1 334 343 335 -1 334 387 386 -1 335 336 388 -1 335 343 336 -1 335 388 387 -1 336 337 389 -1 336 343 337 -1 336 389 388 -1 337 338 390 -1 337 343 338 -1 337 390 389 -1 338 339 391 -1 338 342 339 -1 338 343 342 -1 338 391 390 -1 339 341 393 -1 339 342 341 -1 339 393 391 -1 340 341 342 -1 340 342 344 -1 340 344 392 -1 340 392 393 -1 340 393 341 -1 342 345 344 -1 344 345 396 -1 344 396 392 -1 345 397 396 -1 346 348 349 -1 346 349 347 -1 347 349 350 -1 347 350 351 -1 347 351 352 -1 347 352 353 -1 347 353 354 -1 347 354 355 -1 347 355 356 -1 347 356 357 -1 347 357 358 -1 347 358 359 -1 347 359 360 -1 347 360 361 -1 347 361 362 -1 347 362 363 -1 347 363 364 -1 347 364 365 -1 347 365 367 -1 347 367 368 -1 347 368 369 -1 347 369 370 -1 347 370 394 -1 347 394 395 -1 370 371 394 -1 371 373 394 -1 373 374 394 -1 374 375 394 -1 375 376 394 -1 376 377 394 -1 377 378 394 -1 378 379 394 -1 379 380 394 -1 380 381 394 -1 381 382 394 -1 382 383 394 -1 383 384 394 -1 384 385 394 -1 385 386 394 -1 386 387 394 -1 387 388 394 -1 388 389 394 -1 389 390 394 -1 390 391 394 -1 391 393 397 -1 391 397 394 -1 392 396 393 -1 393 396 397 -1 ]
	}
}
