(module taoglas-cggp.18.2.a.02 (layer F.Cu) (tedit 5C3E2B11)
  (descr https://cdn.taoglas.com/datasheets/CGGP.18.2.A.02.pdf)
  (tags "GPS Dual-Band Patch Antenna")
  (fp_text reference REF** (at 0.4 -1.6) (layer F.SilkS)
    (effects (font (size 1 1) (thickness 0.15)))
  )
  (fp_text value taoglas-cggp.18.2.a.02 (at 0.2 -5.2) (layer F.Fab)
    (effects (font (size 1 1) (thickness 0.15)))
  )
  (fp_line (start 9 7.2) (end -9 7.2) (layer F.SilkS) (width 0.12))
  (fp_line (start 9 -8.8) (end 9 7.2) (layer F.SilkS) (width 0.12))
  (fp_line (start 7 -10.8) (end 9 -8.8) (layer F.SilkS) (width 0.12))
  (fp_line (start -9 -10.8) (end 7 -10.8) (layer F.SilkS) (width 0.12))
  (fp_line (start -9 7.2) (end -9 -10.8) (layer F.SilkS) (width 0.12))
  (fp_text user %R (at 0.4 -1.6) (layer F.Fab)
    (effects (font (size 1 1) (thickness 0.15)))
  )
  (fp_line (start -9.2 7.4) (end -9.2 -11) (layer F.CrtYd) (width 0.05))
  (fp_line (start -9.2 -11) (end 9.2 -11) (layer F.CrtYd) (width 0.05))
  (fp_line (start 9.2 -11) (end 9.2 7.4) (layer F.CrtYd) (width 0.05))
  (fp_line (start 9.2 7.4) (end -9.2 7.4) (layer F.CrtYd) (width 0.05))
  (fp_line (start -9 -10.8) (end 7 -10.8) (layer F.Fab) (width 0.1))
  (fp_line (start 7 -10.8) (end 9 -8.8) (layer F.Fab) (width 0.1))
  (fp_line (start 9 -8.8) (end 9 7.2) (layer F.Fab) (width 0.1))
  (fp_line (start 9 7.2) (end -9 7.2) (layer F.Fab) (width 0.1))
  (fp_line (start -9 7.2) (end -9 -10.8) (layer F.Fab) (width 0.1))
  (pad 1 thru_hole circle (at 0 0) (size 2.5 2.5) (drill 1.2) (layers *.Cu *.Mask)
    (clearance 3.5))
  (model ${LSF_KICAD_LIB}/lsf-kicad-lib.3dshapes/taoglas-cggp.18.2.a.02.wrl
    (at (xyz 0 0 0))
    (scale (xyz 1 1 1))
    (rotate (xyz 0 0 0))
  )
)
