(module hrs-df11c-10dp-2v (layer F.Cu) (tedit 5C3F99B9)
  (descr https://www.hirose.com/product/en/download_file/key_name/DF11C-10DP-2V%2857%29/category/Catalog/doc_file_id/31688/?file_category_id=5&item_id=05430685057&is_series=)
  (tags Header)
  (attr smd)
  (fp_text reference REF** (at 0.5 0) (layer F.SilkS)
    (effects (font (size 1 1) (thickness 0.15)))
  )
  (fp_text value hrs-df11c-10dp-2v (at 0 6) (layer F.Fab)
    (effects (font (size 1 1) (thickness 0.15)))
  )
  (fp_line (start -7.5 1.5) (end -7.5 3.5) (layer F.SilkS) (width 0.12))
  (fp_line (start -7.5 3.5) (end -5 3.5) (layer F.SilkS) (width 0.12))
  (fp_line (start -5 -3.5) (end -7.5 -3.5) (layer F.SilkS) (width 0.12))
  (fp_line (start -7.5 -3.5) (end -7.5 -1.5) (layer F.SilkS) (width 0.12))
  (fp_line (start 7.5 -1.5) (end 7.5 -3.5) (layer F.SilkS) (width 0.12))
  (fp_line (start 7.5 -3.5) (end 5 -3.5) (layer F.SilkS) (width 0.12))
  (fp_line (start 5 4) (end 8 4) (layer F.SilkS) (width 0.12))
  (fp_line (start 8 4) (end 8 2) (layer F.SilkS) (width 0.12))
  (fp_line (start 5.5 3.5) (end 5.5 -3.5) (layer F.SilkS) (width 0.12))
  (fp_line (start -5.5 -3.5) (end -5.5 3.5) (layer F.SilkS) (width 0.12))
  (fp_line (start 5.5 -1.5) (end 5 -1.5) (layer F.SilkS) (width 0.12))
  (fp_line (start 5 -1.5) (end 5 0) (layer F.SilkS) (width 0.12))
  (fp_line (start 5 0) (end 5.5 0) (layer F.SilkS) (width 0.12))
  (fp_line (start -5.5 -1.5) (end -5 -1.5) (layer F.SilkS) (width 0.12))
  (fp_line (start -5 -1.5) (end -5 0) (layer F.SilkS) (width 0.12))
  (fp_line (start -5 0) (end -5.5 0) (layer F.SilkS) (width 0.12))
  (fp_line (start 5 3.5) (end -7.5 3.5) (layer F.Fab) (width 0.1))
  (fp_line (start -7.5 3.5) (end -7.5 -3.5) (layer F.Fab) (width 0.1))
  (fp_line (start -7.5 -3.5) (end 7.5 -3.5) (layer F.Fab) (width 0.1))
  (fp_line (start 7.5 -3.5) (end 7.5 2) (layer F.Fab) (width 0.1))
  (fp_text user %R (at 0.5 0) (layer F.Fab)
    (effects (font (size 1 1) (thickness 0.15)))
  )
  (fp_line (start -9.4 -5.2) (end -9.4 5.2) (layer F.CrtYd) (width 0.05))
  (fp_line (start -9.4 -5.2) (end 9.4 -5.2) (layer F.CrtYd) (width 0.05))
  (fp_line (start 9.4 -5.2) (end 9.4 5.2) (layer F.CrtYd) (width 0.05))
  (fp_line (start 9.4 5.2) (end -9.4 5.2) (layer F.CrtYd) (width 0.05))
  (pad "" smd rect (at 8.35 0) (size 2 2.8) (layers F.Cu F.Paste F.Mask))
  (pad "" smd rect (at -8.35 0) (size 2 2.8) (layers F.Cu F.Paste F.Mask))
  (pad 6 smd rect (at 0 -4.15) (size 1.1 2) (layers F.Cu F.Paste F.Mask))
  (pad 4 smd rect (at 2 -4.15) (size 1.1 2) (layers F.Cu F.Paste F.Mask))
  (pad 2 smd rect (at 4 -4.15) (size 1.1 2) (layers F.Cu F.Paste F.Mask))
  (pad 1 smd rect (at 4 4.15) (size 1.1 2) (layers F.Cu F.Paste F.Mask))
  (pad 3 smd rect (at 2 4.15) (size 1.1 2) (layers F.Cu F.Paste F.Mask))
  (pad 5 smd rect (at 0 4.15) (size 1.1 2) (layers F.Cu F.Paste F.Mask))
  (pad 7 smd rect (at -2 4.15) (size 1.1 2) (layers F.Cu F.Paste F.Mask))
  (pad 9 smd rect (at -4 4.15) (size 1.1 2) (layers F.Cu F.Paste F.Mask))
  (pad 8 smd rect (at -2 -4.15) (size 1.1 2) (layers F.Cu F.Paste F.Mask))
  (pad 10 smd rect (at -4 -4.15) (size 1.1 2) (layers F.Cu F.Paste F.Mask))
  (model ${LSF_KICAD_LIB}/lsf-kicad-lib.3dshapes/hrs-df11c-10dp-2v.wrl
    (at (xyz 0 0 0))
    (scale (xyz 1 1 1))
    (rotate (xyz 0 0 0))
  )
)
