%YAML 1.1
%TAG !u! tag:unity3d.com,2011:
--- !u!1045 &1
EditorBuildSettings:
  m_ObjectHideFlags: 0
  serializedVersion: 2
  m_Scenes:
  - enabled: 1
    path: Assets/Levels/_MainMenu.unity
    guid: ad18524ff637624469184e44c0c0313b
  - enabled: 1
    path: Assets/Levels/Level1.unity
    guid: ffe7ad6030b4fb545af4f74f07d1e877
  - enabled: 1
    path: Assets/Levels/Level2.unity
    guid: 8c53d7b50d951f64ba5f4eb2ce68c48d
  m_configObjects: {}
