nom;periode;masse_atomique;decroissance_radioactive;activite_specifique;limite_qualite_eau;numero_atomique;nombre_de_masses
H-3 aéro;388838880;2.79556108246255e-15;1.78260769746057e-09;3.57709944623754e+17;0;1;3
HTO;388838880;2.79556108246255e-15;1.78260769746057e-09;3.57709944623754e+17;0;1;3
Be-10;50457600000000;1.20921809460397e-09;1.37372205685555e-14;826980678227.04;0;4;10
C-11;1222.2;3.22190708782714e-20;0.00056713073192599;3.10375182381315e+22;0;6;11
C-14aéro;180686830000;6.06223240918482e-12;3.83617987298767e-12;164955734538470;0;6;14
C-14 CO2;180686830000;6.06223240918482e-12;3.83617987298767e-12;164955734538470;0;6;14
C-15;2.449;8.80355520382991e-23;0.283032740122477;1.13590473035821e+25;0;6;15
N-13;598.02;1.86310404461486e-20;0.00115907023270116;5.36738676989305e+22;0;7;13
N-16;7.13;2.73393106751849e-22;0.0972155933464159;3.6577366996589e+24;0;7;16
N-17;4.17;1.69888125329931e-22;0.16622234545802;5.88622658621931e+24;0;7;17
N-18;0.622;2.68312519564665e-23;1.11438453466229;3.72699716592611e+25;0;7;18
O-15;122.46;4.40213707742348e-21;0.00566019255724274;2.27162394630675e+23;0;8;15
O-19;26.91;1.22530821836564e-21;0.025757977724264;8.16121188947734e+23;0;8;19
Na-22;82078747.2;4.32744391038541e-15;8.44490448752787e-09;2.31083295522353e+17;0;11;22
Na-24;53846.604;3.09704565685761e-18;1.2872625738105e-05;3.22888362264133e+20;0;11;24
Mg-28+;75240;5.04876162216212e-18;9.21248246358247e-06;1.98068372967023e+20;0;12;28
Al-26;22610996640000;1.40887058268141e-09;3.06553130583255e-14;709788402350.459;0;13;26
Al-28;134.46;9.02254768362465e-21;0.00515504373464187;1.108334402948e+23;0;13;28
Si-31;9432;7.00718419261804e-19;7.34888868278144e-05;1.42710677001111e+21;0;14;31
P-32;1232928;9.45509162191707e-17;5.62195992434226e-07;1.05763121076689e+19;0;15;32
P-33;2193090.336;1.73439698031507e-16;3.16059566348819e-07;5.76569269521179e+18;0;15;33
S-35;7544448;6.3281033231655e-16;9.18751352729776e-08;1.58025232669521e+18;0;16;35
S-37;299.4;2.65479852557471e-20;0.00231512084355359;3.7667641832953e+22;0;16;37
Cl-34;1.526;1.24340181896151e-22;0.454224888964578;8.04245244578458e+24;0;17;34
Cl-34m+;1926;1.56932628002613e-19;0.000359889501848362;6.3721611797857e+21;0;17;34
Cl-36;9492336000000;8.18942954570538e-10;7.30217704640823e-14;1221086272760.49;0;17;36
Cl-38;2232;2.03261831541592e-19;0.000310549812078829;4.9197628124067e+21;0;17;38
Cl-38m;0.715;6.51129971112178e-23;0.969436616167756;1.53579169192892e+25;0;17;38
Cl-39;3336;3.11794677076109e-19;0.000207777931822526;3.20723884505539e+21;0;17;39
Cl-40;81;7.76467098418645e-21;0.0085573725995055;1.28788457622558e+23;0;17;40
Ar-37;3027456;2.68446417002081e-16;2.28953676142591e-07;3.72513819021189e+18;0;18;37
Ar-39;8483360916.96;7.92885724707323e-13;8.17066711348093e-11;1.26121579546552e+15;0;18;39
Ar-41;6576.012;6.46136837126709e-19;0.000105405400805221;1.54765978743276e+21;0;18;41
K-40;3.989304e+16;3.82415222418505e-06;1.73751406400702e-17;261495866.633056;0;19;40
K-42;44492.4;4.47829987236615e-18;1.55790018196354e-05;2.2329902608144e+20;0;19;42
Ca-41;3248208000000;3.19158000844535e-10;2.13393717569794e-13;3133244340902.83;0;20;41
Ca-45;14083200;1.51876964450687e-15;4.92180172517571e-08;6.58427697456839e+17;0;20;45
Sc-46;7239279.744;7.98052088652374e-16;9.57480861455083e-08;1.253051040426e+18;0;21;46
V-49;28512000;3.3481261283812e-15;2.43107176122315e-08;2.98674530664559e+17;0;23;49
Cr-51;2393540.064;2.92542470773413e-16;2.89590799412642e-07;3.41830708326295e+18;0;24;51
Mn-52;483408;6.02414233637121e-17;1.43387610581526e-06;1.65998733788613e+19;0;25;52
Mn-54;26968000.032;3.48996078916683e-15;2.57025800851922e-08;2.86536170579365e+17;0;25;54
Fe-52+;29790;3.71237547166159e-18;2.32677804820391e-05;2.69369304811299e+20;0;26;52
Fe-55;86250960;1.13685394925501e-14;8.03639960134873e-09;8.79620465456715e+16;0;26;55
Fe-59;3844369.728;5.43569660089412e-16;1.80301903719481e-07;1.83969061083268e+18;0;26;59
Co-57;23483500.128;3.20786239719388e-15;2.95163487888029e-08;3.11734069664199e+17;0;27;57
Co-58;6122299.68;8.50982492451796e-16;1.13216800351064e-07;1.17511230709208e+18;0;27;58
Co-60;166226571.36;2.39017525081443e-14;4.16989398800017e-09;4.18379363462684e+16;0;27;60
Ni-59;2396789611200;3.38890951298693e-10;2.89198174641998e-13;2950801714143.78;0;28;59
Ni-63;3172524753.6;4.7898687862844e-13;2.18484404187359e-10;2.08773986223477e+15;0;28;63
Cu-64;45723.6;7.01291279432193e-18;1.51595058254369e-05;1.42594101670516e+20;0;29;64
Zn-65;21094599.744;3.28596318706548e-15;3.28589870854079e-08;3.04324772698701e+17;0;30;65
Ga-67;281767.68;4.52422324243502e-17;2.45999534282976e-06;2.21032417370674e+19;0;31;67
Se-75;10336900.32;1.85793124956323e-15;6.70556123307906e-08;5.38233048308479e+17;0;34;75
Se-79;11889072000000;2.25088390697438e-09;5.83012013519596e-14;444269914099.743;0;34;79
Se-83;1338;2.66141287493161e-19;0.000518047220149436;3.75740272927663e+21;0;34;83
Br-82;127152.288;2.49871129194242e-17;5.45131504483777e-06;4.00206299633212e+19;0;35;82
Br-83;8640;1.7185805111666e-18;8.0225368120364e-05;5.81875561547701e+20;0;35;83
Br-84;1908;3.8409239135109e-19;0.000363284685828064;2.60354024843446e+21;0;35;84
Br-84m;360;7.24702625190735e-20;0.00192540883488874;1.37987633167026e+22;0;35;84
Br-85;174;3.5444285140777e-20;0.0039836044859767;2.82132929477408e+22;0;35;85
Kr-83m;6588;1.31041763976453e-18;0.000105213597534904;7.63115490554361e+20;0;36;83
Kr-85;339075072;6.90705375637787e-14;2.04422925127314e-09;1.44779530501933e+16;0;36;85
Kr-85m;16128;3.28531856753133e-18;4.29778757787664e-05;3.04384484927263e+20;0;36;85
Kr-87;4578.012;9.5449625121117e-19;0.000151407899446298;1.04767305134105e+21;0;36;87
Kr-88;10224;2.15616285818653e-18;6.77960857355189e-05;4.63786859236163e+20;0;36;88
Kr-89;189;4.03115835262346e-20;0.00366744539978807;2.48067655131732e+22;0;36;89
Kr-90;32.32;6.9709490613585e-21;0.021446385537127;1.43452489926116e+23;0;36;90
Kr-91;8.57;1.86896109890046e-21;0.0808806511738559;5.35056615457816e+23;0;36;91
Kr-92;1.84;4.0568009388984e-22;0.376710424217362;2.46499647150926e+24;0;36;92
Rb-86;1610500.32;3.31922975002013e-16;4.30392451309755e-07;3.01274715916829e+18;0;37;86
Rb-88;1068;2.25232974622771e-19;0.000649014214007439;4.43984723673271e+21;0;37;88
Rb-89;924;1.97078852794925e-19;0.000750159286320287;5.07411112769453e+21;0;37;89
Sr-85;5602950.144;1.14133656628445e-15;1.23711109816355e-07;8.76165742464066e+17;0;38;85
Sr-89;4369249.728;9.31912038927249e-16;1.58642152248237e-07;1.07306264779145e+18;0;38;89
Sr-90;907921440;1.95825312808022e-13;7.63444005199332e-10;5.10659212366664e+15;0;38;90
Sr-90+;907921440;1.95825312808022e-13;7.63444005199332e-10;5.10659212366664e+15;0;38;90
Sr-91+;34668;7.56046013730235e-18;1.99938612137979e-05;1.32267081875894e+20;0;38;91
Sr-92;9756;2.15098641086374e-18;7.10482964903593e-05;4.64902983556481e+20;0;38;92
Y-90;230759.712;4.97714788912673e-17;3.00376168158827e-06;2.0091828136846e+19;0;39;90
Y-91;5055259.68;1.10246017348425e-15;1.37114060292931e-07;9.07062245014777e+17;0;39;91
Y-91m;2982.6;6.50450802051401e-19;0.000232396962569552;1.53739529084473e+21;0;39;91
Y-92;12744;2.80977560681094e-18;5.43900800816027e-05;3.55900306620922e+20;0;39;92
Y-93;36648;8.16791623063187e-18;1.89136427788678e-05;1.22430246805144e+20;0;39;93
Y-94;1122;2.5275441955561e-19;0.000617778235793178;3.9564095526329e+21;0;39;94
Y-95;618;1.40698714037527e-19;0.00112159737954684;7.10738549986522e+21;0;39;95
Zr-93;48250080000000;1.07537276675749e-08;1.43657208560057e-14;92991010272.2092;0;40;93
Zr-95+;5533004.16;1.25968700659593e-15;1.25275015256801e-07;7.93847991416783e+17;0;40;95
Zr-97+;60278.4;1.40123668256046e-17;1.14990971983322e-05;7.13655310659377e+19;0;40;97
Nb-93m;508558681.44;1.13344922188455e-13;1.36296401154195e-09;8.82262725750808e+15;0;41;93
Nb-94;630300571200;1.41988640837099e-10;1.09970895193748e-12;7042816904961.29;0;41;94
Nb-95;3023219.808;6.88289869317764e-16;2.29274490305253e-07;1.45287624382908e+18;0;41;95
Nb-96;84060;1.9339207197947e-17;8.2458622479175e-06;5.1708427846316e+19;0;41;96
Nb-97;4326.012;1.00562833512448e-18;0.000160227752618334;9.94403165734404e+20;0;41;97
Nb-97m;52.7;1.22506856802663e-20;0.0131526979233386;8.16280840190706e+22;0;41;97
Nb-98;3078;7.22890868627758e-19;0.00022519401577646;1.38333466834111e+21;0;41;98
Mo-93;126144000000;2.81143206995423e-11;5.49488822742219e-12;35569061429120;0;42;93
Mo-99;237384;5.6320264516698e-17;2.91994060492681e-06;1.77555984259186e+19;0;42;99
Mo-99+;237600;5.63715113451936e-17;2.91728611346778e-06;1.77394569728041e+19;0;42;99
Mo-101;876.6;2.12178262055099e-19;0.000790722314122685;4.71301814952333e+21;0;42;101
Tc-99;6748704000000;1.60115590951748e-09;1.0270819116677e-13;624548798812.076;0;43;99
Tc-99m;21636;5.13322398764566e-18;3.20367526603783e-05;1.94809344460078e+20;0;43;99
Tc-101;852;2.06223909731856e-19;0.000813553028826227;4.84909825102365e+21;0;43;101
Tc-104;1098;2.73661515131549e-19;0.000631281585209422;3.65414917592377e+21;0;43;104
Ru-103+;3392059.68;8.37295499850078e-16;2.04344040479838e-07;1.19432147930934e+18;0;44;103
Ru-105;15984;4.02209956980858e-18;4.33650638488454e-05;2.48626366066714e+20;0;44;105
Ru-106+;32171135.04;8.17241282406907e-15;2.15456240414931e-08;1.22362883707348e+17;0;44;106
Rh-102;91523148.48;2.23722246324606e-14;7.57346302079429e-09;4.46982817501781e+16;0;45;102
Rh-102m;17971200;4.39294025601332e-15;3.85698885194058e-08;2.27637969496885e+17;0;45;102
Rh-105;127295.712;3.2031783563168e-17;5.44517305154745e-06;3.12189921622054e+19;0;45;105
Pd-103+;1467070.272;3.62131404689622e-16;4.7247033341832e-07;2.76142855065853e+18;0;46;103
Pd-107;204984000000000;5.25631990498163e-08;3.38146967841366e-15;19024717256.1217;0;46;107
Ag-108m+;13182321101.76;3.41187953876882e-12;5.25815730939373e-11;293093583356947;0;47;108
Ag-110m+;21580999.776;5.68908330393474e-15;3.21183998774138e-08;1.75775242965483e+17;0;47;110
Ag-111;643680;1.7122652454328e-16;1.07685057879683e-06;5.84021665257381e+18;0;47;111
Ag-112;11268;3.02442562246267e-18;6.1514659261621e-05;3.30641293531213e+20;0;47;112
Cd-109+;39942236.16;1.04336657762047e-14;1.73537399804895e-08;9.58435914518778e+16;0;48;109
Cd-113m;444667060.8;1.20418011414119e-13;1.55880037372884e-09;8.30440553083861e+15;0;48;113
Cd-115+;192456;5.30404674929776e-17;3.60158779440467e-06;1.88535291498401e+19;0;48;115
Cd-115m;3853440;1.06199993274379e-15;1.79877506996332e-07;9.41619645319929e+17;0;48;115
In-111;242326.08;6.44616152196693e-17;2.86039034906992e-06;1.55131080192801e+19;0;49;111
Sn-113+;9943780.32;2.69282426703475e-15;6.97066063663749e-08;3.71357318872192e+17;0;50;113
Sn-119m;25315200;7.2194875521501e-15;2.73806717134348e-08;1.38513986315023e+17;0;50;119
Sn-121m+;1734519104.64;5.02970490667021e-13;3.99619225124539e-10;1.98818821095018e+15;0;50;121
Sn-125;832896;2.49504760958525e-16;8.3221336224444e-07;4.00793955256922e+18;0;50;125
Sn-126+;7253280000000;2.19019627385144e-09;9.5563273520386e-14;456580084597.4;0;50;126
Sn-127;7560;2.30093083498058e-18;9.16861349947018e-05;4.34606718636303e+20;0;50;127
Sb-124;5201280;1.5456457590068e-15;1.3326473109695e-07;6.46978775164226e+17;0;51;124
Sb-125+;86993948.16;2.60601614613338e-14;7.96776322055303e-09;3.83727476701834e+16;0;51;125
Sb-127+;332640;1.01240956739146e-16;2.08377579533413e-06;9.87742542355234e+18;0;51;127
Sb-128;32436;9.94982194738061e-18;2.13696874016508e-05;1.00504311060889e+20;0;51;128
Sb-128m;624;1.91413518780537e-19;0.00111081278935889;5.22429139995351e+21;0;51;128
Sb-130;2370;7.38362694514767e-19;0.000292467164793226;1.35434794773478e+21;0;51;130
Sb-131;1381.8;4.33804978376326e-19;0.00050162627048773;2.30518331934056e+21;0;51;131
Te-125m;4959360;1.48564038164101e-15;1.39765449687045e-07;6.7311040569281e+17;0;52;125
Te-127;33660;1.02446206224136e-17;2.05926078597726e-05;9.76122041856937e+19;0;52;127
Te-127m+;9417600;2.86630241157581e-15;7.36012551562973e-08;3.48881540189693e+17;0;52;127
Te-129;4176;1.29100596230407e-18;0.000165983520249029;7.74589761162136e+20;0;52;129
Te-129m+;2903040;8.97471731036207e-16;2.38765976548703e-07;1.11424122389394e+18;0;52;129
Te-131;1500;4.70912916170567e-19;0.000462098120373297;2.12353487377652e+21;0;52;131
Te-131m+;108000;3.39057299642808e-17;6.41802944962912e-06;2.94935399135628e+19;0;52;131
Te-132+;276825.6;8.75705805333335e-17;2.50391286268302e-06;1.14193601767817e+19;0;52;132
Te-133;747;2.38095008317873e-19;0.000927907872235536;4.20000405327664e+21;0;52;133
Te-133m+;3324;1.0594749767719e-18;0.00020852803265943;9.43863726774262e+20;0;52;133
Te-134;2508;8.0539768734491e-19;0.000276374473907474;1.2416226365097e+21;0;52;134
I-123aéro;47604.204;1.40322872615628e-17;1.45606295729668e-05;7.12642195359839e+19;0;53;123
I-123élévap;47604.204;1.40322872615628e-17;1.45606295729668e-05;7.12642195359839e+19;0;53;123
I-123org;47604.204;1.40322872615628e-17;1.45606295729668e-05;7.12642195359839e+19;0;53;123
I-125aéro;5132759.616;1.53758447759102e-15;1.35043764449682e-07;6.5037076958967e+17;0;53;125
I-125élévap;5132759.616;1.53758447759102e-15;1.35043764449682e-07;6.5037076958967e+17;0;53;125
I-125org;5132759.616;1.53758447759102e-15;1.35043764449682e-07;6.5037076958967e+17;0;53;125
I-129aéro;507729600000000;1.56964066292687e-07;1.3651896217198e-15;6370884901.35907;0;53;129
I-129élévap;507729600000000;1.56964066292687e-07;1.3651896217198e-15;6370884901.35907;0;53;129
I-129org;507729600000000;1.56964066292687e-07;1.3651896217198e-15;6370884901.35907;0;53;129
I-130aéro;44496;1.38625259304342e-17;1.5577741382595e-05;7.21369254794013e+19;0;53;130
I-130élévap;44496;1.38625259304342e-17;1.5577741382595e-05;7.21369254794013e+19;0;53;130
I-130org;44496;1.38625259304342e-17;1.5577741382595e-05;7.21369254794013e+19;0;53;130
I-131aéro;693213.12;2.17628674577931e-16;9.99904878545786e-07;4.59498272430964e+18;0;53;131
I-131élévap;693213.12;2.17628674577931e-16;9.99904878545786e-07;4.59498272430964e+18;0;53;131
I-131org;693213.12;2.17628674577931e-16;9.99904878545786e-07;4.59498272430964e+18;0;53;131
I-132aéro;8262;2.61358825327716e-18;8.38958097990735e-05;3.82615738629108e+20;0;53;132
I-132élévap;8262;2.61358825327716e-18;8.38958097990735e-05;3.82615738629108e+20;0;53;132
I-132org;8262;2.61358825327716e-18;8.38958097990735e-05;3.82615738629108e+20;0;53;132
I-132maéro;4979.988;1.57536167250801e-18;0.000139186516224526;6.34774869448217e+20;0;53;132
I-132mélévap;4979.988;1.57536167250801e-18;0.000139186516224526;6.34774869448217e+20;0;53;132
I-132morg;4979.988;1.57536167250801e-18;0.000139186516224526;6.34774869448217e+20;0;53;132
I-133aéro;74880;2.38668731229482e-17;9.25677324465739e-06;4.18990788968703e+19;0;53;133
I-133élévap;74880;2.38668731229482e-17;9.25677324465739e-06;4.18990788968703e+19;0;53;133
I-133org;74880;2.38668731229482e-17;9.25677324465739e-06;4.18990788968703e+19;0;53;133
I-134aéro;3150;1.0115640809954e-18;0.000220046723987284;9.88568118211531e+20;0;53;134
I-134élévap;3150;1.0115640809954e-18;0.000220046723987284;9.88568118211531e+20;0;53;134
I-134org;3150;1.0115640809954e-18;0.000220046723987284;9.88568118211531e+20;0;53;134
I-134m;216;6.93643941253989e-20;0.00320901472481456;1.44166183905848e+22;0;53;134
I-135aéro+;23652;7.65208325491575e-18;2.93060705462517e-05;1.30683366435878e+20;0;53;135
I-135élévap+;23652;7.65208325491575e-18;2.93060705462517e-05;1.30683366435878e+20;0;53;135
I-135org+;23652;7.65208325491575e-18;2.93060705462517e-05;1.30683366435878e+20;0;53;135
Xe-131m;1030741.632;3.2359303182902e-16;6.72474225393416e-07;3.09030140218959e+18;0;54;131
Xe-133;453081.6;1.44412941527008e-16;1.5298506506553e-06;6.92458715559768e+18;0;54;133
Xe-133m;189043.2;6.02546750688585e-17;3.66660731811536e-06;1.65962225977853e+19;0;54;133
Xe-135;32904;1.06453639193196e-17;2.10657421760256e-05;9.39376058516103e+19;0;54;135
Xe-135m;917.4;2.96804548370527e-19;0.000755556115718275;3.36922060490668e+21;0;54;135
Xe-137;229.08;7.5211766537305e-20;0.00302578653989849;1.3295791949043e+22;0;54;137
Xe-138;844.8;2.79390116835438e-19;0.000820486719412814;3.57922467453996e+21;0;54;138
Xe-139;39.68;1.32179623786111e-20;0.0174684269294341;7.56546259821535e+22;0;54;139
Xe-140;13.6;4.56294245490463e-21;0.0509667044529372;2.1915682914763e+23;0;54;140
Xe-141;1.73;5.84579071966852e-22;0.400663110150257;1.71063256957769e+24;0;54;141
Cs-134;65124993.6;2.09136839050208e-14;1.06433358722041e-08;4.78155835452753e+16;0;55;134
Cs-135;72532800000000;2.34663886484083e-08;9.5563273520386e-15;42614141229.0906;0;55;135
Cs-136;1125790.272;3.66922587673388e-16;6.15698321258851e-07;2.72537051027815e+18;0;55;136
Cs-137+;947361307.68;3.11038578224656e-13;7.31660850977119e-10;3.21503527217683e+15;0;55;137
Cs-138;2004.6;6.62956236042044e-19;0.000345778300189537;1.50839519358044e+21;0;55;138
Cs-139;556.2;1.85277990800996e-19;0.0012462193106076;5.39729514378254e+21;0;55;139
Ba-133;332389440;1.05944131836109e-13;2.0853465758718e-09;9.43893713289341e+15;0;56;133
Ba-139;4983.588;1.66010278967989e-18;0.000139085971906174;6.02372338759113e+20;0;56;139
Ba-140;1102900.32;3.7003460982764e-16;6.28476724496685e-07;2.70244991533574e+18;0;56;140
Ba-140+;1102900.32;3.7003460982764e-16;6.28476724496685e-07;2.70244991533574e+18;0;56;140
Ba-141;1096.2;3.70413629300615e-19;0.000632318172377254;2.69968467922771e+21;0;56;141
Ba-142;636;2.16433014174027e-19;0.00108985405748419;4.62036720144706e+21;0;56;142
La-137;1892204150400;6.21250291604698e-10;3.66317334423676e-13;1609657192139.07;0;57;137
La-140;145025.856;4.86576937795063e-17;4.7794731207099e-06;2.05517344190526e+19;0;57;140
La-141;14112;4.76854327375504e-18;4.91175723185902e-05;2.09707649190009e+20;0;57;141
La-142;5465.988;1.86009474572179e-18;0.000126810959072714;5.37607023674463e+20;0;57;142
La-143;848.4;2.90746667100827e-19;0.000817005163319125;3.4394203378889e+21;0;57;143
Ce-141;2808000;9.48842794267584e-16;2.46847286524197e-07;1.05391536516005e+18;0;58;141
Ce-143;118939.968;4.07607252252229e-17;5.82770612953204e-06;2.45334202096384e+19;0;58;143
Ce-144+;24624000;8.49765592509365e-15;2.81492519720576e-08;1.17679511716518e+17;0;58;144
Pr-143;1171579.68;4.01500338523166e-16;5.91634689806113e-07;2.49065792491804e+18;0;59;143
Pr-144;1036.8;3.57796038951312e-19;0.000668544734336367;2.79488840326731e+21;0;59;144
Pr-145;21024;7.30569265489898e-18;3.29693293645332e-05;1.36879560534131e+20;0;59;145
Nd-147;948672;3.34203862632959e-16;7.30649982881275e-07;2.99218564418046e+18;0;60;147
Nd-149;6220.8;2.22131707515606e-18;0.000111424122389394;4.50183366969231e+20;0;60;149
Nd-151;746.4;2.70101269695096e-19;0.000928653778885243;3.70231506548951e+21;0;60;151
Pm-145;558199499.04;1.93970413817771e-13;1.24175528955513e-09;5.15542540904959e+15;0;61;145
Pm-147;82731542.4;2.9145164009966e-14;8.37826976812106e-09;3.4311009526591e+16;0;61;147
Sm-145;29376000;1.02079541205438e-14;2.35956965059894e-08;9.79628227352113e+16;0;62;145
Sm-146;3.153663072e+15;1.10343357955635e-06;2.19791133274222e-16;906262070.075903;0;62;146
Sm-151;2838807648;1.02728503502807e-12;2.44168420867924e-10;973439664652253;0;62;151
Sm-153;166622.4;6.10946054114546e-17;4.15998797616614e-06;1.63680572656995e+19;0;62;153
Eu-150;1146629092.32;4.12185076053757e-13;6.04508628991338e-10;2.42609463101857e+15;0;63;150
Eu-150b;1078531200;3.87705551582398e-13;6.42676985663415e-10;2.57927696912917e+15;0;63;150
Eu-152;426524084.64;1.55369295054709e-13;1.62510677713542e-09;6.43627815681265e+15;0;63;152
Eu-154;270986325.12;1.00010625613787e-13;2.55786774573588e-09;9.99893755151299e+15;0;63;154
Eu-155;149890608;5.56780692853852e-14;4.62435365236457e-09;1.79603928949901e+16;0;63;155
Eu-156;1312420.32;4.906542804107e-16;5.281442004494e-07;2.03809492737525e+18;0;63;156
Gd-153;20770599.744;7.61585234349607e-15;3.33715534988427e-08;1.31305066707865e+17;0;64;153
Tb-157;3122128333.44;1.17470400830005e-12;2.2201111118204e-10;851278273449606;0;65;157
Tb-158;5676483468.96;2.14938647667171e-12;1.22108552654155e-10;465249042391149;0;65;158
Tb-160;6246720;2.39524570520184e-15;1.10961781632592e-07;4.17493703392628e+17;0;65;160
Dy-166;293868;1.16906439272108e-16;2.35870248056932e-06;8.55384875483573e+18;0;66;166
Ho-166;96480.288;3.83817459880882e-17;7.18433987842102e-06;2.60540518482497e+19;0;67;166
Ho-166m;37843200000;1.50547652778194e-11;1.83162940914073e-11;66424150861609.7;0;67;166
Er-169;812160;3.28932168679429e-16;8.53461362982596e-07;3.04014047642321e+18;0;68;169
Tm-170;11106716.0256;4.52493804355177e-15;6.24079321882636e-08;2.20997501043145e+17;0;69;170
Tm-171;60440005.44;2.47684399276576e-14;1.14683507308424e-08;4.03739598828488e+16;0;69;171
Yb-169;2766360.384;1.12040105454341e-15;2.5056286395979e-07;8.92537539075703e+17;0;70;169
Hf-183;3841.2;1.68459713449248e-18;0.000180450687430997;5.93613736794864e+20;0;72;183
Ta-179;50769491.04;2.17787970737272e-14;1.36528290191807e-08;4.59162182656244e+16;0;73;179
Ta-180;29088;1.25477083104453e-17;2.38293172634745e-05;7.96958277367313e+19;0;73;180
Ta-182;9910080;4.32241633768762e-15;6.99436513691055e-08;2.31352077605503e+17;0;73;182
Ta-182m;950.4;4.14529901609101e-19;0.000729321528366946;2.41237120921374e+21;0;73;182
Ta-183;439776;1.92868215510404e-16;1.57613689823898e-06;5.18488750131074e+18;0;73;183
Ta-184;31320;1.38107614572063e-17;2.21311360332039e-05;7.24073037608083e+19;0;73;184
Ta-186;630;2.8082226726141e-19;0.00110023361993642;3.5609711785039e+21;0;73;186
W-179;2223;9.53609439510654e-19;0.000311807098767407;1.04864733775407e+21;0;74;179
W-179m;384;1.64726057027481e-19;0.00180507078270819;6.07068497871693e+21;0;74;179
W-181;10452699.648;4.53403735587861e-15;6.63127425356157e-08;2.20553983460998e+17;0;74;181
W-183m;5.25;2.3024406321164e-21;0.132028034392371;4.34321730624082e+23;0;74;183
W-185;6488640;2.87675883516785e-15;1.06824724527782e-07;3.47613427922836e+17;0;74;185
W-185m;100.0002;4.4335401388974e-20;0.00693145794268357;2.25553388188946e+22;0;74;185
W-187;85860;3.84778270621359e-17;8.07299301840141e-06;2.59889935672602e+19;0;74;187
Re-184;3274560;1.4439389220086e-15;2.11676433035261e-07;6.92550068952322e+17;0;75;184
Re-186;324000;1.44422880305868e-16;2.13934314987637e-06;6.9241106248687e+18;0;75;186
Re-188;61128;2.75407703361771e-17;1.13392746459878e-05;3.63098049834292e+19;0;75;188
Re-188m;1115.4;5.02535257704683e-19;0.000621433728312664;1.98991013002247e+21;0;75;188
Ir-192;6378219.936;2.93480173438926e-15;1.0867407952612e-07;3.40738520180854e+17;0;77;192
Au-196;534211.2;2.50926834567042e-16;1.29751525344273e-06;3.98522542128839e+18;0;79;196
Au-198;232788.384;1.1045987398725e-16;2.97758491488968e-06;9.05306120587669e+18;0;79;198
Au-198m;198720;9.42941644319602e-17;3.48805948349409e-06;1.06051101467851e+19;0;79;198
Hg-197;232560.288;1.09794309166854e-16;2.98050534130722e-06;9.10794018003526e+18;0;80;197
Hg-203;4026507.84;1.95885655689753e-15;1.72145990546474e-07;5.1050190299989e+17;0;80;203
Tl-201;262733.76;1.26558111657555e-16;2.63821132297557e-06;7.90150853945916e+18;0;81;201
Tl-202;1057540.32;5.11948590350887e-16;6.55433336631501e-07;1.9533211319414e+18;0;81;202
Tl-204;119458683.36;5.8401760490395e-14;5.80240097298813e-09;1.71227714987199e+16;0;81;204
Pb-201;33840;1.63006326194688e-17;2.04830727115823e-05;6.13473123003609e+19;0;82;201
Pb-203;186804.576;9.08785933361209e-17;3.7105471150768e-06;1.10036914447105e+19;0;82;203
Pb-210+;698838390.72;3.51701400235314e-13;9.91856185585066e-10;2.84332106534386e+15;0;82;210
Pb-212+;38304;1.94606811617885e-17;1.80959476963227e-05;5.13856627980485e+19;0;82;212
Pb-214;1608;8.24665574601965e-19;0.000431061679452702;1.21261276182489e+21;0;82;214
Bi-212+;3632.4;1.84547248987262e-18;0.000190823472238725;5.41866652300531e+20;0;83;212
Bi-214+;1194;6.12344960245489e-19;0.000580525276850875;1.63306643301041e+21;0;83;214
Po-210;11956699.872;6.0173970735112e-15;5.79714459658844e-08;1.66184811768869e+17;0;84;210
Rn-220+;55.8;2.9419475617862e-20;0.0124219924831531;3.39910885220827e+22;0;86;220
Rn-222+;330315.84;1.75735872746688e-16;2.09843760614067e-06;5.69035783286795e+18;0;86;222
Ra-226+;50457600000;2.73283289380497e-11;1.37372205685555e-11;36592065408276.1;0;88;226
Ra-228+;181335784.32;9.90823753895545e-14;3.8224511679215e-09;1.00926122942489e+16;0;88;228
Ac-227+;686648465.28;3.73541070103685e-13;1.00946439933758e-09;2.67708179912433e+15;0;89;227
Th-228+;60318907.2;3.29584181560734e-14;1.14913749723892e-08;3.03412619885012e+16;0;90;228
Th-229+;231479285760;1.27035664515438e-10;2.99442422368024e-12;7871805164434.53;0;90;229
Th-230;2377861704000;1.31066733605404e-09;2.91500207684048e-13;762970108807.814;0;90;230
Th-232;4.430902608e+17;0.000246353216421905;1.56434758757384e-18;4059212.27465282;0;90;232
Pa-231;1033144588800;5.71940871719069e-10;6.70910139852775e-13;1748432485676.93;0;91;231
U-230+;1797120;9.90564959689279e-16;3.85698885194058e-07;1.00952490820358e+18;0;92;230
U-231;362880;2.00887567702872e-16;1.91012781238962e-06;4.97790884440931e+18;0;92;231
U-232;2201259473.28;1.22387558336899e-12;3.14886631482438e-10;817076517898396;0;92;232
U-233;5022202608000;2.80432405926575e-09;1.38016570549307e-13;356592169402.072;0;92;233
U-234;7748552880000;4.34524737954452e-09;8.94550493872277e-14;230136494577.398;0;92;234
U-235+;2.2195478304e+16;1.25000116655228e-05;3.12292067359967e-17;79999925.3407235;0;92;235
U-236;747418968000000;4.2272133340463e-07;9.27387730625463e-16;2365624634.90054;0;92;236
U-237;583200;3.31240864185394e-16;1.18852397215354e-06;3.01895118665161e+18;0;92;237
U-238+;1.4090253264e+17;8.03662685233302e-05;4.91933798188644e-18;12443031.365948;0;92;238
U-240+;50760;2.9195162900541e-17;1.36553818077215e-05;3.42522493677015e+19;0;92;240
Np-237+;67487040000000;3.83307020763276e-08;1.0270819116677e-14;26088747292.15;0;93;237
Np-239;203472;1.16541499735851e-16;3.40659737241461e-06;8.58063438574726e+18;0;93;239
Pu-234;31680;1.77655672118186e-17;2.18796458510084e-05;5.62886615483207e+19;0;94;234
Pu-236;90131780.16;5.09762635450914e-14;7.69037490804559e-09;1.96169732823875e+16;0;94;236
Pu-237;3913920;2.22299424408864e-15;1.77097942870561e-07;4.49843719865306e+17;0;94;237
Pu-238;2765704677.12;1.57746891111989e-12;2.50622268637061e-10;633926914787861;0;94;238
Pu-239+;760443336000;4.35554802830728e-10;9.11504050000571e-13;2295922335147.88;0;94;239
Pu-240;206970768000;1.19041475323288e-10;3.349010042616e-12;8400433523561.79;0;94;240
Pu-241+;451920025.44;2.61009717406892e-13;1.53378284107919e-09;3.83127498062106e+15;0;94;241
Pu-242;11778979824000;6.83126434962369e-09;5.88461132387406e-14;146385785825.297;0;94;242
Pu-244+;2.5229367648e+15;1.47527926845354e-06;2.7473822976094e-16;677837763.590516;0;94;244
Pu-246+;937440;5.52658221970455e-16;7.39404314473401e-07;1.80943657444304e+18;0;94;246
Am-240;182880.288;1.05185575245427e-16;3.7901689030583e-06;9.50700699850456e+18;0;95;240
Am-241;13649043179.52;7.88310475883962e-12;5.07835729906689e-11;126853572366733;0;95;241
Am-242;57744;3.34888534065521e-17;1.20037957287328e-05;2.9860681936765e+19;0;95;242
Am-242m+;4446669346.56;2.57886287569889e-12;1.55880081593243e-10;387767806277406;0;95;242
Am-243+;232262009280;1.35257856313894e-10;2.98433300697202e-12;7393285885585;0;95;243
Cm-242;14077200.384;8.16412614357222e-15;4.92389936672187e-08;1.22487083420106e+17;0;96;242
Cm-243;946100183.04;5.50961747953813e-13;7.32636134085432e-10;1.81500803588243e+15;0;96;243
Cm-244;567660299.04;3.31937558793407e-13;1.22105981646446e-09;3.01261479308036e+15;0;96;244
Cm-245;268061991840;1.57390810694692e-10;2.58577195447264e-12;6353611088132.77;0;96;245
Cm-246;149168118240;8.79405476629938e-11;4.6467515226325e-12;11371318766767.3;0;96;246
Cm-247+;504588614400000;2.98684336288915e-07;1.37368771466268e-15;3348016211.44508;0;96;247
Cm-248;10722492288000;6.37272930160665e-09;6.46442228114891e-14;156918637631.115;0;96;248
Cf-252;83414296.8;5.03754665578326e-14;8.30969278829844e-09;1.98509327720463e+16;0;98;252
Pu-235;1518;8.54904654379269e-19;0.000456618696021044;1.16972108512625e+21;0;94;235
Pu-243;17841.6;1.03900615373596e-17;3.88500572011448e-05;9.62458207205316e+19;0;94;243
Pu-245+;37800;2.21940178964663e-17;1.83372269989403e-05;4.50571863402534e+19;0;94;245
Np-234;380160;2.13186806541823e-16;1.82330382091736e-06;4.69072179569339e+18;0;93;234
HT;388847079.36;2.79562003184466e-15;1.78257010879647e-09;3.57702401831825e+17;0;1;3
Pm-149;191088.288;6.82336157723667e-17;3.62736611340589e-06;1.46555328877204e+19;0;61;149
Pm-151;102239.712;3.69976902792885e-17;6.77962767109463e-06;2.70287142913839e+19;0;61;151
Rh-107;1302;3.33866473299676e-19;0.000532371106420849;2.99520940247992e+21;0;45;107
Sb-129;15696;4.85240172038425e-18;4.41607530937784e-05;2.06083514437632e+20;0;51;129
Pr-147;804;2.83237942678712e-19;0.000862123358905405;3.53060042218404e+21;0;59;147
Rn-222;330315.84;1.75735872746688e-16;2.09843760614067e-06;5.69035783286795e+18;0;86;222
Ra-226;50457600000;2.73283289380497e-11;1.37372205685555e-11;36592065408276.1;0;88;226
Bi-214;1194;6.12344960245489e-19;0.000580525276850875;1.63306643301041e+21;0;83;214
Pb-210;698838390.72;3.51701400235314e-13;9.91856185585066e-10;2.84332106534386e+15;0;82;210
Bi-210;433036.8;2.17932573447358e-16;1.60066576457231e-06;4.58857519177395e+18;0;83;210
Ac-225+;864000;4.65880259051187e-16;8.0225368120364e-07;2.1464742937093e+18;0;89;225
Ag-115;1200;3.30717467844978e-19;0.000577622650466621;3.02372900505136e+21;0;47;115
As-74;1536190.272;2.7242990441602e-16;4.51211801815098e-07;3.67066898233363e+18;0;33;74
As-76;94392;1.71920168484534e-17;7.34328312314545e-06;5.81665321070205e+19;0;33;76
Ba-137m;153.12;5.02725060773186e-20;0.00452682327951897;1.98915884253315e+22;0;56;137
Cd-117;8964;2.51342399758115e-18;7.7325656019628e-05;3.97863631827488e+20;0;48;117
Cd-117m;12096;3.39160828589264e-18;5.73038343716886e-05;2.94845370015013e+20;0;48;117
Cs-135m;3180;1.0288189054047e-18;0.000217970811496838;9.7198835941553e+20;0;55;135
Eu-157;54648;2.0561366410858e-17;1.26838526672512e-05;4.86349000362117e+19;0;63;157
Eu-158;2754;1.04279531317624e-18;0.000251687429397221;9.58960965171688e+20;0;63;158
Ga-68;4059;6.61463693730639e-19;0.000170767967617626;1.51179877214428e+21;0;31;68
Gd-147;137015.712;4.82687168924614e-17;5.05888828691373e-06;2.07173520321229e+19;0;64;147
Gd-159;66524.4;2.53487260706314e-17;1.0419442799333e-05;3.94497142465311e+19;0;64;159
Ge-68+;23410099.872;3.81496209212522e-15;2.96088946373524e-08;2.62125802524796e+17;0;32;68
In-113m;5968.44;1.61628269643238e-18;0.000116135402309472;6.18703647701789e+20;0;49;113
In-115;1.3907376e+22;3.83284347924002;4.98402560310403e-23;260.902905484228;0;49;115
In-115m;16149.6;4.45079568225772e-18;4.29203931094235e-05;2.24678927407591e+20;0;49;115
In-117;2592;7.26773204119852e-19;0.000267417893734547;1.37594506007006e+21;0;49;117
In-117m;6972.012;1.95488869614277e-18;9.94185294804348e-05;5.11538074762579e+20;0;49;117
In-119;144;4.10664820941417e-20;0.00481352208722184;2.43507587941811e+22;0;49;119
In-119m;1080;3.07998615706062e-19;0.000641802944962912;3.24676783922414e+21;0;49;119
Lu-177;574300.8;2.43607545110508e-16;1.20694099774882e-06;4.10496316748469e+18;0;71;177
Mn-56;9296.64;1.24764803952837e-18;7.4558892305171e-05;8.01508092280589e+20;0;25;56
Pm-150;9648;3.46821970626995e-18;7.1843613242117e-05;2.88332367811696e+20;0;61;150
Pr-144m;414;1.42869946109031e-19;0.00167426855207716;6.99937269687814e+21;0;59;144
Rb-82;76.38;1.5009684173246e-20;0.00907498272532005;6.6623653666374e+22;0;37;82
Rb-82m;23299.2;4.57860216665743e-18;2.97498274859199e-05;2.18407270079558e+20;0;37;82
Sc-44;14292;1.50703636390854e-18;4.84989630954342e-05;6.6355399507844e+20;0;21;44
Sc-47;289526.4;3.26109969599043e-17;2.39407245957517e-06;3.06645025673245e+19;0;21;47
Sc-49;3432;4.03015182119959e-19;0.000201965961701616;2.48129610090556e+21;0;21;49
Sm-155;1338;4.97010838089638e-19;0.000518047220149436;2.01202855825781e+21;0;62;155
Sm-156;33840;1.26512372569011e-17;2.04830727115823e-05;7.90436523870035e+19;0;62;156
Sn-117m;1175040;3.29470519200999e-16;5.89892412649736e-07;3.03517292662514e+18;0;50;117
Sn-121;97308;2.82170731788997e-17;7.1232291338836e-06;3.54395366826275e+19;0;50;121
Sn-123;11162899.872;3.29048706866239e-15;6.20938276351087e-08;3.03906375905166e+17;0;50;123
Sn-123m;2403.6;7.08508972482604e-19;0.000288378757097664;1.41141472986011e+21;0;50;123
Sn-128;3544.2;1.08719197638138e-18;0.000195572253416835;9.1980075435105e+20;0;50;128
Sr-82+;2207520;4.33806991439174e-16;3.13993612995554e-07;2.30517262223565e+18;0;38;82
Ti-44+;1892164415.04;1.99521451158621e-13;3.6632502706975e-10;5.01199241581794e+15;0;22;44
W-188+;6028990.272;2.71631717772866e-15;1.14969032837734e-07;3.68145520044233e+17;0;74;188
Y-86;53064;1.09364528071046e-17;1.30624751349304e-05;9.14373259445126e+19;0;39;86
Y-88;9212749.92;1.94289800462294e-15;7.52378156987838e-08;5.14695057393953e+17;0;39;88
Ac-227;686648465.28;3.73541070103685e-13;1.00946439933758e-09;2.67708179912433e+15;0;89;227
Ag-108m;13182352637.76;3.41188770099096e-12;5.25814473036072e-11;293092882192329;0;47;108
Ag-110m;21580999.776;5.68908330393474e-15;3.21183998774138e-08;1.75775242965483e+17;0;47;110
Am-242m;4446669346.56;2.57886287569889e-12;1.55880081593243e-10;387767806277406;0;95;242
Am-243;232262009280;1.35257856313894e-10;2.98433300697202e-12;7393285885585;0;95;243
Bi-212;3632.4;1.84547248987262e-18;0.000190823472238725;5.41866652300531e+20;0;83;212
Cd-109;39942236.16;1.04336657762047e-14;1.73537399804895e-08;9.58435914518778e+16;0;48;109
Cd-115;192456;5.30404674929776e-17;3.60158779440467e-06;1.88535291498401e+19;0;48;115
Ce-144;24624000;8.49765592509365e-15;2.81492519720576e-08;1.17679511716518e+17;0;58;144
Cm-247;504588614400000;2.98684336288915e-07;1.37368771466268e-15;3348016211.44508;0;96;247
Fe-52;29790;3.71237547166159e-18;2.32677804820391e-05;2.69369304811299e+20;0;26;52
I-135aéro;23652;7.65208325491575e-18;2.93060705462517e-05;1.30683366435878e+20;0;53;135
I-135élévap;23652;7.65208325491575e-18;2.93060705462517e-05;1.30683366435878e+20;0;53;135
I-135org;23652;7.65208325491575e-18;2.93060705462517e-05;1.30683366435878e+20;0;53;135
Mg-28;75240;5.04876162216212e-18;9.21248246358247e-06;1.98068372967023e+20;0;12;28
Np-237;67487040000000;3.83307020763276e-08;1.0270819116677e-14;26088747292.15;0;93;237
Pb-212;38304;1.94606811617885e-17;1.80959476963227e-05;5.13856627980485e+19;0;82;212
Pd-103;1467070.272;3.62131404689622e-16;4.7247033341832e-07;2.76142855065853e+18;0;46;103
Pu-239;760443336000;4.35554802830728e-10;9.11504050000571e-13;2295922335147.88;0;94;239
Pu-241;451920025.44;2.61009717406892e-13;1.53378284107919e-09;3.83127498062106e+15;0;94;241
Pu-244;2.5229367648e+15;1.47527926845354e-06;2.7473822976094e-16;677837763.590516;0;94;244
Pu-245;37800;2.21940178964663e-17;1.83372269989403e-05;4.50571863402534e+19;0;94;245
Pu-246;937440;5.52658221970455e-16;7.39404314473401e-07;1.80943657444304e+18;0;94;246
Ra-228;181335784.32;9.90823753895545e-14;3.8224511679215e-09;1.00926122942489e+16;0;88;228
Ru-103;3392059.68;8.37295499850078e-16;2.04344040479838e-07;1.19432147930934e+18;0;44;103
Sb-125;86993948.16;2.60601614613338e-14;7.96776322055303e-09;3.83727476701834e+16;0;51;125
Sb-127;332640;1.01240956739146e-16;2.08377579533413e-06;9.87742542355234e+18;0;51;127
Sn-113;9943780.32;2.69282426703475e-15;6.97066063663749e-08;3.71357318872192e+17;0;50;113
Sn-121m;1734519104.64;5.02970490667021e-13;3.99619225124539e-10;1.98818821095018e+15;0;50;121
Sn-126;7253280000000;2.19019627385144e-09;9.5563273520386e-14;456580084597.4;0;50;126
Sr-91;34668;7.56046013730235e-18;1.99938612137979e-05;1.32267081875894e+20;0;38;91
Te-127m;9417600;2.86630241157581e-15;7.36012551562973e-08;3.48881540189693e+17;0;52;127
Te-129m;2903040;8.97471731036207e-16;2.38765976548703e-07;1.11424122389394e+18;0;52;129
Te-131m;108000;3.39057299642808e-17;6.41802944962912e-06;2.94935399135628e+19;0;52;131
Te-132;276825.6;8.75705805333335e-17;2.50391286268302e-06;1.14193601767817e+19;0;52;132
Te-133m;3324;1.0594749767719e-18;0.00020852803265943;9.43863726774262e+20;0;52;133
Th-228;60318907.2;3.29584181560734e-14;1.14913749723892e-08;3.03412619885012e+16;0;90;228
Th-229;231479285760;1.27035664515438e-10;2.99442422368024e-12;7871805164434.53;0;90;229
U-230;1797120;9.90564959689279e-16;3.85698885194058e-07;1.00952490820358e+18;0;92;230
U-235;2.2195478304e+16;1.25000116655228e-05;3.12292067359967e-17;79999925.3407235;0;92;235
U-238;1.4090253264e+17;8.03662685233302e-05;4.91933798188644e-18;12443031.365948;0;92;238
U-240;50760;2.9195162900541e-17;1.36553818077215e-05;3.42522493677015e+19;0;92;240
Zr-95;5532359.616;1.25954026466722e-15;1.25289610341908e-07;7.93940478166614e+17;0;40;95
Zr-97;60278.4;1.40123668256046e-17;1.14990971983322e-05;7.13655310659377e+19;0;40;97
Ti-44;1892164415.04;1.99521451158621e-13;3.6632502706975e-10;5.01199241581794e+15;0;22;44
W-188;6028990.272;2.71631717772866e-15;1.14969032837734e-07;3.68145520044233e+17;0;74;188
Au-195;16078500;7.51377505300992e-15;4.31101894181637e-08;1.33088892460177e+17;0;79;195
Bi-207;1001575476;4.96857757917523e-13;6.92056861583885e-10;2.0126484573599e+15;0;83;207
Br-80;1056;2.02456606402491e-19;0.000656389375530251;4.93933005086514e+21;0;35;80
Ce-139;11892199.68;3.96145786212629e-15;5.82858679816538e-08;2.52432320323421e+17;0;58;139
Co-56;6679579.68;8.96427579493832e-16;1.03771077487909e-07;1.11553908299503e+18;0;27;56
Nb-95m;311759.712;7.0977654639336e-17;2.22333789094578e-06;1.40889411615722e+19;0;41;95
Rh-103m;3366.84;8.31070277842292e-19;0.000205874701666829;1.20326767381972e+21;0;45;103
Mn-52m;1272;1.58514320240132e-19;0.000544927028742095;6.30857829428349e+21;0;25;52
Sb-126m;1146;3.46045503528576e-19;0.000604840471692797;2.88979336475447e+21;0;51;126
Ag-110;24.56;6.474393558913e-21;0.028222605071659;1.54454620483079e+23;0;47;110
Ag-108;144;3.7270420724095e-20;0.00481352208722184;2.68309286713662e+22;0;47;108
Am-245;7380;4.33311777978627e-18;9.39223821896945e-05;2.30780710523249e+20;0;95;245
Am-246;2340;1.37952321152379e-18;0.000296216743829036;7.24888129207642e+20;0;95;246
Ac-228;22140;1.20973573933625e-17;3.13074607298982e-05;8.26626814008715e+19;0;89;228
Np-238;182908.8;1.04325291111957e-16;3.78957808787738e-06;9.58540339874866e+18;0;93;238
Tl-208;183.18;9.13102301307781e-20;0.00378396757593594;1.09516753880454e+22;0;81;208
Po-212;2.98e-07;1.51401498178075e-28;2325997.25020116;6.60495445575989e+30;0;84;212
Ra-224;314496;1.68826723564434e-16;2.20399362968033e-06;5.92323287976589e+18;0;88;224
Ra-225;1278720;6.89502783395757e-16;5.42063298110568e-07;1.4503204687225e+18;0;88;225
Th-226;1834.2;9.93420633129019e-19;0.000377901635895729;1.00662294163375e+21;0;90;226
Pa-233;2332800;1.30260120430712e-15;2.97130993038385e-07;7.67694668708618e+17;0;91;233
Np-240;3899.988;2.24312027127965e-18;0.000177730593160785;4.45807571178303e+20;0;93;240
Th-231;91871.712;5.08594708013082e-17;7.54472911705341e-06;1.96620213353513e+19;0;90;231
Th-234;2081380.32;1.16720018839383e-15;3.33022837729121e-07;8.5675106116637e+17;0;90;234
Np-240m;444;2.55371401257688e-19;0.00156114229855844;3.91586526555074e+21;0;93;240
Fr-223;1308;6.99021694861556e-19;0.00052992903712534;1.4305707638989e+21;0;87;223
Th-227;1617240.384;8.79788908299553e-16;4.28598733631391e-07;1.13663628918986e+18;0;90;227
Sb-126;1071360;3.23507251885144e-16;6.46978775164226e-07;3.09112081467352e+18;0;51;126
Ra-223;987552;5.27767792663547e-16;7.01884235523745e-07;1.89477268962015e+18;0;88;223
F-18;6583.68;2.84000605917604e-19;0.000105282635328562;3.52111924821079e+21;0;9;18
Sb-129+;15696;4.85240172038425e-18;4.41607530937784e-05;2.06083514437632e+20;0;51;129
Pr-147+;804;2.83237942678712e-19;0.000862123358905405;3.53060042218404e+21;0;59;147
Cs-137;947361307.68;3.11038578224656e-13;7.31660850977119e-10;3.21503527217683e+15;0;55;137
Rn-220;55.8;2.9419475617862e-20;0.0124219924831531;3.39910885220827e+22;0;86;220
Ac-225;864000;4.65880259051187e-16;8.0225368120364e-07;2.1464742937093e+18;0;89;225
Ge-68;23410099.872;3.81496209212522e-15;2.96088946373524e-08;2.62125802524796e+17;0;32;68
Sr-82;2207520;4.33806991439174e-16;3.13993612995554e-07;2.30517262223565e+18;0;38;82
Po-216;0.15;7.76467098418645e-23;4.62098120373297;1.28788457622558e+25;0;84;216
Fr-221;294;1.5571041127362e-19;0.00235764347129233;6.42217814352029e+21;0;87;221
Te-123m;10324800;3.04344043896172e-15;6.7134199263903e-08;3.28575511844468e+17;0;52;123
Te-123;2.9013151536e+24;855.220426995067;2.38907924118439e-25;1.16928918958781;0;52;123
Ca-47;392083.2;4.41625497475518e-17;1.76785738475901e-06;2.26436201196793e+19;0;20;47
Sc-48;157211.712;1.80844032376397e-17;4.40900472198881e-06;5.5296267554943e+19;0;21;48
Ti-45;11088;1.19575933156471e-18;6.25132738600239e-05;8.36288685860764e+20;0;22;45
Co-58m;32040;4.45347018004116e-18;2.16338071335813e-05;2.24543998179585e+20;0;27;58
Co-61;5940;8.68349038398184e-19;0.000116691444538711;1.15161064938204e+21;0;27;61
Ni-57;129239.712;1.76542342533789e-17;5.36326775906113e-06;5.66436349290315e+19;0;28;57
Ni-65;9072;1.41317011912193e-18;7.64051124955848e-05;7.07628888036031e+20;0;28;65
Ni-66+;195842.88;3.09763163069455e-17;3.53930242733331e-06;3.2282728200828e+19;0;28;66
Cu-67;222840.288;3.5780512879281e-17;3.11051106054909e-06;2.79481740067247e+19;0;29;67
Zn-63;2304;3.47857260091553e-19;0.000300845130451365;2.87474235764638e+21;0;30;63
Zn-69;3384;5.59573955593703e-19;0.000204830727115823;1.78707388005399e+21;0;30;69
Zn-69m;49608;8.20311607242684e-18;1.3972487916464e-05;1.21904894575526e+20;0;30;69
Zn-71m;14256;2.42568321545985e-18;4.86214352244631e-05;4.12254985987701e+20;0;30;71
Ga-72;50760;8.75854887016231e-18;1.36553818077215e-05;1.14174164559005e+20;0;31;72
Ge-69;140579.712;2.32460831915082e-17;4.93063451830052e-06;4.301799971039e+19;0;32;69
Ge-71;987552;1.68033691834582e-16;7.01884235523745e-07;5.95118746176471e+18;0;32;71
Ge-75;4966.812;8.92723634729376e-19;0.000139555751367264;1.12016749764124e+21;0;32;75
Ge-77;40680;7.50671135926736e-18;1.70390162379534e-05;1.33214126951272e+20;0;32;77
As-77;139788.288;2.57952391696691e-17;4.95854975031918e-06;3.87668435024954e+19;0;33;77
Co-60m;628.2;9.03290057827023e-20;0.0011033861517987;1.10706410563803e+22;0;27;60
Co-62m;834.6;1.24007547225594e-19;0.000830514235034682;8.064025314369e+21;0;27;62
Cr-49;2514;2.95215666622837e-19;0.000275714868957814;3.38735410433886e+21;0;24;49
Ga-70;1268.4;2.12780743007391e-19;0.000546473652286302;4.6996734096622e+21;0;31;70
In-116m;3276;9.10709632323024e-19;0.000211583388449312;1.09804482626281e+21;0;49;116
Sn-111;2118;5.63413154024773e-19;0.000327264957771457;1.7748964376434e+21;0;50;111
Cu-62;585;8.6921177961865e-20;0.00118486697531615;1.15046761151664e+22;0;29;62
Cu-66;306;4.83997824680955e-20;0.00226518686457498;2.06612498859718e+22;0;29;66
Pt-197;71609.4;3.3807597464159e-17;9.67955576446591e-06;2.95791501025811e+19;0;78;197
Pt-197m;5717.988;2.69952599252181e-18;0.000121222216723775;3.70435403389404e+20;0;78;197
Se-81;1103.4;2.14188449098783e-19;0.000628192115787516;4.66878584819858e+21;0;34;81
U-239;1408.2;8.0656670169864e-19;0.000492222113733806;1.23982306471862e+21;0;92;239
Pa-234;24408;1.36875620109239e-17;2.8398360396589e-05;7.30590297382333e+19;0;91;234
Bi-210m;94609892160000;4.76139147342808e-08;7.32637110914074e-15;21002263846.2035;0;83;210
Bi-211;130.2;6.58372204357305e-20;0.00532371106420849;1.51889765907749e+22;0;83;211
Bk-247;43519680000;2.57608799829193e-11;1.59272122533977e-11;38818549702612.9;0;97;247
Bk-249;27648000;1.64983729071994e-14;2.50704275376138e-08;6.06120376612188e+16;0;97;249
Cf-248;28814400;1.71253442069358e-14;2.40555826447868e-08;5.83929869038777e+16;0;98;248
Cf-249;11069354859.84;6.60540886573205e-12;6.26185707601359e-11;151391082721292;0;98;249
Cf-250;412499394.72;2.47139049473523e-13;1.68035926702498e-09;4.04630511499614e+15;0;98;250
Cf-251;28319907947.04;1.70350576065785e-11;2.44756155936726e-11;58702472459724.8;0;98;251
Cm-250;252293676480;1.51155662751387e-10;2.7473822976094e-12;6615696572643.44;0;96;250
Es-254;23820499.872;1.44998208095597e-14;2.90987672082697e-08;6.89663695251116e+16;0;99;254
Fe-60;47304000000000;6.80185178214733e-09;1.46530352731259e-14;147018787240.363;0;26;60
Gd-148;2352638895.84;8.34439849283333e-13;2.94625402047712e-10;1.19840872995083e+15;0;64;148
Hf-172;58972320;2.43083067467763e-14;1.17537716094592e-08;4.11382006331073e+16;0;72;172
Hf-178m;977637129.12;4.17038103585917e-13;7.09002512193729e-10;2.39786242887992e+15;0;72;178
Hf-182;283823684640000;1.23793564886523e-07;2.44217525904904e-15;8077964318.39298;0;72;182
Hg-194;14002008913.44;6.50983719509829e-12;4.95034094639534e-11;153613672666495;0;80;194
Ir-192m;7600176946.08;3.49705916491319e-12;9.12014530026771e-11;285954555768811;0;77;192
Kr-81;6622560000000;1.28554998682585e-09;1.04664537665185e-13;777877181165.94;0;36;81
Lu-173;42135249.6;1.74690674526664e-14;1.64505298328634e-08;5.72440402276518e+16;0;71;173
Lu-174;112245454.08;4.68054103549119e-14;6.17528064936975e-09;2.13650514420724e+16;0;71;174
Lu-176;1.2614431536e+18;0.000532057291765651;5.49487449023597e-19;1879496.84268298;0;71;176
Mn-53;116055002880000;1.47406890160175e-08;5.97257475644246e-15;67839434026.0068;0;25;53
Np-235;34185024;1.92522635887135e-14;2.02763403225911e-08;5.19419441455313e+16;0;93;235
Np-236;4793566608000;2.71112047600279e-09;1.44599467837403e-13;368851184907.274;0;93;236
Os-194;189216315.36;8.79707630001328e-14;3.66325271286027e-09;1.13674130574324e+16;0;76;194
Pa-234m;70.2;3.93668818898253e-20;0.00987389146096788;2.54020626474473e+22;0;91;234
Pb-202;1671439536000;8.09133323930326e-10;4.14700720923922e-13;1235890267307.93;0;82;202
Pb-205;482510260800000;2.37049182539886e-07;1.43654391807277e-15;4218533847.21857;0;82;205
Pm-144;31363200;1.08233301782772e-14;2.21006523747559e-08;9.2393005066688e+16;0;61;144
Pm-146;174412370.88;6.10250563631003e-14;3.97418587375805e-09;1.63867116164544e+16;0;61;146
Pt-193;1576833743.52;7.29325270534814e-13;4.39581651146441e-10;1.37113033155522e+15;0;78;193
Rb-87;1.5168847536e+18;0.000316264092542916;4.56954411938619e-19;3161914.43663274;0;37;87
Re-186m;5991840000000;2.67086046645652e-09;1.15681857419415e-13;374411172938.105;0;75;186
Rh-101;100914884.64;2.4426129179108e-14;6.86863174875196e-09;4.09397654727592e+16;0;45;101
Rh-106;30;7.62088078077559e-21;0.0231049060186648;1.31218428521097e+23;0;45;106
Si-32;4162837777.92;3.19240155121883e-13;1.6650833338653e-10;3.1324380218341e+15;0;14;32
Tc-97;81995492160000;1.9060740069277e-08;8.45347911574686e-15;52463860079.1712;0;43;97
Tc-98;132451200000000;3.11071354836871e-08;5.23322688325923e-15;32146965140.021;0;43;98
Tl-206;252.12;1.24466525554881e-19;0.00274927487133089;8.0342887016563e+21;0;81;206
Tl-207;286.2;1.41977008945849e-19;0.00242189790552042;7.04339390880819e+21;0;81;207
Po-211;0.516;2.60921703109347e-22;1.34330848945726;3.83256734906763e+24;0;84;211
Bk-250;11581.2;6.93859626559106e-18;5.98510672952669e-05;1.44121370047003e+20;0;97;250
Lu-172;578880;2.38613515791372e-16;1.19739355403528e-06;4.19087743912349e+18;0;71;172
Ir-194;69480;3.23027567766566e-17;9.97621157973439e-06;3.09571101597943e+19;0;77;194
Be-7;4598209.728;7.71373764134068e-17;1.50742837226224e-07;1.29638840014553e+19;0;4;7
Au-194;136872.288;6.36348910294831e-17;5.0641893307135e-06;1.57146493664409e+19;0;79;194
Cs-134m;10468.8;3.361860968611e-18;6.62107577334504e-05;2.97454299668188e+20;0;55;134
K-43;79920;8.23572769056043e-18;8.67301276976908e-06;1.21422178776767e+20;0;19;43
K-44;1327.8;1.40011396865223e-19;0.000522026796625957;7.14227571747332e+21;0;19;44
K-45;1038;1.11940673355355e-19;0.000667771850250429;8.93330341890574e+21;0;19;45
Sc-43;14007.6;1.44347821819687e-18;4.9483650344095e-05;6.9277110481733e+20;0;21;43
V-47;1956;2.2031534966612e-19;0.000354369724212651;4.53894838246842e+21;0;23;47
V-48;1380150.144;1.5876165595463e-16;5.02225923442678e-07;6.29875012317692e+18;0;23;48
Cr-48;77616;8.92833634234986e-18;8.93046769428913e-06;1.1200294899921e+20;0;24;48
Cu-60;1422;2.04469669250243e-19;0.000487445274655376;4.89070092237561e+21;0;29;60
Cu-61;11999.88;1.75422293920768e-18;5.77628426750889e-05;5.70052971973828e+20;0;29;61
Zn-62;33336;4.95316989493458e-18;2.07927519966386e-05;2.01890914548007e+20;0;30;62
Ni-56;524880;7.04410951685395e-17;1.32058219128171e-06;1.41962585562784e+19;0;28;56
Kr-76;53280;9.70411324779213e-18;1.30095191546536e-05;1.03049085935546e+20;0;36;76
Kr-79;126144;2.38820573684284e-17;5.49488822742219e-06;4.18724394039008e+19;0;36;79
Xe-127;3144960;9.57187227351923e-16;2.20399362968033e-07;1.04472768902957e+18;0;54;127
Xe-129m;767232;2.3718895748814e-16;9.0343883018428e-07;4.21604787419331e+18;0;54;129
I-126aéro;1121470.272;3.38638520913237e-16;6.18070044178527e-07;2.9530013221863e+18;0;53;126
I-126élévap;1121470.272;3.38638520913237e-16;6.18070044178527e-07;2.9530013221863e+18;0;53;126
I-126org;1121470.272;3.38638520913237e-16;6.18070044178527e-07;2.9530013221863e+18;0;53;126
I-128aéro;1499.4;4.59944599454387e-19;0.000462283033586732;2.1741748923376e+21;0;53;128
I-128élévap;1499.4;4.59944599454387e-19;0.000462283033586732;2.1741748923376e+21;0;53;128
I-128org;1499.4;4.59944599454387e-19;0.000462283033586732;2.1741748923376e+21;0;53;128
Br-80m;15876;3.04375102580109e-18;4.36600642831913e-05;3.28541983731015e+20;0;35;80
Ga-73;17496;3.0608333019663e-18;3.96174657384514e-05;3.26708416089695e+20;0;31;73
Ge-78;5280.012;9.86978199339317e-19;0.000131277576747921;1.01319360515703e+21;0;32;78
As-78;5442.012;1.01726041617764e-18;0.00012736965309153;9.8303245078335e+20;0;33;78
Rb-83;7447680;1.48141640062561e-15;9.30688725294246e-08;6.75029653767634e+17;0;37;83
Rb-84;2894400;5.82660910653351e-16;2.39478710807057e-07;1.71626409411724e+18;0;37;84
Ag-105;3568320;8.97906552611321e-16;1.94250286005724e-07;1.11370163976615e+18;0;47;105
Cs-129;115920.288;3.58366338505758e-17;5.97951568719313e-06;2.79044065402346e+19;0;55;129
Cs-130;1752.6;5.46014539412059e-19;0.000395496508364684;1.83145306181184e+21;0;55;130
Cs-131;837216;2.62837218683105e-16;8.27919175648752e-07;3.80463621175991e+18;0;55;131
Cs-132;564192;1.78475621374116e-16;1.22856612741752e-06;5.60300612655566e+18;0;55;132
Co-55;63108;8.31811947711485e-18;1.09835073296562e-05;1.20219480226419e+20;0;27;55
Br-76;58320;1.06220699063671e-17;1.18852397215354e-05;9.41436093732147e+19;0;35;76
Mg-27;567.48;3.67191290842177e-20;0.0012214477700711;2.72337613919555e+22;0;12;27
Au-196n;34560;1.62333388042725e-17;2.0056342030091e-05;6.16016219495652e+19;0;79;196
Au-196m;8.1;3.80468878225136e-21;0.085573725995055;2.62833586984812e+23;0;79;196
Ce-146;811.2;2.83830358316765e-19;0.000854471376429913;3.52323129185485e+21;0;58;146
Sr-93;445.38;9.92639852324498e-20;0.00155630513395291;1.0074147211179e+22;0;38;93
Tc-105;456;1.14744582321866e-19;0.00152005960649111;8.71500841054902e+21;0;43;105
Rh-108;16.8;4.34821575114441e-21;0.0412587607476158;2.2997938861171e+23;0;45;108
Ag-111m;64.8;1.72375695848939e-20;0.0106967157493819;5.80128187488999e+22;0;47;111
Pd-111;1404;3.73480674339368e-19;0.000493694573048394;2.67751471148769e+21;0;46;111
Cd-118;3018;8.53452373324819e-19;0.000229671033982752;1.17171154625099e+21;0;48;118
Pm-152;247.2;9.00471769840171e-20;0.00280399344886709;1.11052898435394e+22;0;61;152
Sn-129m;432;1.33552340928007e-19;0.00160450736240728;7.48770102456731e+21;0;50;129
Pr-146;1449;5.06989878206352e-19;0.000478362443450618;1.97242596546077e+21;0;59;146
In-118;5;1.41393700020679e-21;0.138629436111989;7.07245089317097e+23;0;49;118
Sb-129m;1062;3.28316171448017e-19;0.000652680960979233;3.04584448456975e+21;0;51;129
Nd-152;684;2.49159664470338e-19;0.00101337307099407;4.01349071538442e+21;0;60;152
Sb-130m;378;1.17764176593494e-19;0.00183372269989404;8.49154665643238e+21;0;51;130
U-235m;1560;8.78558142840355e-19;0.000444325115743555;1.13822859437285e+21;0;92;235
Sb-132;167.4;5.29550561121516e-20;0.00414066416105105;1.88839380678237e+22;0;51;132
Sn-125m;571.2;1.71110342058924e-19;0.00121349296316517;5.84418211060346e+21;0;50;125
Ru-108;273;7.06585059560967e-20;0.00253900066139174;1.41525777607206e+22;0;44;108
Rh-105m;40;1.00653142387602e-20;0.0173286795139986;9.93510958802588e+22;0;45;105
Ag-113;19332;5.23519999990464e-18;3.58549131264197e-05;1.9101466993013e+20;0;47;113
V-52;224.7;2.80017042122309e-20;0.00308476715870025;3.57121121064913e+22;0;23;52
Mo-102;678;1.65732588451357e-19;0.00102234097427721;6.03381633838115e+21;0;42;102
I-136élévap;83.4;2.7182100052789e-20;0.00831111727290102;3.67889161638707e+22;0;53;136
I-136aéro;83.4;2.7182100052789e-20;0.00831111727290102;3.67889161638707e+22;0;53;136
I-136org;83.4;2.7182100052789e-20;0.00831111727290102;3.67889161638707e+22;0;53;136
Al-29;393.6;2.7354648296882e-20;0.00176104466605677;3.6556858240213e+22;0;13;29
Cr-55;212.4;2.79959526040945e-20;0.00326340480489616;3.57194489554089e+22;0;24;55
Cu-68;31.1;5.06812536955479e-21;0.0222876906932458;1.97311614666676e+23;0;29;68
Cu-68m;225;3.66665018697693e-20;0.00308065413582198;2.72728498494828e+22;0;29;68
Ti-51;348;4.25331421689324e-20;0.00199180224298835;2.35110774564507e+22;0;22;51
Co-62;90;1.337248891721e-20;0.00770163533955495;7.47803947485819e+22;0;27;62
Tc-102;5.28;1.29066086581588e-21;0.13127787510605;7.74796870723944e+23;0;43;102
Xe-136;6.62271768e+27;2158505.69063711;1.04662045711715e-28;0.000463283467047446;0;54;136
Mo-91;929.4;2.02685232825914e-19;0.000745800710738052;4.93375854795942e+21;0;42;91
Nb-91;21444970069.44;4.67675785611062e-12;3.23221332702026e-11;213823343172109;0;41;91
I-130maéro;530.4;1.6524370175976e-19;0.00130683857571634;6.0516678660095e+21;0;53;130
I-130mélévap;530.4;1.6524370175976e-19;0.00130683857571634;6.0516678660095e+21;0;53;130
I-130morg;530.4;1.6524370175976e-19;0.00130683857571634;6.0516678660095e+21;0;53;130
Sn-113m;1254;3.39589323395428e-19;0.000552748947814948;2.94473333260707e+21;0;50;113
Ne-24;202.8;1.1664261300689e-20;0.00341788550571965;8.57319614351346e+22;0;10;24
Na-24m;0.0202;1.16182484355975e-24;34.3142168594032;8.60714939556698e+26;0;11;24
Tb-161;595296;2.29687250027952e-16;1.16437399303867e-06;4.35374623484023e+18;0;65;161
Lu-177m;13849900.128;5.87486587204439e-15;5.00470887265553e-08;1.7021665205303e+17;0;71;177
Hf-181;3661630.272;1.58829479423917e-15;1.89300155687577e-07;6.29606042673599e+17;0;72;181
Hf-179n;2168640;9.30290407062701e-16;3.19622980559219e-07;1.07493315249525e+18;0;72;179
Mn-51;2772;3.38798477276669e-19;0.000250053095440096;2.9516071265674e+21;0;25;51
Ga-65;912;1.4206472096993e-19;0.000760029803245554;7.03904525467421e+21;0;31;65
Ga-66;34164;5.40369336026149e-18;2.02888180704819e-05;1.85058613309547e+20;0;31;66
Ge-66;8136;1.28686480444583e-18;8.51950811897671e-05;7.77082407215755e+20;0;32;66
Ge-67;1134;1.82081534579172e-19;0.000611240899964678;5.49204510117517e+21;0;32;67
As-69;913.8;1.51104811058371e-19;0.000758532699233908;6.61792297012772e+21;0;33;69
As-70;3156;5.29435528958787e-19;0.000219628384207841;1.88880410418743e+21;0;33;70
As-71;235008;3.99870202790957e-17;2.94946206324868e-06;2.50081149588127e+19;0;33;71
As-72;93599.712;1.61504659532135e-17;7.40544138169939e-06;6.19177182192088e+19;0;33;72
As-73;6937920;1.21375266245873e-15;9.99070586804035e-08;8.23891086652095e+17;0;33;73
Se-70;2466;4.13684415213045e-19;0.000281081581735582;2.41730160292601e+21;0;34;70
Se-73;25740;4.50307780021791e-18;2.69287948935488e-05;2.22070335971457e+20;0;34;73
Se-73m;2388;4.17768056989913e-19;0.000290262638425438;2.39367271687827e+21;0;34;73
Br-74;1524;2.70268066331053e-19;0.000454820984619387;3.70003017217393e+21;0;35;74
Br-74m;2760;4.89461852410568e-19;0.000251140282811574;2.04306013854821e+21;0;35;74
Br-75;5802.012;1.04284060709031e-18;0.000119466691995802;9.58919314419635e+20;0;35;75
Br-77;205329.6;3.78896273528472e-17;3.37577816622613e-06;2.63924474814043e+19;0;35;77
S-38;10217.988;9.30522829547494e-19;6.78359751998089e-05;1.07466465974434e+21;0;16;38
Ti-52;102;1.271105398152e-20;0.00679556059372495;7.86716822581235e+22;0;22;52
Fe-53m;154.8;1.9661872414401e-20;0.00447769496485753;5.08598560159289e+22;0;26;53
Fe-61;358.8;5.24517904002136e-20;0.0019318483293198;1.90651261352545e+22;0;26;61
Zn-60;142.8;2.05332410470708e-20;0.00485397185266068;4.87015175883622e+22;0;30;60
Zn-61;89.1;1.30252355759728e-20;0.00777942963591409;7.67740432921358e+22;0;30;61
As-68;151.6002;2.4705106741144e-20;0.00457220492162903;4.04774612179511e+22;0;33;68
Se-71;284.4;4.83911550558909e-20;0.00243722637327688;2.06649334748265e+22;0;34;71
Se-72;725760;1.25228613632959e-16;9.5506390619481e-07;7.9853954379066e+18;0;34;72
Br-73;204;3.56887284865755e-20;0.00339778029686248;2.80200512152221e+22;0;35;73
Rb-77;226.2;4.17408581481386e-20;0.003064311143059;2.39573416639158e+22;0;37;77
Rb-78;1059.6;1.98068129394392e-19;0.000654159287051666;5.04876783083465e+21;0;37;78
Rb-78m;344.4;6.43777498711103e-20;0.00201262247549345;1.55333170544495e+22;0;37;78
Ar-43;322.2;3.32025958696017e-20;0.00215129478758518;3.01181270261925e+22;0;18;43
Kr-77;4464;8.23745317300136e-19;0.000155274906039414;1.21396744721724e+21;0;36;77
Se-79m;234;4.4301761670886e-20;0.00296216743829036;2.25724657955797e+22;0;34;79
As-79;540.6;1.02348428885816e-19;0.00128218124409905;9.77054568288135e+21;0;33;79
Tc-96;369792;8.50759470395341e-17;1.87442448879355e-06;1.17542035651429e+19;0;43;96
Xe-125;60840;1.82254082823265e-17;1.13929516857322e-05;5.48684553184861e+19;0;36;125
Te-121;1655419.68;4.80033483910374e-16;4.18713869923272e-07;2.08318801399843e+18;0;52;121
Te-121m;13305600;3.85831677651547e-15;5.20943948833533e-08;2.5918037784941e+17;0;52;121
Sm-147;3.342816e+18;0.00117762727188244;2.07354272732913e-19;849165.116906215;0;62;147
C-11 CH4;1222.2;3.22190708782714e-20;0.00056713073192599;3.10375182381315e+22;0;6;11
C-14 CH4;179754569280;6.03095408552064e-12;3.85607544406976e-12;165811244095000;0;6;14
Cr-56;356.4;4.78303732625885e-20;0.00194485740897852;2.09072171465191e+22;0;24;56
Fe-53;510.6;6.48536954444002e-20;0.00135751504222473;1.54193218003639e+22;0;26;53
Po-218;185.88;9.71107269363721e-20;0.00372900355369026;1.02975235748694e+22;0;84;218
OBT;388847079.36;2.79562003184466e-15;1.78257010879647e-09;3.57702401831825e+17;0;1;3
Hf-175;6048000;2.53645918816757e-15;1.14607668743377e-07;3.94250380477218e+17;0;72;175
Kr-81m;13.2;2.56234142478153e-21;0.0525111500424201;3.9026805340169e+23;0;36;81
Nb-88;870;1.83476299552258e-19;0.000796720897195339;5.45029522854084e+21;0;41;88
Nb-89;7308;1.55871456301441e-18;9.4847725856588e-05;6.41554280513101e+20;0;41;89
Nb-89m;3960;8.44623654835393e-19;0.000175037166808067;1.18395926312872e+21;0;41;89
Nb-90;52560;1.13364196369122e-17;1.31877317458133e-05;8.82112723442176e+19;0;41;90
Rb-79;1374;2.60130856990587e-19;0.000504473930538534;3.84421906562275e+21;0;37;79
Rb-80;34;6.51848922129233e-21;0.0203866817811749;1.53409780403341e+23;0;37;80
Rb-81;16473.6;3.19780209812735e-18;4.207624202117e-05;3.12714786379559e+20;0;37;81
Rb-81m;1815;3.5232194590746e-19;0.000381899273035783;2.83831311564866e+21;0;37;81
Sr-80;6378.012;1.22279419044921e-18;0.00010867762251936;8.1779910945818e+20;0;38;80
Sr-81;1338;2.59728244421037e-19;0.000518047220149436;3.85017810530815e+21;0;38;81
Sr-83;116676.288;2.3208054938896e-17;5.94077162070793e-06;4.30884881405563e+19;0;38;83
Sr-85m;4056.588;8.26338286038244e-19;0.000170869504263175;1.21015813607566e+21;0;38;85
Sr-87m;10137.6;2.11364697084201e-18;6.83738932844012e-05;4.73115905255282e+20;0;38;87
Y-86m;2880;5.93565959680031e-19;0.000240676104361092;1.68473273052764e+21;0;39;86
Y-87;287280;5.98966719720143e-17;2.41279302617636e-06;1.66954184110134e+19;0;39;87
Zr-86;59400;1.22422979184006e-17;1.16691444538711e-05;8.16840111770979e+19;0;40;86
Zr-88;7171200;1.51235084982661e-15;9.6657070024535e-08;6.61222229031478e+17;0;40;88
Zr-89;282240.288;6.0198692826352e-17;2.45587610993348e-06;1.66116563840444e+19;0;40;89
Eu-150m;46080;1.65646314329311e-17;1.50422565225683e-05;6.03695895105739e+19;0;63;150
Am-246m;1500;8.8430975097679e-19;0.000462098120373297;1.13082548156392e+21;0;95;246
Eu-147;2073600;7.30500246192261e-16;3.34272367168183e-07;1.36892493221256e+18;0;63;147
In-111m;474;1.26089629370983e-19;0.00146233582396613;7.9308663606091e+21;0;49;111
Mo-98;3.153663072e+21;0.74066089586659;2.19791133274222e-22;1350.14553297022;0;42;98
Nb-91m;5261760;1.14749413672701e-15;1.31732952578594e-07;8.71464147827625e+17;0;41;91
Pm-143;22982400;7.87606813057291e-15;3.01599128272045e-08;1.26966905748092e+17;0;61;143
Rb-90;157.9998;3.40782350713128e-20;0.00438701302507943;2.93442426788646e+22;0;37;90
Rb-90m;258;5.56468087200029e-20;0.00268661697891452;1.79704824589615e+22;0;37;90
Rb-91;58.4;1.27359776167779e-20;0.0118689585712319;7.85177259327651e+22;0;37;91
Rb-92;4.492;9.90388577039762e-22;0.1543070304007;1.00970469892632e+24;0;37;92
Te-128;6.93807768e+31;21282722152.2677;9.99047881170372e-33;4.69864706612941e-08;0;52;128
Y-89m;15.663;3.34074250143605e-21;0.0442537943280307;2.99334653769376e+23;0;39;89
Xe-134;3.469023072e+23;111.401242405699;1.99810484442908e-24;8.97656056974856;0;54;134
Zr-89m;250.8;5.34928314729082e-20;0.00276374473907474;1.86940936283483e+22;0;40;89
Cd-111m;2912.4;7.7473298856551e-19;0.000237998619887359;1.29076728983955e+21;0;48;111
Cl-36_Cl2;9492336000000;8.18942954570538e-10;7.30217704640823e-14;1221086272760.49;0;17;36
Pm-148;463795.2;1.64500041834152e-16;1.49451132862079e-06;6.07902580966024e+18;0;61;148
Cd-113;2.4282688464e+23;65.7587061061542;2.85449109799997e-24;15.2071118672211;0;48;113
