<?xml version="1.0" encoding="UTF-8" standalone="no"?>
<!-- Created with Inkscape (http://www.inkscape.org/) -->

<svg
   xmlns:dc="http://purl.org/dc/elements/1.1/"
   xmlns:cc="http://creativecommons.org/ns#"
   xmlns:rdf="http://www.w3.org/1999/02/22-rdf-syntax-ns#"
   xmlns:svg="http://www.w3.org/2000/svg"
   xmlns="http://www.w3.org/2000/svg"
   xmlns:sodipodi="http://sodipodi.sourceforge.net/DTD/sodipodi-0.dtd"
   xmlns:inkscape="http://www.inkscape.org/namespaces/inkscape"
   width="48"
   height="48"
   id="svg7854"
   sodipodi:version="0.32"
   inkscape:version="0.47 r22583"
   version="1.0"
   sodipodi:docname="media-playback-pause.svg"
   inkscape:output_extension="org.inkscape.output.svg.inkscape"
   inkscape:export-filename="/home/lapo/Desktop/media-icons.png"
   inkscape:export-xdpi="90"
   inkscape:export-ydpi="90">
  <defs
     id="defs7856">
    <inkscape:perspective
       sodipodi:type="inkscape:persp3d"
       inkscape:vp_x="0 : 24 : 1"
       inkscape:vp_y="0 : 1000 : 0"
       inkscape:vp_z="48 : 24 : 1"
       inkscape:persp3d-origin="24 : 16 : 1"
       id="perspective3755" />
    <linearGradient
       id="linearGradient7577">
      <stop
         style="stop-color:#000000;stop-opacity:0.3137255;"
         offset="0"
         id="stop7579" />
      <stop
         style="stop-color:#ffffff;stop-opacity:1"
         offset="1"
         id="stop7581" />
    </linearGradient>
    <linearGradient
       id="linearGradient7305">
      <stop
         style="stop-color:#ffffff;stop-opacity:1"
         offset="0"
         id="stop7307" />
      <stop
         id="stop7313"
         offset="0.20971029"
         style="stop-color:#ffffff;stop-opacity:0;" />
      <stop
         style="stop-color:#ffffff;stop-opacity:0.81065089;"
         offset="0.34936365"
         id="stop7329" />
      <stop
         id="stop7321"
         offset="0.42850056"
         style="stop-color:#ffffff;stop-opacity:0;" />
      <stop
         style="stop-color:#ffffff;stop-opacity:1;"
         offset="0.52134049"
         id="stop7323" />
      <stop
         id="stop7317"
         offset="0.55746967"
         style="stop-color:#ffffff;stop-opacity:0;" />
      <stop
         style="stop-color:#ffffff;stop-opacity:0.56804734;"
         offset="0.71001518"
         id="stop7319" />
      <stop
         id="stop7416"
         offset="0.74394959"
         style="stop-color:#ffffff;stop-opacity:0;" />
      <stop
         style="stop-color:#ffffff;stop-opacity:0"
         offset="1"
         id="stop7309" />
    </linearGradient>
  </defs>
  <sodipodi:namedview
     id="base"
     pagecolor="#ffffff"
     bordercolor="#afafaf"
     borderopacity="1"
     gridtolerance="10000"
     guidetolerance="10"
     objecttolerance="10"
     inkscape:pageopacity="0"
     inkscape:pageshadow="2"
     inkscape:zoom="1"
     inkscape:cx="-331.53856"
     inkscape:cy="10.827794"
     inkscape:document-units="px"
     inkscape:current-layer="layer1"
     width="48px"
     height="48px"
     inkscape:showpageshadow="false"
     inkscape:window-width="1375"
     inkscape:window-height="971"
     inkscape:window-x="117"
     inkscape:window-y="27"
     showgrid="false"
     inkscape:grid-points="true"
     showborder="true"
     showguides="false"
     inkscape:guide-bbox="true"
     borderlayer="true"
     inkscape:window-maximized="0">
    <sodipodi:guide
       orientation="horizontal"
       position="13.125"
       id="guide7377" />
    <sodipodi:guide
       orientation="horizontal"
       position="5.4800776"
       id="guide7379" />
    <sodipodi:guide
       orientation="horizontal"
       position="35"
       id="guide7492" />
    <sodipodi:guide
       orientation="horizontal"
       position="48"
       id="guide7046" />
    <sodipodi:guide
       orientation="horizontal"
       position="-17.5"
       id="guide7233" />
    <sodipodi:guide
       orientation="horizontal"
       position="-29"
       id="guide7235" />
    <sodipodi:guide
       orientation="horizontal"
       position="22.097087"
       id="guide7556" />
    <sodipodi:guide
       orientation="vertical"
       position="-76.125"
       id="guide7644" />
    <sodipodi:guide
       orientation="vertical"
       position="-26.125"
       id="guide7646" />
    <sodipodi:guide
       orientation="vertical"
       position="24"
       id="guide7648" />
    <sodipodi:guide
       orientation="vertical"
       position="-125.28125"
       id="guide7665" />
    <sodipodi:guide
       orientation="vertical"
       position="-175.125"
       id="guide7667" />
    <sodipodi:guide
       orientation="vertical"
       position="-225.83223"
       id="guide7685" />
    <sodipodi:guide
       orientation="vertical"
       position="-326.06462"
       id="guide7695" />
    <inkscape:grid
       id="GridFromPre046Settings"
       type="xygrid"
       originx="0px"
       originy="0px"
       spacingx="0.5px"
       spacingy="0.5px"
       color="#0000ff"
       empcolor="#0000ff"
       opacity="0.2"
       empopacity="0.4"
       empspacing="2" />
  </sodipodi:namedview>
  <metadata
     id="metadata7859">
    <rdf:RDF>
      <cc:Work
         rdf:about="">
        <dc:format>image/svg+xml</dc:format>
        <dc:type
           rdf:resource="http://purl.org/dc/dcmitype/StillImage" />
        <dc:creator>
          <cc:Agent>
            <dc:title>Lapo Calamandrei</dc:title>
          </cc:Agent>
        </dc:creator>
        <dc:source />
        <cc:license
           rdf:resource="http://creativecommons.org/licenses/GPL/2.0/" />
        <dc:title>Pause</dc:title>
        <dc:subject>
          <rdf:Bag>
            <rdf:li>playback</rdf:li>
            <rdf:li>pause</rdf:li>
          </rdf:Bag>
        </dc:subject>
      </cc:Work>
      <cc:License
         rdf:about="http://creativecommons.org/licenses/GPL/2.0/">
        <cc:permits
           rdf:resource="http://web.resource.org/cc/Reproduction" />
        <cc:permits
           rdf:resource="http://web.resource.org/cc/Distribution" />
        <cc:requires
           rdf:resource="http://web.resource.org/cc/Notice" />
        <cc:permits
           rdf:resource="http://web.resource.org/cc/DerivativeWorks" />
        <cc:requires
           rdf:resource="http://web.resource.org/cc/ShareAlike" />
        <cc:requires
           rdf:resource="http://web.resource.org/cc/SourceCode" />
      </cc:License>
    </rdf:RDF>
  </metadata>
  <g
     inkscape:label="Layer 1"
     inkscape:groupmode="layer"
     id="layer1">
    <g
       id="g7104"
       transform="translate(50,0)"
       style="fill:#00ff00;fill-opacity:1">
      <path
         d="M -37.03125,11.03125 C -38.047935,11.03125 -38.96875,11.952065 -38.96875,12.96875 L -38.96875,35.03125 C -38.96875,36.047939 -38.04795,36.968758 -37.03125,36.96875 L -29.96875,36.96875 C -28.952068,36.96875 -28.031246,36.04794 -28.03125,35.03125 L -28.03125,12.96875 C -28.03125,11.952065 -28.952065,11.03125 -29.96875,11.03125 L -37.03125,11.03125 z M -22.03125,11.03125 C -23.047935,11.03125 -23.96875,11.952065 -23.96875,12.96875 L -23.96875,35.03125 C -23.96875,36.047939 -23.04795,36.968758 -22.03125,36.96875 L -14.96875,36.96875 C -13.952068,36.96875 -13.03125,36.047934 -13.03125,35.03125 L -13.03125,12.96875 C -13.03125,11.952065 -13.952065,11.03125 -14.96875,11.03125 L -22.03125,11.03125 z "
         id="path7594"
         style="opacity:0.40000000000000002;fill:#00ff00;fill-opacity:1;fill-rule:evenodd;stroke:none;stroke-width:1;stroke-linecap:round;stroke-linejoin:round;stroke-miterlimit:4;stroke-dasharray:none;stroke-dashoffset:0.69999992000000000;stroke-opacity:1"
         inkscape:original="M -37.03125 12.5 C -37.295499 12.5 -37.5 12.704501 -37.5 12.96875 L -37.5 35.03125 C -37.5 35.295499 -37.295498 35.500002 -37.03125 35.5 L -29.96875 35.5 C -29.704501 35.5 -29.499999 35.2955 -29.5 35.03125 L -29.5 12.96875 C -29.5 12.704501 -29.704501 12.5 -29.96875 12.5 L -37.03125 12.5 z M -22.03125 12.5 C -22.295499 12.5 -22.5 12.704501 -22.5 12.96875 L -22.5 35.03125 C -22.5 35.295499 -22.295498 35.500002 -22.03125 35.5 L -14.96875 35.5 C -14.704501 35.5 -14.5 35.2955 -14.5 35.03125 L -14.5 12.96875 C -14.5 12.704501 -14.704501 12.5 -14.96875 12.5 L -22.03125 12.5 z "
         inkscape:radius="1.4584078"
         sodipodi:type="inkscape:offset" />
      <g
         id="g7451"
         style="fill:#00ff00;fill-opacity:1">
        <rect
           style="fill:#00ff00;fill-opacity:1;fill-rule:evenodd;stroke:#555753;stroke-width:1;stroke-linecap:round;stroke-linejoin:round;stroke-miterlimit:4;stroke-dasharray:none;stroke-dashoffset:0.69999992000000000;stroke-opacity:1"
           id="rect7865"
           width="7.9980135"
           height="23.000002"
           x="-37.5"
           y="12.5"
           rx="0.47698301"
           ry="0.47698301" />
        <rect
           ry="0.47698301"
           rx="0.47698301"
           y="12.5"
           x="-22.5"
           height="23.000002"
           width="7.9980135"
           id="rect7879"
           style="fill:#00ff00;fill-opacity:1;fill-rule:evenodd;stroke:#555753;stroke-width:1;stroke-linecap:round;stroke-linejoin:round;stroke-miterlimit:4;stroke-dasharray:none;stroke-dashoffset:0.69999992000000000;stroke-opacity:1" />
        <rect
           style="fill:#00ff00;fill-opacity:1;fill-rule:evenodd;stroke:#ffffff;stroke-width:0.99999987999999995;stroke-linecap:round;stroke-linejoin:miter;stroke-miterlimit:4;stroke-dasharray:none;stroke-dashoffset:0.69999992000000000;stroke-opacity:1"
           id="rect7867"
           width="5.9999704"
           height="20.999998"
           x="-36.5"
           y="13.500002" />
        <rect
           style="fill:#00ff00;fill-opacity:1;fill-rule:evenodd;stroke:#ffffff;stroke-width:0.99999987999999995;stroke-linecap:round;stroke-linejoin:miter;stroke-miterlimit:4;stroke-dasharray:none;stroke-dashoffset:0.69999992000000000;stroke-opacity:1"
           id="rect7889"
           width="5.9999704"
           height="20.999998"
           x="-21.5"
           y="13.500002" />
        <path
           sodipodi:type="inkscape:offset"
           inkscape:radius="-0.5"
           inkscape:original="M 12.96875 12.5 C 12.704501 12.5 12.5 12.704501 12.5 12.96875 L 12.5 35.03125 C 12.5 35.295499 12.704501 35.500002 12.96875 35.5 L 20.03125 35.5 C 20.295499 35.5 20.500001 35.2955 20.5 35.03125 L 20.5 12.96875 C 20.5 12.704501 20.295499 12.5 20.03125 12.5 L 12.96875 12.5 z M 27.96875 12.5 C 27.704501 12.5 27.5 12.704501 27.5 12.96875 L 27.5 35.03125 C 27.5 35.295499 27.704502 35.500002 27.96875 35.5 L 35.03125 35.5 C 35.295499 35.5 35.500001 35.2955 35.5 35.03125 L 35.5 12.96875 C 35.5 12.704501 35.295499 12.5 35.03125 12.5 L 27.96875 12.5 z "
           style="opacity:0.14999999999999999;fill:#00ff00;fill-opacity:1;fill-rule:evenodd;stroke:none;stroke-width:1;stroke-linecap:round;stroke-linejoin:round;stroke-miterlimit:4;stroke-dasharray:none;stroke-dashoffset:0.69999992000000000;stroke-opacity:1"
           id="path7402"
           d="M 13,13 L 13,35 L 20,35 L 20,13 L 13,13 z M 28,13 L 28,35 L 35,35 L 35,13 L 28,13 z "
           transform="matrix(1,0,0,-1,-50,48)" />
      </g>
    </g>
  </g>
</svg>
