<?xml version="1.0" encoding="UTF-8" standalone="no"?>
<!-- Created with Inkscape (http://www.inkscape.org/) -->

<svg
   xmlns:dc="http://purl.org/dc/elements/1.1/"
   xmlns:cc="http://creativecommons.org/ns#"
   xmlns:rdf="http://www.w3.org/1999/02/22-rdf-syntax-ns#"
   xmlns:svg="http://www.w3.org/2000/svg"
   xmlns="http://www.w3.org/2000/svg"
   xmlns:xlink="http://www.w3.org/1999/xlink"
   xmlns:sodipodi="http://sodipodi.sourceforge.net/DTD/sodipodi-0.dtd"
   xmlns:inkscape="http://www.inkscape.org/namespaces/inkscape"
   width="73.741135"
   height="70.710678"
   id="svg2"
   version="1.1"
   inkscape:version="0.48.4 r9939"
   sodipodi:docname="zns.svg">
  <defs
     id="defs4">
    <linearGradient
       id="linearGradient3762">
      <stop
         id="stop3764"
         offset="0"
         style="stop-color:#000000;stop-opacity:0;" />
      <stop
         style="stop-color:#000000;stop-opacity:0.49803922;"
         offset="0.62789154"
         id="stop3766" />
      <stop
         id="stop3768"
         offset="1"
         style="stop-color:#000000;stop-opacity:1;" />
    </linearGradient>
    <linearGradient
       id="linearGradient3779">
      <stop
         style="stop-color:#000000;stop-opacity:0;"
         offset="0"
         id="stop3781" />
      <stop
         id="stop3760"
         offset="0.810377"
         style="stop-color:#000000;stop-opacity:0.49803922;" />
      <stop
         style="stop-color:#000000;stop-opacity:1;"
         offset="1"
         id="stop3784" />
    </linearGradient>
    <linearGradient
       id="linearGradient3775">
      <stop
         id="stop3783"
         offset="0"
         style="stop-color:#000000;stop-opacity:1;" />
      <stop
         id="stop3779"
         offset="1"
         style="stop-color:#0000ff;stop-opacity:0;" />
    </linearGradient>
    <linearGradient
       inkscape:collect="always"
       xlink:href="#linearGradient3775"
       id="linearGradient2993"
       x1="136.37059"
       y1="387.68179"
       x2="679.83264"
       y2="385.6615"
       gradientUnits="userSpaceOnUse"
       gradientTransform="translate(-816.30603,0)" />
    <linearGradient
       inkscape:collect="always"
       xlink:href="#linearGradient3779"
       id="linearGradient3777"
       gradientUnits="userSpaceOnUse"
       gradientTransform="translate(-816.30603,0)"
       x1="143.44167"
       y1="385.6615"
       x2="679.83264"
       y2="385.6615" />
    <linearGradient
       inkscape:collect="always"
       xlink:href="#linearGradient3762"
       id="linearGradient3786"
       x1="-672.86438"
       y1="385.6615"
       x2="-142.85712"
       y2="384.36761"
       gradientUnits="userSpaceOnUse" />
  </defs>
  <sodipodi:namedview
     id="base"
     pagecolor="#ffffff"
     bordercolor="#666666"
     borderopacity="1.0"
     inkscape:pageopacity="0.0"
     inkscape:pageshadow="2"
     inkscape:zoom="3.959798"
     inkscape:cx="36.618032"
     inkscape:cy="39.242386"
     inkscape:document-units="px"
     inkscape:current-layer="layer1"
     showgrid="false"
     inkscape:window-width="1600"
     inkscape:window-height="850"
     inkscape:window-x="0"
     inkscape:window-y="28"
     inkscape:window-maximized="1"
     fit-margin-top="0"
     fit-margin-left="0"
     fit-margin-right="0"
     fit-margin-bottom="0" />
  <metadata
     id="metadata7">
    <rdf:RDF>
      <cc:Work
         rdf:about="">
        <dc:format>image/svg+xml</dc:format>
        <dc:type
           rdf:resource="http://purl.org/dc/dcmitype/StillImage" />
        <dc:title />
      </cc:Work>
    </rdf:RDF>
  </metadata>
  <g
     inkscape:label="Layer 1"
     inkscape:groupmode="layer"
     id="layer1"
     transform="translate(-141.84697,-348.51953)">
    <path
       sodipodi:nodetypes="ccccc"
       inkscape:connector-curvature="0"
       id="path3780"
       d="m 142.30387,405.45476 c 30.04421,-2.12693 73.58289,-0.44777 73.58289,-0.44777 l 0.2546,14.77436 -73.83749,0.002 z"
       style="fill:#c87137;stroke:none" />
    <path
       style="fill:#0000ff;stroke:none;stroke-width:1px;stroke-linecap:butt;stroke-linejoin:miter;stroke-opacity:1;fill-opacity:1"
       d="M 0.50507629,46.719555 C 9.5964492,46.467017 34.850263,39.648488 44.194174,40.153564 c 9.343911,0.505076 29.546961,5.303301 29.546961,5.303301 l 0.252538,16.16244 c 0,0 -19.950512,6.060915 -28.536809,1.262691 C 36.870568,58.083771 0.50507627,61.619305 0.50507627,61.619305 z"
       id="path3000"
       inkscape:connector-curvature="0"
       transform="translate(141.84697,348.51953)"
       sodipodi:nodetypes="csccscc" />
    <path
       style="fill:#e9c6af;stroke:#ff0000;stroke-width:4.20363760000000042;stroke-linecap:butt;stroke-linejoin:miter;stroke-miterlimit:4;stroke-opacity:1;stroke-dasharray:none"
       d="m 144.07164,364.13546 c 28.4001,-4.81154 69.55621,-1.01296 69.55621,-1.01296 l 0.24067,31.65479 c -25.2338,-6.6531 -30.32554,-8.10363 -69.79688,1.77266 z"
       id="path3010"
       inkscape:connector-curvature="0"
       sodipodi:nodetypes="ccccc" />
  </g>
</svg>
