<?xml version="1.0" encoding="UTF-8" standalone="no"?>
<!-- Created with Inkscape (http://www.inkscape.org/) -->

<svg
   xmlns:dc="http://purl.org/dc/elements/1.1/"
   xmlns:cc="http://creativecommons.org/ns#"
   xmlns:rdf="http://www.w3.org/1999/02/22-rdf-syntax-ns#"
   xmlns:svg="http://www.w3.org/2000/svg"
   xmlns="http://www.w3.org/2000/svg"
   xmlns:sodipodi="http://sodipodi.sourceforge.net/DTD/sodipodi-0.dtd"
   xmlns:inkscape="http://www.inkscape.org/namespaces/inkscape"
   width="216.37502"
   height="216.37502"
   id="svg2"
   version="1.1"
   inkscape:version="0.48.4 r9939"
   sodipodi:docname="3d.svg">
  <defs
     id="defs4" />
  <sodipodi:namedview
     id="base"
     pagecolor="#ffffff"
     bordercolor="#666666"
     borderopacity="1.0"
     inkscape:pageopacity="0.0"
     inkscape:pageshadow="2"
     inkscape:zoom="2.8"
     inkscape:cx="102.06321"
     inkscape:cy="110.7887"
     inkscape:document-units="px"
     inkscape:current-layer="layer1"
     showgrid="false"
     fit-margin-top="0"
     fit-margin-left="0"
     fit-margin-right="0"
     fit-margin-bottom="0"
     inkscape:window-width="1600"
     inkscape:window-height="850"
     inkscape:window-x="0"
     inkscape:window-y="28"
     inkscape:window-maximized="1" />
  <metadata
     id="metadata7">
    <rdf:RDF>
      <cc:Work
         rdf:about="">
        <dc:format>image/svg+xml</dc:format>
        <dc:type
           rdf:resource="http://purl.org/dc/dcmitype/StillImage" />
        <dc:title />
      </cc:Work>
    </rdf:RDF>
  </metadata>
  <g
     inkscape:label="Layer 1"
     inkscape:groupmode="layer"
     id="layer1"
     transform="translate(-176.81249,-230.59374)">
    <g
       id="g2991"
       transform="matrix(1.2803229,0,0,1.2803229,-78.539839,-95.99939)">
      <text
         transform="matrix(0.79918489,-0.2367599,0.21874878,1.1864702,0,0)"
         sodipodi:linespacing="125%"
         id="text3819-9"
         y="378.29352"
         x="160.63602"
         style="font-size:131.56622314px;font-style:normal;font-weight:normal;line-height:125%;letter-spacing:0px;word-spacing:0px;fill:#00b800;fill-opacity:1;stroke:none;font-family:Sans"
         xml:space="preserve"><tspan
           style="font-weight:bold;fill:#00b800;fill-opacity:1;stroke:#000000;stroke-width:1.26454759;-inkscape-font-specification:Sans Bold"
           y="378.29352"
           x="160.63602"
           id="tspan3821-2"
           sodipodi:role="line">3D</tspan></text>
      <path
         sodipodi:nodetypes="ccccc"
         transform="translate(176.81249,230.59374)"
         inkscape:connector-curvature="0"
         id="path3864"
         d="m 36.365492,152.23033 10.606601,6.86185 4.397754,22.99893 -10.754535,-6.62727 z"
         style="fill:#007400;fill-opacity:1;stroke:#000000;stroke-width:1px;stroke-linecap:round;stroke-linejoin:round;stroke-opacity:1" />
      <path
         sodipodi:nodetypes="ccccc"
         inkscape:connector-curvature="0"
         id="path3864-6"
         d="m 218.20948,336.65181 10.64818,7.48324 4.41499,18.86493 -11.51098,-7.6334 z"
         style="fill:#007400;fill-opacity:1;stroke:#000000;stroke-width:0.94118321px;stroke-linecap:round;stroke-linejoin:round;stroke-opacity:1" />
      <path
         sodipodi:nodetypes="ccccc"
         inkscape:connector-curvature="0"
         id="path3864-8"
         d="m 200.37602,296.67549 10.6147,6.70034 4.40111,22.45761 -10.76274,-6.47128 z"
         style="fill:#007400;fill-opacity:1;stroke:#000000;stroke-width:0.98853892px;stroke-linecap:round;stroke-linejoin:round;stroke-opacity:1" />
      <g
         id="text3819"
         style="font-size:131.56622314px;font-style:normal;font-weight:normal;line-height:125%;letter-spacing:0px;word-spacing:0px;fill:#00ff00;fill-opacity:1;stroke:none;font-family:Sans"
         transform="matrix(0.79918489,-0.2367599,0.21874878,1.1864702,0,0)">
        <path
           id="path3867"
           style="font-weight:bold;fill:#00ff00;stroke:#000000;stroke-width:1.26454759;-inkscape-font-specification:Sans Bold"
           d="m 232.40164,334.62537 c 6.46689,1.67032 11.37064,4.58259 14.71126,8.73682 3.3833,4.11148 5.07498,9.35785 5.07506,15.73912 -8e-5,9.50773 -3.64042,16.74558 -10.92102,21.71357 -7.28075,4.92517 -17.90197,7.38775 -31.8637,7.38775 -4.9252,0 -9.87177,-0.40686 -14.83974,-1.22059 -4.92519,-0.77089 -9.80752,-1.94865 -14.64702,-3.53327 l 0,-19.07967 c 4.62536,2.31271 9.2079,4.06863 13.74764,5.26779 4.58252,1.15636 9.07941,1.73453 13.49068,1.73451 6.55257,2e-5 11.56339,-1.13491 15.03247,-3.40479 3.5118,-2.26984 5.26773,-5.52473 5.26779,-9.76468 -6e-5,-4.36838 -1.79882,-7.66609 -5.39628,-9.89316 -3.55473,-2.26982 -8.82251,-3.40475 -15.80336,-3.40479 l -9.89316,0 0,-15.93185 10.40709,0 c 6.20995,6e-5 10.83532,-0.96356 13.87613,-2.89086 3.0407,-1.97 4.56107,-4.94651 4.56113,-8.92954 -6e-5,-3.6831 -1.4776,-6.53113 -4.43265,-8.5441 -2.95515,-2.01281 -7.13083,-3.01926 -12.52706,-3.01934 -3.98299,8e-5 -8.00878,0.44977 -12.07737,1.34907 -4.06864,0.89946 -8.11583,2.22711 -12.14161,3.98296 l 0,-18.11605 c 4.88233,-1.37039 9.72183,-2.39825 14.51854,-3.08358 4.79665,-0.68515 9.50768,-1.02777 14.13309,-1.02787 12.46276,1e-4 21.77775,2.05582 27.94498,6.16717 6.20991,4.0687 9.31491,10.21445 9.31499,18.43726 -8e-5,5.61048 -1.47763,10.21443 -4.43265,13.81188 -2.95518,3.55475 -7.32358,6.06015 -13.10523,7.51624"
           inkscape:connector-curvature="0" />
        <path
           id="path3869"
           style="font-weight:bold;fill:#00ff00;stroke:#000000;stroke-width:1.26454759;-inkscape-font-specification:Sans Bold"
           d="m 299.40533,309.12156 0,58.52385 8.8653,0 c 10.10725,10e-6 17.8162,-2.50539 23.12688,-7.51624 5.35337,-5.01079 8.03009,-12.29147 8.03016,-21.84205 -7e-5,-9.50765 -2.65538,-16.7455 -7.96592,-21.71356 -5.31068,-4.96792 -13.04104,-7.45192 -23.19112,-7.452 l -8.8653,0 m -24.73291,-18.69422 26.08198,0 c 14.56131,10e-5 25.39667,1.04937 32.50611,3.14782 7.15212,2.05582 13.27645,5.56767 18.37301,10.53558 4.4968,4.32566 7.83735,9.31506 10.02165,14.96823 2.1841,5.6533 3.2762,12.05601 3.27631,19.20815 -1.1e-4,7.2379 -1.09221,13.70485 -3.27631,19.40088 -2.1843,5.65326 -5.52485,10.64266 -10.02165,14.96823 -5.13939,4.968 -11.30655,8.50127 -18.5015,10.59982 -7.19509,2.05572 -17.98762,3.08358 -32.37762,3.08358 l -26.08198,0 0,-95.91229"
           inkscape:connector-curvature="0" />
      </g>
      <path
         sodipodi:nodetypes="ccccc"
         transform="translate(176.81249,230.59374)"
         inkscape:connector-curvature="0"
         id="path3862"
         d="m 95.459416,42.123701 10.693264,6.295507 21.12654,114.417722 -11.11168,-7.57614 z"
         style="fill:#006a00;fill-opacity:1;stroke:#000000;stroke-width:1px;stroke-linecap:butt;stroke-linejoin:miter;stroke-opacity:1" />
    </g>
  </g>
</svg>
