nom;periode;masse_atomique;decroissance_radioactive;activite_specifique;limite_qualite_eau;numero_atomique;nombre_de_masse
Ac-225;864000.0;4.65880259051187e-16;8.022536812036404e-07;2.1464742937093e+18;0.0;89;225
Ac-227;686648465.28;3.73541070103685e-13;1.0094643993375786e-09;2677081799124330.0;0.0;89;227
Ac-228;22140.0;1.20973573933625e-17;3.130746072989816e-05;8.26626814008715e+19;0.0;89;228
Ag-105;3568320.0;8.97906552611321e-16;1.9425028600572405e-07;1.11370163976615e+18;0.0;47;105
Ag-108;144.0;3.7270420724095e-20;0.004813522087221842;2.68309286713662e+22;0.0;47;108
Ag-108m;13182352637.76;3.4118877009909597e-12;5.258144730360724e-11;293092882192329.0;0.0;47;108
Ag-108m+;13182321101.76;3.41187953876882e-12;5.2581573093937284e-11;293093583356947.0;0.0;47;108
Ag-110;24.56;6.474393558913e-21;0.02822260507165901;1.5445462048307902e+23;0.0;47;110
Ag-110m;21580999.776;5.68908330393474e-15;3.2118399877413784e-08;1.75775242965483e+17;0.0;47;110
Ag-111;643680.0;1.7122652454328e-16;1.0768505787968328e-06;5.84021665257381e+18;0.0;47;111
Ag-111m;64.8;1.72375695848939e-20;0.010696715749381872;5.8012818748899905e+22;0.0;47;111
Ag-112;11268.0;3.02442562246267e-18;6.151465926162098e-05;3.30641293531213e+20;0.0;47;112
Ag-113;19332.0;5.23519999990464e-18;3.5854913126419684e-05;1.9101466993012998e+20;0.0;47;113
Ag-115;1200.0;3.30717467844978e-19;0.0005776226504666211;3.0237290050513603e+21;0.0;47;115
Al-26;22610996640000.0;1.4088705826814102e-09;3.065531305832547e-14;709788402350.459;0.0;13;26
Al-28;134.46;9.02254768362465e-21;0.005155043734641865;1.108334402948e+23;0.0;13;28
Al-29;393.6;2.7354648296882e-20;0.0017610446660567714;3.6556858240213e+22;0.0;13;29
Am-240;182880.288;1.05185575245427e-16;3.7901689030582963e-06;9.50700699850456e+18;0.0;95;240
Am-241;13649043179.52;7.883104758839619e-12;5.0783572990668885e-11;126853572366733.0;0.0;95;241
Am-242;57744.0;3.34888534065521e-17;1.2003795728732773e-05;2.9860681936765e+19;0.0;95;242
Am-242m;4446669346.56;2.57886287569889e-12;1.5588008159324297e-10;387767806277406.0;0.0;95;242
Am-243;232262009280.0;1.35257856313894e-10;2.9843330069720184e-12;7393285885585.0;0.0;95;243
Am-245;7380.0;4.33311777978627e-18;9.392238218969448e-05;2.30780710523249e+20;0.0;95;245
Am-246;2340.0;1.37952321152379e-18;0.0002962167438290364;7.24888129207642e+20;0.0;95;246
Am-246m;1500.0;8.8430975097679e-19;0.00046209812037329687;1.13082548156392e+21;0.0;95;246
Ar-37;3027456.0;2.68446417002081e-16;2.2895367614259142e-07;3.72513819021189e+18;0.0;18;37
Ar-39;8483360916.96;7.92885724707323e-13;8.170667113480934e-11;1261215795465520.0;0.0;18;39
Ar-41;6576.012;6.46136837126709e-19;0.00010540540080522135;1.5476597874327602e+21;0.0;18;41
Ar-43;322.2;3.32025958696017e-20;0.002151294787585181;3.01181270261925e+22;0.0;18;43
As-68;151.6002;2.4705106741144e-20;0.00457220492162903;4.04774612179511e+22;0.0;33;68
As-69;913.8;1.51104811058371e-19;0.0007585326992339082;6.61792297012772e+21;0.0;33;69
As-70;3156.0;5.29435528958787e-19;0.0002196283842078407;1.8888041041874298e+21;0.0;33;70
As-71;235008.0;3.99870202790957e-17;2.949462063248678e-06;2.50081149588127e+19;0.0;33;71
As-72;93599.712;1.61504659532135e-17;7.405441381699394e-06;6.19177182192088e+19;0.0;33;72
As-73;6937920.0;1.21375266245873e-15;9.990705868040354e-08;8.23891086652095e+17;0.0;33;73
As-74;1536190.272;2.7242990441602e-16;4.5121180181509784e-07;3.67066898233363e+18;0.0;33;74
As-76;94392.0;1.71920168484534e-17;7.3432831231454495e-06;5.816653210702049e+19;0.0;33;76
As-77;139788.288;2.57952391696691e-17;4.9585497503191776e-06;3.87668435024954e+19;0.0;33;77
As-78;5442.012;1.01726041617764e-18;0.00012736965309153035;9.8303245078335e+20;0.0;33;78
As-79;540.6;1.02348428885816e-19;0.001282181244099048;9.77054568288135e+21;0.0;33;79
Au-194;136872.288;6.36348910294831e-17;5.064189330713499e-06;1.57146493664409e+19;0.0;79;194
Au-195;16078500.0;7.51377505300992e-15;4.311018941816371e-08;1.33088892460177e+17;0.0;79;195
Au-196;534211.2;2.50926834567042e-16;1.2975152534427308e-06;3.98522542128839e+18;0.0;79;196
Au-196m;8.1;3.80468878225136e-21;0.08557372599505497;2.62833586984812e+23;0.0;79;196
Au-196n;34560.0;1.62333388042725e-17;2.005634203009101e-05;6.16016219495652e+19;0.0;79;196
Au-198;232788.384;1.1045987398725e-16;2.9775849148896766e-06;9.05306120587669e+18;0.0;79;198
Au-198m;198720.0;9.42941644319602e-17;3.4880594834940885e-06;1.06051101467851e+19;0.0;79;198
Ba-133;332389440.0;1.05944131836109e-13;2.0853465758718006e-09;9438937132893410.0;0.0;56;133
Ba-137m;153.12;5.02725060773186e-20;0.004526823279518974;1.98915884253315e+22;0.0;56;137
Ba-139;4983.588;1.66010278967989e-18;0.0001390859719061739;6.02372338759113e+20;0.0;56;139
Ba-140;1102900.32;3.7003460982764e-16;6.284767244966846e-07;2.70244991533574e+18;0.0;56;140
Ba-141;1096.2;3.70413629300615e-19;0.0006323181723772535;2.69968467922771e+21;0.0;56;141
Ba-142;636.0;2.16433014174027e-19;0.0010898540574841907;4.6203672014470607e+21;0.0;56;142
Be-10;50457600000000.0;1.20921809460397e-09;1.3737220568555486e-14;826980678227.04;0.0;4;10
Be-7;4598209.728;7.71373764134068e-17;1.5074283722622432e-07;1.29638840014553e+19;0.0;4;7
Bi-207;1001575476.0;4.96857757917523e-13;6.920568615838846e-10;2012648457359900.0;0.0;83;207
Bi-210;433036.8;2.17932573447358e-16;1.6006657645723072e-06;4.58857519177395e+18;0.0;83;210
Bi-210m;94609892160000.0;4.76139147342808e-08;7.326371109140743e-15;21002263846.2035;0.0;83;210
Bi-211;130.2;6.58372204357305e-20;0.005323711064208489;1.5188976590774902e+22;0.0;83;211
Bi-212;3632.4;1.84547248987262e-18;0.00019082347223872516;5.41866652300531e+20;0.0;83;212
Bi-214;1194.0;6.12344960245489e-19;0.0005805252768508755;1.63306643301041e+21;0.0;83;214
Bk-247;43519680000.0;2.5760879982919296e-11;1.5927212253397665e-11;38818549702612.9;0.0;97;247
Bk-249;27648000.0;1.6498372907199402e-14;2.5070427537613763e-08;6.06120376612188e+16;0.0;97;249
Bk-250;11581.2;6.93859626559106e-18;5.985106729526692e-05;1.44121370047003e+20;0.0;97;250
Br-73;204.0;3.56887284865755e-20;0.003397780296862477;2.80200512152221e+22;0.0;35;73
Br-74;1524.0;2.70268066331053e-19;0.00045482098461938666;3.70003017217393e+21;0.0;35;74
Br-74m;2760.0;4.89461852410568e-19;0.00025114028281157435;2.04306013854821e+21;0.0;35;74
Br-75;5802.012;1.04284060709031e-18;0.00011946669199580168;9.589193144196349e+20;0.0;35;75
Br-76;58320.0;1.06220699063671e-17;1.1885239721535413e-05;9.41436093732147e+19;0.0;35;76
Br-77;205329.6;3.78896273528472e-17;3.3757781662261325e-06;2.63924474814043e+19;0.0;35;77
Br-80;1056.0;2.02456606402491e-19;0.0006563893755302513;4.93933005086514e+21;0.0;35;80
Br-80m;15876.0;3.04375102580109e-18;4.366006428319131e-05;3.2854198373101496e+20;0.0;35;80
Br-82;127152.288;2.49871129194242e-17;5.451315044837772e-06;4.00206299633212e+19;0.0;35;82
Br-83;8640.0;1.7185805111666e-18;8.022536812036404e-05;5.8187556154770096e+20;0.0;35;83
Br-84;1908.0;3.8409239135109e-19;0.00036328468582806357;2.60354024843446e+21;0.0;35;84
Br-84m;360.0;7.24702625190735e-20;0.001925408834888737;1.3798763316702599e+22;0.0;35;84
Br-85;174.0;3.5444285140777e-20;0.003983604485976697;2.82132929477408e+22;0.0;35;85
C-11;1222.2;3.22190708782714e-20;0.0005671307319259902;3.10375182381315e+22;0.0;6;11
C-14;179754569280.0;6.030954085520639e-12;3.856075444069765e-12;165811244095000.0;0.0;6;14
C-14;180686830000.0;6.0622324091848195e-12;3.836179872987673e-12;164955734538470.0;0.0;6;14
C-15;2.449;8.80355520382991e-23;0.28303274012247664;1.13590473035821e+25;0.0;6;15
Ca-41;3248208000000.0;3.19158000844535e-10;2.1339371756979395e-13;3133244340902.83;0.0;20;41
Ca-45;14083200.0;1.51876964450687e-15;4.921801725175708e-08;6.58427697456839e+17;0.0;20;45
Ca-47;392083.2;4.41625497475518e-17;1.7678573847590136e-06;2.26436201196793e+19;0.0;20;47
Cd-109;39942236.16;1.0433665776204701e-14;1.73537399804895e-08;9.58435914518778e+16;0.0;48;109
Cd-111m;2912.4;7.7473298856551e-19;0.0002379986198873593;1.29076728983955e+21;0.0;48;111
Cd-113;2.4282688464e+23;65.7587061061542;2.8544910979999684e-24;15.2071118672211;0.0;48;113
Cd-113m;444667060.8;1.20418011414119e-13;1.558800373728841e-09;8304405530838610.0;0.0;48;113
Cd-115;192456.0;5.30404674929776e-17;3.6015877944046708e-06;1.88535291498401e+19;0.0;48;115
Cd-115m;3853440.0;1.06199993274379e-15;1.7987750699633193e-07;9.41619645319929e+17;0.0;48;115
Cd-117;8964.0;2.51342399758115e-18;7.7325656019628e-05;3.97863631827488e+20;0.0;48;117
Cd-117m;12096.0;3.39160828589264e-18;5.73038343716886e-05;2.9484537001501298e+20;0.0;48;117
Cd-118;3018.0;8.53452373324819e-19;0.00022967103398275192;1.17171154625099e+21;0.0;48;118
Ce-139;11892199.68;3.96145786212629e-15;5.828586798165378e-08;2.52432320323421e+17;0.0;58;139
Ce-141;2808000.0;9.48842794267584e-16;2.4684728652419705e-07;1.05391536516005e+18;0.0;58;141
Ce-143;118939.968;4.07607252252229e-17;5.827706129532045e-06;2.45334202096384e+19;0.0;58;143
Ce-144;24624000.0;8.49765592509365e-15;2.8149251972057558e-08;1.17679511716518e+17;0.0;58;144
Ce-146;811.2;2.83830358316765e-19;0.0008544713764299128;3.52323129185485e+21;0.0;58;146
Cf-248;28814400.0;1.71253442069358e-14;2.4055582644786817e-08;5.8392986903877704e+16;0.0;98;248
Cf-249;11069354859.84;6.60540886573205e-12;6.26185707601359e-11;151391082721292.0;0.0;98;249
Cf-250;412499394.72;2.47139049473523e-13;1.6803592670249755e-09;4046305114996140.0;0.0;98;250
Cf-251;28319907947.04;1.70350576065785e-11;2.4475615593672616e-11;58702472459724.8;0.0;98;251
Cf-252;83414296.8;5.03754665578326e-14;8.309692788298436e-09;1.98509327720463e+16;0.0;98;252
Cl-34;1.526;1.24340181896151e-22;0.4542248889645775;8.04245244578458e+24;0.0;17;34
Cl-34m+;1926.0;1.56932628002613e-19;0.00035988950184836203;6.3721611797857e+21;0.0;17;34
Cl-36;9492336000000.0;8.189429545705381e-10;7.302177046408231e-14;1221086272760.49;0.0;17;36
Cl-38;2232.0;2.03261831541592e-19;0.0003105498120788285;4.9197628124067e+21;0.0;17;38
Cl-38m;0.715;6.51129971112178e-23;0.9694366161677557;1.53579169192892e+25;0.0;17;38
Cl-39;3336.0;3.11794677076109e-19;0.00020777793182252555;3.20723884505539e+21;0.0;17;39
Cl-40;81.0;7.76467098418645e-21;0.008557372599505498;1.28788457622558e+23;0.0;17;40
Cm-242;14077200.384;8.16412614357222e-15;4.923899366721875e-08;1.22487083420106e+17;0.0;96;242
Cm-243;946100183.04;5.50961747953813e-13;7.326361340854321e-10;1815008035882430.0;0.0;96;243
Cm-244;567660299.04;3.31937558793407e-13;1.2210598164644644e-09;3012614793080360.0;0.0;96;244
Cm-245;268061991840.0;1.57390810694692e-10;2.5857719544726384e-12;6353611088132.77;0.0;96;245
Cm-246;149168118240.0;8.794054766299379e-11;4.6467515226325035e-12;11371318766767.299;0.0;96;246
Cm-247;504588614400000.0;2.98684336288915e-07;1.373687714662682e-15;3348016211.4450803;0.0;96;247
Cm-248;10722492288000.0;6.37272930160665e-09;6.464422281148907e-14;156918637631.115;0.0;96;248
Cm-250;252293676480.0;1.51155662751387e-10;2.747382297609401e-12;6615696572643.44;0.0;96;250
Co-55;63108.0;8.31811947711485e-18;1.098350732965623e-05;1.2021948022641902e+20;0.0;27;55
Co-56;6679579.68;8.96427579493832e-16;1.0377107748790944e-07;1.11553908299503e+18;0.0;27;56
Co-57;23483500.128;3.20786239719388e-15;2.951634878880289e-08;3.11734069664199e+17;0.0;27;57
Co-58;6122299.68;8.50982492451796e-16;1.1321680035106438e-07;1.17511230709208e+18;0.0;27;58
Co-58m;32040.0;4.45347018004116e-18;2.1633807133581313e-05;2.24543998179585e+20;0.0;27;58
Co-60;166226571.36;2.3901752508144302e-14;4.16989398800017e-09;4.18379363462684e+16;0.0;27;60
Co-60m;628.2;9.03290057827023e-20;0.001103386151798703;1.10706410563803e+22;0.0;27;60
Co-61;5940.0;8.68349038398184e-19;0.00011669144453871133;1.1516106493820401e+21;0.0;27;61
Co-62;90.0;1.337248891721e-20;0.007701635339554948;7.4780394748581905e+22;0.0;27;62
Co-62m;834.6;1.24007547225594e-19;0.0008305142350346816;8.064025314369001e+21;0.0;27;62
Cr-48;77616.0;8.92833634234986e-18;8.930467694289132e-06;1.1200294899921e+20;0.0;24;48
Cr-49;2514.0;2.95215666622837e-19;0.0002757148689578144;3.38735410433886e+21;0.0;24;49
Cr-51;2393540.064;2.92542470773413e-16;2.895907994126416e-07;3.41830708326295e+18;0.0;24;51
Cr-55;212.4;2.79959526040945e-20;0.003263404804896164;3.57194489554089e+22;0.0;24;55
Cr-56;356.4;4.78303732625885e-20;0.0019448574089785222;2.09072171465191e+22;0.0;24;56
Cs-129;115920.288;3.58366338505758e-17;5.979515687193128e-06;2.79044065402346e+19;0.0;55;129
Cs-130;1752.6;5.46014539412059e-19;0.00039549650836468407;1.83145306181184e+21;0.0;55;130
Cs-131;837216.0;2.62837218683105e-16;8.279191756487517e-07;3.80463621175991e+18;0.0;55;131
Cs-132;564192.0;1.78475621374116e-16;1.2285661274175197e-06;5.60300612655566e+18;0.0;55;132
Cs-134;65124993.6;2.0913683905020802e-14;1.0643335872204143e-08;4.78155835452753e+16;0.0;55;134
Cs-134m;10468.8;3.361860968611e-18;6.621075773345038e-05;2.9745429966818804e+20;0.0;55;134
Cs-135;72532800000000.0;2.34663886484083e-08;9.556327352038599e-15;42614141229.0906;0.0;55;135
Cs-135m;3180.0;1.0288189054047e-18;0.00021797081149683815;9.7198835941553e+20;0.0;55;135
Cs-136;1125790.272;3.66922587673388e-16;6.15698321258851e-07;2.72537051027815e+18;0.0;55;136
Cs-137;947361307.68;3.11038578224656e-13;7.316608509771193e-10;3215035272176830.0;0.0;55;137
Cs-138;2004.6;6.62956236042044e-19;0.00034577830018953673;1.50839519358044e+21;0.0;55;138
Cs-139;556.2;1.85277990800996e-19;0.0012462193106075965;5.39729514378254e+21;0.0;55;139
Cu-60;1422.0;2.04469669250243e-19;0.00048744527465537644;4.890700922375611e+21;0.0;29;60
Cu-61;11999.88;1.75422293920768e-18;5.776284267508886e-05;5.7005297197382795e+20;0.0;29;61
Cu-62;585.0;8.6921177961865e-20;0.0011848669753161457;1.15046761151664e+22;0.0;29;62
Cu-64;45723.6;7.01291279432193e-18;1.5159505825436871e-05;1.42594101670516e+20;0.0;29;64
Cu-66;306.0;4.83997824680955e-20;0.0022651868645749847;2.06612498859718e+22;0.0;29;66
Cu-67;222840.288;3.5780512879281e-17;3.110511060549093e-06;2.79481740067247e+19;0.0;29;67
Cu-68;31.1;5.06812536955479e-21;0.022287690693245828;1.97311614666676e+23;0.0;29;68
Cu-68m;225.0;3.66665018697693e-20;0.003080654135821979;2.72728498494828e+22;0.0;29;68
Dy-166;293868.0;1.16906439272108e-16;2.3587024805693214e-06;8.55384875483573e+18;0.0;66;166
Er-169;812160.0;3.28932168679429e-16;8.534613629825961e-07;3.04014047642321e+18;0.0;68;169
Es-254;23820499.872;1.44998208095597e-14;2.9098767208269662e-08;6.89663695251116e+16;0.0;99;254
Eu-147;2073600.0;7.30500246192261e-16;3.3427236716818347e-07;1.36892493221256e+18;0.0;63;147
Eu-150;1146629092.32;4.12185076053757e-13;6.045086289913378e-10;2426094631018570.0;0.0;63;150
Eu-150b;1078531200.0;3.87705551582398e-13;6.426769856634146e-10;2579276969129170.0;0.0;63;150
Eu-150m;46080.0;1.65646314329311e-17;1.5042256522568257e-05;6.036958951057391e+19;0.0;63;150
Eu-152;426524084.64;1.5536929505470899e-13;1.6251067771354195e-09;6436278156812650.0;0.0;63;152
Eu-154;270986325.12;1.00010625613787e-13;2.5578677457358824e-09;9998937551512990.0;0.0;63;154
Eu-155;149890608.0;5.56780692853852e-14;4.624353652364565e-09;1.7960392894990102e+16;0.0;63;155
Eu-156;1312420.32;4.906542804107e-16;5.281442004493997e-07;2.03809492737525e+18;0.0;63;156
Eu-157;54648.0;2.0561366410858e-17;1.2683852667251232e-05;4.8634900036211696e+19;0.0;63;157
Eu-158;2754.0;1.04279531317624e-18;0.00025168742939722053;9.58960965171688e+20;0.0;63;158
F-18;6583.68;2.84000605917604e-19;0.00010528263532856172;3.52111924821079e+21;0.0;9;18
Fe-52;29790.0;3.71237547166159e-18;2.3267780482039118e-05;2.69369304811299e+20;0.0;26;52
Fe-53;510.6;6.48536954444002e-20;0.0013575150422247262;1.5419321800363902e+22;0.0;26;53
Fe-53m;154.8;1.9661872414401e-20;0.004477694964857527;5.08598560159289e+22;0.0;26;53
Fe-55;86250960.0;1.1368539492550101e-14;8.03639960134873e-09;8.79620465456715e+16;0.0;26;55
Fe-59;3844369.728;5.43569660089412e-16;1.803019037194815e-07;1.83969061083268e+18;0.0;26;59
Fe-60;47304000000000.0;6.801851782147331e-09;1.4653035273125852e-14;147018787240.363;0.0;26;60
Fe-61;358.8;5.24517904002136e-20;0.0019318483293198029;1.9065126135254498e+22;0.0;26;61
Fr-221;294.0;1.5571041127362e-19;0.002357643471292331;6.42217814352029e+21;0.0;87;221
Fr-223;1308.0;6.99021694861556e-19;0.0005299290371253404;1.4305707638989e+21;0.0;87;223
Ga-65;912.0;1.4206472096993e-19;0.000760029803245554;7.03904525467421e+21;0.0;31;65
Ga-66;34164.0;5.40369336026149e-18;2.0288818070481948e-05;1.8505861330954702e+20;0.0;31;66
Ga-67;281767.68;4.52422324243502e-17;2.4599953428297573e-06;2.21032417370674e+19;0.0;31;67
Ga-68;4059.0;6.61463693730639e-19;0.00017076796761762632;1.5117987721442802e+21;0.0;31;68
Ga-70;1268.4;2.12780743007391e-19;0.0005464736522863018;4.6996734096622e+21;0.0;31;70
Ga-72;50760.0;8.75854887016231e-18;1.3655381807721538e-05;1.1417416455900499e+20;0.0;31;72
Ga-73;17496.0;3.0608333019663e-18;3.9617465738451376e-05;3.26708416089695e+20;0.0;31;73
Gd-147;137015.712;4.82687168924614e-17;5.058888286913732e-06;2.07173520321229e+19;0.0;64;147
Gd-148;2352638895.84;8.34439849283333e-13;2.94625402047712e-10;1198408729950830.0;0.0;64;148
Gd-153;20770599.744;7.61585234349607e-15;3.337155349884274e-08;1.31305066707865e+17;0.0;64;153
Gd-159;66524.4;2.53487260706314e-17;1.0419442799332956e-05;3.9449714246531105e+19;0.0;64;159
Ge-66;8136.0;1.28686480444583e-18;8.519508118976712e-05;7.77082407215755e+20;0.0;32;66
Ge-67;1134.0;1.82081534579172e-19;0.0006112408999646784;5.49204510117517e+21;0.0;32;67
Ge-68;23410099.872;3.81496209212522e-15;2.9608894637352416e-08;2.62125802524796e+17;0.0;32;68
Ge-69;140579.712;2.32460831915082e-17;4.930634518300516e-06;4.301799971039e+19;0.0;32;69
Ge-71;987552.0;1.68033691834582e-16;7.018842355237448e-07;5.95118746176471e+18;0.0;32;71
Ge-75;4966.812;8.92723634729376e-19;0.00013955575136726441;1.12016749764124e+21;0.0;32;75
Ge-77;40680.0;7.50671135926736e-18;1.7039016237953423e-05;1.33214126951272e+20;0.0;32;77
Ge-78;5280.012;9.86978199339317e-19;0.00013127757674792127;1.0131936051570301e+21;0.0;32;78
H-3;388838880.0;2.79556108246255e-15;1.7826076974605659e-09;3.57709944623754e+17;0.0;1;3
HT;388847079.36;2.79562003184466e-15;1.782570108796471e-09;3.57702401831825e+17;0.0;1;3
HTO;388838880.0;2.79556108246255e-15;1.7826076974605659e-09;3.57709944623754e+17;0.0;1;3
Hf-172;58972320.0;2.43083067467763e-14;1.175377160945924e-08;4.11382006331073e+16;0.0;72;172
Hf-175;6048000.0;2.53645918816757e-15;1.146076687433772e-07;3.94250380477218e+17;0.0;72;175
Hf-178m;977637129.12;4.17038103585917e-13;7.090025121937293e-10;2397862428879920.0;0.0;72;178
Hf-179n;2168640.0;9.30290407062701e-16;3.1962298055921926e-07;1.07493315249525e+18;0.0;72;179
Hf-181;3661630.272;1.58829479423917e-15;1.893001556875771e-07;6.29606042673599e+17;0.0;72;181
Hf-182;283823684640000.0;1.23793564886523e-07;2.442175259049041e-15;8077964318.39298;0.0;72;182
Hf-183;3841.2;1.68459713449248e-18;0.00018045068743099691;5.93613736794864e+20;0.0;72;183
Hg-194;14002008913.44;6.509837195098289e-12;4.950340946395338e-11;153613672666495.0;0.0;80;194
Hg-197;232560.288;1.09794309166854e-16;2.9805053413072196e-06;9.10794018003526e+18;0.0;80;197
Hg-203;4026507.84;1.95885655689753e-15;1.7214599054647445e-07;5.1050190299989e+17;0.0;80;203
Ho-166;96480.288;3.83817459880882e-17;7.184339878421023e-06;2.60540518482497e+19;0.0;67;166
Ho-166m;37843200000.0;1.5054765277819398e-11;1.8316294091407313e-11;66424150861609.7;0.0;67;166
I-123;47604.204;1.40322872615628e-17;1.4560629572966818e-05;7.12642195359839e+19;0.0;53;123
I-125;5132759.616;1.53758447759102e-15;1.350437644496822e-07;6.5037076958967e+17;0.0;53;125
I-126;1121470.272;3.38638520913237e-16;6.180700441785275e-07;2.9530013221863e+18;0.0;53;126
I-128;1499.4;4.59944599454387e-19;0.0004622830335867315;2.1741748923376e+21;0.0;53;128
I-129;507729600000000.0;1.56964066292687e-07;1.3651896217197999e-15;6370884901.35907;0.0;53;129
I-130;44496.0;1.38625259304342e-17;1.5577741382594957e-05;7.21369254794013e+19;0.0;53;130
I-130m;530.4;1.6524370175976e-19;0.0013068385757163373;6.051667866009499e+21;0.0;53;130
I-131;693213.12;2.17628674577931e-16;9.99904878545786e-07;4.59498272430964e+18;0.0;53;131
I-132;8262.0;2.61358825327716e-18;8.389580979907351e-05;3.8261573862910794e+20;0.0;53;132
I-132m;4979.988;1.57536167250801e-18;0.0001391865162245261;6.34774869448217e+20;0.0;53;132
I-133;74880.0;2.38668731229482e-17;9.256773244657388e-06;4.18990788968703e+19;0.0;53;133
I-134;3150.0;1.0115640809954e-18;0.0002200467239872842;9.88568118211531e+20;0.0;53;134
I-134m;216.0;6.93643941253989e-20;0.0032090147248145617;1.4416618390584799e+22;0.0;53;134
I-135;23652.0;7.65208325491575e-18;2.9306070546251702e-05;1.30683366435878e+20;0.0;53;135
I-136;83.4;2.7182100052789e-20;0.008311117272901023;3.67889161638707e+22;0.0;53;136
In-111;242326.08;6.44616152196693e-17;2.86039034906992e-06;1.55131080192801e+19;0.0;49;111
In-111m;474.0;1.26089629370983e-19;0.0014623358239661292;7.9308663606091e+21;0.0;49;111
In-113m;5968.44;1.61628269643238e-18;0.00011613540230947204;6.18703647701789e+20;0.0;49;113
In-115;1.3907376e+22;3.83284347924002;4.984025603104031e-23;260.90290548422803;0.0;49;115
In-115m;16149.6;4.45079568225772e-18;4.292039310942347e-05;2.24678927407591e+20;0.0;49;115
In-116m;3276.0;9.10709632323024e-19;0.00021158338844931175;1.09804482626281e+21;0.0;49;116
In-117;2592.0;7.26773204119852e-19;0.0002674178937345468;1.37594506007006e+21;0.0;49;117
In-117m;6972.012;1.95488869614277e-18;9.941852948043481e-05;5.11538074762579e+20;0.0;49;117
In-118;5.0;1.41393700020679e-21;0.13862943611198905;7.07245089317097e+23;0.0;49;118
In-119;144.0;4.10664820941417e-20;0.004813522087221842;2.43507587941811e+22;0.0;49;119
In-119m;1080.0;3.07998615706062e-19;0.0006418029449629123;3.24676783922414e+21;0.0;49;119
Ir-192;6378219.936;2.93480173438926e-15;1.0867407952611958e-07;3.40738520180854e+17;0.0;77;192
Ir-192m;7600176946.08;3.49705916491319e-12;9.120145300267713e-11;285954555768811.0;0.0;77;192
Ir-194;69480.0;3.23027567766566e-17;9.976211579734389e-06;3.09571101597943e+19;0.0;77;194
K-40;3.989304e+16;3.82415222418505e-06;1.737514064007018e-17;261495866.63305598;0.0;19;40
K-42;44492.4;4.47829987236615e-18;1.5579001819635382e-05;2.2329902608144e+20;0.0;19;42
K-43;79920.0;8.23572769056043e-18;8.673012769769085e-06;1.21422178776767e+20;0.0;19;43
K-44;1327.8;1.40011396865223e-19;0.0005220267966259567;7.14227571747332e+21;0.0;19;44
K-45;1038.0;1.11940673355355e-19;0.000667771850250429;8.93330341890574e+21;0.0;19;45
Kr-76;53280.0;9.70411324779213e-18;1.3009519154653629e-05;1.03049085935546e+20;0.0;36;76
Kr-77;4464.0;8.23745317300136e-19;0.00015527490603941426;1.21396744721724e+21;0.0;36;77
Kr-79;126144.0;2.38820573684284e-17;5.4948882274221945e-06;4.18724394039008e+19;0.0;36;79
Kr-81;6622560000000.0;1.28554998682585e-09;1.0466453766518466e-13;777877181165.9401;0.0;36;81
Kr-81m;13.2;2.56234142478153e-21;0.0525111500424201;3.9026805340169e+23;0.0;36;81
Kr-83m;6588.0;1.31041763976453e-18;0.00010521359753490366;7.63115490554361e+20;0.0;36;83
Kr-85;339075072.0;6.907053756377871e-14;2.044229251273138e-09;1.44779530501933e+16;0.0;36;85
Kr-85m;16128.0;3.28531856753133e-18;4.297787577876645e-05;3.0438448492726295e+20;0.0;36;85
Kr-87;4578.012;9.5449625121117e-19;0.00015140789944629793;1.04767305134105e+21;0.0;36;87
Kr-88;10224.0;2.15616285818653e-18;6.77960857355189e-05;4.63786859236163e+20;0.0;36;88
Kr-89;189.0;4.03115835262346e-20;0.0036674453997880704;2.48067655131732e+22;0.0;36;89
Kr-90;32.32;6.9709490613585e-21;0.02144638553712702;1.43452489926116e+23;0.0;36;90
Kr-91;8.57;1.86896109890046e-21;0.08088065117385593;5.35056615457816e+23;0.0;36;91
Kr-92;1.84;4.0568009388984e-22;0.37671042421736156;2.46499647150926e+24;0.0;36;92
La-137;1892204150400.0;6.21250291604698e-10;3.663173344236764e-13;1609657192139.07;0.0;57;137
La-140;145025.856;4.86576937795063e-17;4.779473120709905e-06;2.05517344190526e+19;0.0;57;140
La-141;14112.0;4.76854327375504e-18;4.911757231859023e-05;2.0970764919000898e+20;0.0;57;141
La-142;5465.988;1.86009474572179e-18;0.0001268109590727139;5.3760702367446296e+20;0.0;57;142
La-143;848.4;2.90746667100827e-19;0.0008170051633191246;3.4394203378889e+21;0.0;57;143
Lu-172;578880.0;2.38613515791372e-16;1.197393554035284e-06;4.19087743912349e+18;0.0;71;172
Lu-173;42135249.6;1.74690674526664e-14;1.645052983286339e-08;5.72440402276518e+16;0.0;71;173
Lu-174;112245454.08;4.68054103549119e-14;6.175280649369754e-09;2.13650514420724e+16;0.0;71;174
Lu-176;1.2614431536e+18;0.000532057291765651;5.494874490235969e-19;1879496.84268298;0.0;71;176
Lu-177;574300.8;2.43607545110508e-16;1.2069409977488195e-06;4.10496316748469e+18;0.0;71;177
Lu-177m;13849900.128;5.87486587204439e-15;5.0047088726555275e-08;1.7021665205303e+17;0.0;71;177
Mg-27;567.48;3.67191290842177e-20;0.0012214477700710955;2.72337613919555e+22;0.0;12;27
Mg-28;75240.0;5.04876162216212e-18;9.212482463582473e-06;1.9806837296702302e+20;0.0;12;28
Mn-51;2772.0;3.38798477276669e-19;0.0002500530954400957;2.9516071265674e+21;0.0;25;51
Mn-52;483408.0;6.02414233637121e-17;1.4338761058152643e-06;1.65998733788613e+19;0.0;25;52
Mn-52m;1272.0;1.58514320240132e-19;0.0005449270287420954;6.30857829428349e+21;0.0;25;52
Mn-53;116055002880000.0;1.47406890160175e-08;5.972574756442463e-15;67839434026.006805;0.0;25;53
Mn-54;26968000.032;3.48996078916683e-15;2.570258008519218e-08;2.86536170579365e+17;0.0;25;54
Mn-56;9296.64;1.24764803952837e-18;7.455889230517105e-05;8.01508092280589e+20;0.0;25;56
Mo-101;876.6;2.12178262055099e-19;0.0007907223141226846;4.71301814952333e+21;0.0;42;101
Mo-102;678.0;1.65732588451357e-19;0.0010223409742772054;6.03381633838115e+21;0.0;42;102
Mo-91;929.4;2.02685232825914e-19;0.0007458007107380518;4.93375854795942e+21;0.0;42;91
Mo-93;126144000000.0;2.8114320699542298e-11;5.4948882274221945e-12;35569061429120.0;0.0;42;93
Mo-98;3.153663072e+21;0.74066089586659;2.197911332742223e-22;1350.14553297022;0.0;42;98
Mo-99;237384.0;5.6320264516698e-17;2.9199406049268075e-06;1.77555984259186e+19;0.0;42;99
Mo-99+;237600.0;5.63715113451936e-17;2.917286113467783e-06;1.77394569728041e+19;0.0;42;99
N-13;598.02;1.86310404461486e-20;0.001159070232701156;5.36738676989305e+22;0.0;7;13
N-16;7.13;2.73393106751849e-22;0.09721559334641589;3.6577366996589e+24;0.0;7;16
N-17;4.17;1.69888125329931e-22;0.16622234545802045;5.88622658621931e+24;0.0;7;17
N-18;0.622;2.68312519564665e-23;1.1143845346622914;3.72699716592611e+25;0.0;7;18
Na-22;82078747.2;4.32744391038541e-15;8.444904487527867e-09;2.31083295522353e+17;0.0;11;22
Na-24;53846.604;3.09704565685761e-18;1.2872625738104957e-05;3.22888362264133e+20;0.0;11;24
Na-24m;0.0202;1.16182484355975e-24;34.31421685940323;8.60714939556698e+26;0.0;11;24
Nb-88;870.0;1.83476299552258e-19;0.0007967208971953394;5.45029522854084e+21;0.0;41;88
Nb-89;7308.0;1.55871456301441e-18;9.484772585658802e-05;6.415542805131011e+20;0.0;41;89
Nb-89m;3960.0;8.44623654835393e-19;0.000175037166808067;1.18395926312872e+21;0.0;41;89
Nb-90;52560.0;1.13364196369122e-17;1.3187731745813266e-05;8.82112723442176e+19;0.0;41;90
Nb-91;21444970069.44;4.676757856110619e-12;3.232213327020259e-11;213823343172109.0;0.0;41;91
Nb-91m;5261760.0;1.14749413672701e-15;1.3173295257859449e-07;8.71464147827625e+17;0.0;41;91
Nb-93m;508558681.44;1.1334492218845499e-13;1.3629640115419466e-09;8822627257508080.0;0.0;41;93
Nb-94;630300571200.0;1.41988640837099e-10;1.0997089519374773e-12;7042816904961.29;0.0;41;94
Nb-95;3023219.808;6.88289869317764e-16;2.2927449030525315e-07;1.45287624382908e+18;0.0;41;95
Nb-95m;311759.712;7.0977654639336e-17;2.2233378909457847e-06;1.40889411615722e+19;0.0;41;95
Nb-96;84060.0;1.9339207197947e-17;8.245862247917504e-06;5.1708427846316e+19;0.0;41;96
Nb-97;4326.012;1.00562833512448e-18;0.00016022775261833423;9.94403165734404e+20;0.0;41;97
Nb-97m;52.7;1.22506856802663e-20;0.013152697923338619;8.16280840190706e+22;0.0;41;97
Nb-98;3078.0;7.22890868627758e-19;0.00022519401577646045;1.38333466834111e+21;0.0;41;98
Nd-147;948672.0;3.34203862632959e-16;7.306499828812754e-07;2.99218564418046e+18;0.0;60;147
Nd-149;6220.8;2.22131707515606e-18;0.0001114241223893945;4.5018336696923095e+20;0.0;60;149
Nd-151;746.4;2.70101269695096e-19;0.0009286537788852429;3.70231506548951e+21;0.0;60;151
Nd-152;684.0;2.49159664470338e-19;0.001013373070994072;4.01349071538442e+21;0.0;60;152
Ne-24;202.8;1.1664261300689e-20;0.0034178855057196513;8.573196143513462e+22;0.0;10;24
Ni-56;524880.0;7.04410951685395e-17;1.3205821912817126e-06;1.41962585562784e+19;0.0;28;56
Ni-57;129239.712;1.76542342533789e-17;5.363267759061126e-06;5.66436349290315e+19;0.0;28;57
Ni-59;2396789611200.0;3.38890951298693e-10;2.891981746419985e-13;2950801714143.7803;0.0;28;59
Ni-63;3172524753.6;4.7898687862844e-13;2.1848440418735945e-10;2087739862234770.0;0.0;28;63
Ni-65;9072.0;1.41317011912193e-18;7.64051124955848e-05;7.07628888036031e+20;0.0;28;65
Ni-66+;195842.88;3.09763163069455e-17;3.5393024273333055e-06;3.2282728200828e+19;0.0;28;66
Np-234;380160.0;2.13186806541823e-16;1.8233038209173645e-06;4.69072179569339e+18;0.0;93;234
Np-235;34185024.0;1.92522635887135e-14;2.0276340322591123e-08;5.19419441455313e+16;0.0;93;235
Np-236;4793566608000.0;2.7111204760027904e-09;1.4459946783740305e-13;368851184907.274;0.0;93;236
Np-237;67487040000000.0;3.83307020763276e-08;1.0270819116676998e-14;26088747292.149998;0.0;93;237
Np-238;182908.8;1.04325291111957e-16;3.7895780878773757e-06;9.58540339874866e+18;0.0;93;238
Np-239;203472.0;1.16541499735851e-16;3.406597372414609e-06;8.58063438574726e+18;0.0;93;239
Np-240;3899.988;2.24312027127965e-18;0.00017773059316078546;4.45807571178303e+20;0.0;93;240
Np-240m;444.0;2.55371401257688e-19;0.0015611422985584353;3.91586526555074e+21;0.0;93;240
O-15;122.46;4.40213707742348e-21;0.005660192557242735;2.27162394630675e+23;0.0;8;15
O-19;26.91;1.22530821836564e-21;0.02575797772426404;8.161211889477341e+23;0.0;8;19
Os-194;189216315.36;8.79707630001328e-14;3.6632527128602744e-09;1.13674130574324e+16;0.0;76;194
P-32;1232928.0;9.45509162191707e-17;5.621959924342259e-07;1.05763121076689e+19;0.0;15;32
P-33;2193090.336;1.73439698031507e-16;3.1605956634881876e-07;5.76569269521179e+18;0.0;15;33
Pa-231;1033144588800.0;5.71940871719069e-10;6.709101398527746e-13;1748432485676.93;0.0;91;231
Pa-233;2332800.0;1.30260120430712e-15;2.971309930383853e-07;7.67694668708618e+17;0.0;91;233
Pa-234;24408.0;1.36875620109239e-17;2.839836039658904e-05;7.30590297382333e+19;0.0;91;234
Pa-234m;70.2;3.93668818898253e-20;0.009873891460967881;2.54020626474473e+22;0.0;91;234
Pb-201;33840.0;1.63006326194688e-17;2.0483072711582307e-05;6.134731230036089e+19;0.0;82;201
Pb-202;1671439536000.0;8.09133323930326e-10;4.147007209239218e-13;1235890267307.93;0.0;82;202
Pb-203;186804.576;9.08785933361209e-17;3.7105471150768024e-06;1.10036914447105e+19;0.0;82;203
Pb-205;482510260800000.0;2.37049182539886e-07;1.4365439180727684e-15;4218533847.21857;0.0;82;205
Pb-210;698838390.72;3.51701400235314e-13;9.91856185585066e-10;2843321065343860.0;0.0;82;210
Pb-212;38304.0;1.94606811617885e-17;1.8095947696322715e-05;5.138566279804849e+19;0.0;82;212
Pb-214;1608.0;8.24665574601965e-19;0.00043106167945270227;1.2126127618248902e+21;0.0;82;214
Pd-103;1467070.272;3.62131404689622e-16;4.7247033341831986e-07;2.76142855065853e+18;0.0;46;103
Pd-107;204984000000000.0;5.25631990498163e-08;3.381469678413658e-15;19024717256.1217;0.0;46;107
Pd-111;1404.0;3.73480674339368e-19;0.000493694573048394;2.67751471148769e+21;0.0;46;111
Pm-143;22982400.0;7.87606813057291e-15;3.0159912827204526e-08;1.26966905748092e+17;0.0;61;143
Pm-144;31363200.0;1.08233301782772e-14;2.2100652374755932e-08;9.2393005066688e+16;0.0;61;144
Pm-145;558199499.04;1.93970413817771e-13;1.241755289555133e-09;5155425409049590.0;0.0;61;145
Pm-146;174412370.88;6.10250563631003e-14;3.974185873758047e-09;1.63867116164544e+16;0.0;61;146
Pm-147;82731542.4;2.9145164009966e-14;8.378269768121055e-09;3.4311009526591e+16;0.0;61;147
Pm-148;463795.2;1.64500041834152e-16;1.4945113286207905e-06;6.07902580966024e+18;0.0;61;148
Pm-149;191088.288;6.82336157723667e-17;3.6273661134058897e-06;1.46555328877204e+19;0.0;61;149
Pm-150;9648.0;3.46821970626995e-18;7.184361324211705e-05;2.88332367811696e+20;0.0;61;150
Pm-151;102239.712;3.69976902792885e-17;6.779627671094626e-06;2.70287142913839e+19;0.0;61;151
Pm-152;247.2;9.00471769840171e-20;0.0028039934488670927;1.11052898435394e+22;0.0;61;152
Po-210;11956699.872;6.0173970735112e-15;5.797144596588443e-08;1.66184811768869e+17;0.0;84;210
Po-211;0.516;2.60921703109347e-22;1.3433084894572582;3.8325673490676305e+24;0.0;84;211
Po-212;2.98e-07;1.51401498178075e-28;2325997.2502011587;6.60495445575989e+30;0.0;84;212
Po-216;0.15;7.76467098418645e-23;4.620981203732969;1.28788457622558e+25;0.0;84;216
Po-218;185.88;9.71107269363721e-20;0.003729003553690259;1.02975235748694e+22;0.0;84;218
Pr-143;1171579.68;4.01500338523166e-16;5.916346898061131e-07;2.49065792491804e+18;0.0;59;143
Pr-144;1036.8;3.57796038951312e-19;0.000668544734336367;2.79488840326731e+21;0.0;59;144
Pr-144m;414.0;1.42869946109031e-19;0.0016742685520771624;6.99937269687814e+21;0.0;59;144
Pr-145;21024.0;7.30569265489898e-18;3.296932936453317e-05;1.3687956053413102e+20;0.0;59;145
Pr-146;1449.0;5.06989878206352e-19;0.0004783624434506179;1.97242596546077e+21;0.0;59;146
Pr-147;804.0;2.83237942678712e-19;0.0008621233589054045;3.53060042218404e+21;0.0;59;147
Pt-193;1576833743.52;7.29325270534814e-13;4.39581651146441e-10;1371130331555220.0;0.0;78;193
Pt-197;71609.4;3.3807597464159e-17;9.679555764465914e-06;2.95791501025811e+19;0.0;78;197
Pt-197m;5717.988;2.69952599252181e-18;0.00012122221672377509;3.7043540338940405e+20;0.0;78;197
Pu-234;31680.0;1.77655672118186e-17;2.1879645851008374e-05;5.62886615483207e+19;0.0;94;234
Pu-235;1518.0;8.54904654379269e-19;0.00045661869602104435;1.16972108512625e+21;0.0;94;235
Pu-236;90131780.16;5.0976263545091404e-14;7.69037490804559e-09;1.96169732823875e+16;0.0;94;236
Pu-237;3913920.0;2.22299424408864e-15;1.7709794287056079e-07;4.49843719865306e+17;0.0;94;237
Pu-238;2765704677.12;1.5774689111198899e-12;2.506222686370612e-10;633926914787861.0;0.0;94;238
Pu-239;760443336000.0;4.35554802830728e-10;9.115040500005713e-13;2295922335147.88;0.0;94;239
Pu-240;206970768000.0;1.19041475323288e-10;3.3490100426159955e-12;8400433523561.79;0.0;94;240
Pu-241;451920025.44;2.61009717406892e-13;1.533782841079195e-09;3831274980621060.0;0.0;94;241
Pu-242;11778979824000.0;6.831264349623691e-09;5.884611323874063e-14;146385785825.297;0.0;94;242
Pu-243;17841.6;1.03900615373596e-17;3.885005720114482e-05;9.62458207205316e+19;0.0;94;243
Pu-244;2522936764800000.0;1.47527926845354e-06;2.747382297609401e-16;677837763.5905161;0.0;94;244
Pu-245;37800.0;2.21940178964663e-17;1.833722699894035e-05;4.50571863402534e+19;0.0;94;245
Pu-246;937440.0;5.52658221970455e-16;7.394043144734013e-07;1.80943657444304e+18;0.0;94;246
Ra-223;987552.0;5.27767792663547e-16;7.018842355237448e-07;1.89477268962015e+18;0.0;88;223
Ra-224;314496.0;1.68826723564434e-16;2.2039936296803306e-06;5.92323287976589e+18;0.0;88;224
Ra-225;1278720.0;6.89502783395757e-16;5.420632981105678e-07;1.4503204687225e+18;0.0;88;225
Ra-226;50457600000.0;2.7328328938049697e-11;1.3737220568555486e-11;36592065408276.1;0.0;88;226
Ra-228;181335784.32;9.908237538955451e-14;3.822451167921501e-09;1.00926122942489e+16;0.0;88;228
Rb-77;226.2;4.17408581481386e-20;0.003064311143058998;2.39573416639158e+22;0.0;37;77
Rb-78;1059.6;1.98068129394392e-19;0.000654159287051666;5.048767830834651e+21;0.0;37;78
Rb-78m;344.4;6.43777498711103e-20;0.002012622475493453;1.55333170544495e+22;0.0;37;78
Rb-79;1374.0;2.60130856990587e-19;0.0005044739305385337;3.8442190656227503e+21;0.0;37;79
Rb-80;34.0;6.51848922129233e-21;0.02038668178117486;1.53409780403341e+23;0.0;37;80
Rb-81;16473.6;3.19780209812735e-18;4.207624202116995e-05;3.1271478637955894e+20;0.0;37;81
Rb-81m;1815.0;3.5232194590746e-19;0.0003818992730357825;2.83831311564866e+21;0.0;37;81
Rb-82;76.38;1.5009684173246e-20;0.00907498272532005;6.6623653666374e+22;0.0;37;82
Rb-82m;23299.2;4.57860216665743e-18;2.9749827485919913e-05;2.1840727007955803e+20;0.0;37;82
Rb-83;7447680.0;1.48141640062561e-15;9.306887252942464e-08;6.75029653767634e+17;0.0;37;83
Rb-84;2894400.0;5.82660910653351e-16;2.394787108070568e-07;1.71626409411724e+18;0.0;37;84
Rb-86;1610500.32;3.31922975002013e-16;4.3039245130975527e-07;3.01274715916829e+18;0.0;37;86
Rb-87;1.5168847536e+18;0.000316264092542916;4.569544119386192e-19;3161914.43663274;0.0;37;87
Rb-88;1068.0;2.25232974622771e-19;0.0006490142140074394;4.43984723673271e+21;0.0;37;88
Rb-89;924.0;1.97078852794925e-19;0.0007501592863202871;5.07411112769453e+21;0.0;37;89
Rb-90;157.9998;3.40782350713128e-20;0.004387013025079433;2.93442426788646e+22;0.0;37;90
Rb-90m;258.0;5.56468087200029e-20;0.0026866169789145165;1.79704824589615e+22;0.0;37;90
Rb-91;58.4;1.27359776167779e-20;0.01186895857123194;7.85177259327651e+22;0.0;37;91
Rb-92;4.492;9.90388577039762e-22;0.1543070304007002;1.0097046989263201e+24;0.0;37;92
Re-184;3274560.0;1.4439389220086001e-15;2.1167643303526132e-07;6.92550068952322e+17;0.0;75;184
Re-186;324000.0;1.44422880305868e-16;2.1393431498763743e-06;6.9241106248687e+18;0.0;75;186
Re-186m;5991840000000.0;2.6708604664565202e-09;1.1568185741941463e-13;374411172938.105;0.0;75;186
Re-188;61128.0;2.75407703361771e-17;1.133927464598785e-05;3.63098049834292e+19;0.0;75;188
Re-188m;1115.4;5.02535257704683e-19;0.0006214337283126638;1.9899101300224699e+21;0.0;75;188
Rh-101;100914884.64;2.4426129179108e-14;6.8686317487519576e-09;4.09397654727592e+16;0.0;45;101
Rh-102;91523148.48;2.23722246324606e-14;7.573463020794291e-09;4.4698281750178104e+16;0.0;45;102
Rh-102m;17971200.0;4.39294025601332e-15;3.856988851940579e-08;2.27637969496885e+17;0.0;45;102
Rh-103m;3366.84;8.31070277842292e-19;0.0002058747016668286;1.20326767381972e+21;0.0;45;103
Rh-105;127295.712;3.2031783563168e-17;5.44517305154745e-06;3.12189921622054e+19;0.0;45;105
Rh-105m;40.0;1.00653142387602e-20;0.01732867951399863;9.93510958802588e+22;0.0;45;105
Rh-106;30.0;7.62088078077559e-21;0.023104906018664842;1.3121842852109701e+23;0.0;45;106
Rh-107;1302.0;3.33866473299676e-19;0.0005323711064208489;2.9952094024799203e+21;0.0;45;107
Rh-108;16.8;4.34821575114441e-21;0.04125876074761579;2.2997938861171e+23;0.0;45;108
Rn-220;55.8;2.9419475617862e-20;0.012421992483153142;3.3991088522082703e+22;0.0;86;220
Rn-222;330315.84;1.75735872746688e-16;2.098437606140672e-06;5.69035783286795e+18;0.0;86;222
Ru-103;3392059.68;8.37295499850078e-16;2.0434404047983769e-07;1.19432147930934e+18;0.0;44;103
Ru-105;15984.0;4.02209956980858e-18;4.336506384884542e-05;2.48626366066714e+20;0.0;44;105
Ru-106+;32171135.04;8.17241282406907e-15;2.1545624041493106e-08;1.22362883707348e+17;0.0;44;106
Ru-108;273.0;7.06585059560967e-20;0.002539000661391741;1.41525777607206e+22;0.0;44;108
S-35;7544448.0;6.3281033231655e-16;9.18751352729776e-08;1.58025232669521e+18;0.0;16;35
S-37;299.4;2.65479852557471e-20;0.0023151208435535915;3.7667641832953e+22;0.0;16;37
S-38;10217.988;9.30522829547494e-19;6.783597519980894e-05;1.0746646597443399e+21;0.0;16;38
Sb-124;5201280.0;1.5456457590068e-15;1.3326473109695023e-07;6.46978775164226e+17;0.0;51;124
Sb-125;86993948.16;2.60601614613338e-14;7.967763220553034e-09;3.83727476701834e+16;0.0;51;125
Sb-126;1071360.0;3.23507251885144e-16;6.469787751642261e-07;3.09112081467352e+18;0.0;51;126
Sb-126m;1146.0;3.46045503528576e-19;0.000604840471692797;2.88979336475447e+21;0.0;51;126
Sb-127;332640.0;1.01240956739146e-16;2.083775795334131e-06;9.87742542355234e+18;0.0;51;127
Sb-128;32436.0;9.94982194738061e-18;2.1369687401650797e-05;1.00504311060889e+20;0.0;51;128
Sb-128m;624.0;1.91413518780537e-19;0.0011108127893588867;5.224291399953511e+21;0.0;51;128
Sb-129;15696.0;4.85240172038425e-18;4.416075309377837e-05;2.06083514437632e+20;0.0;51;129
Sb-129m;1062.0;3.28316171448017e-19;0.0006526809609792328;3.04584448456975e+21;0.0;51;129
Sb-130;2370.0;7.38362694514767e-19;0.00029246716479322586;1.3543479477347798e+21;0.0;51;130
Sb-130m;378.0;1.17764176593494e-19;0.0018337226998940352;8.49154665643238e+21;0.0;51;130
Sb-131;1381.8;4.33804978376326e-19;0.00050162627048773;2.30518331934056e+21;0.0;51;131
Sb-132;167.4;5.29550561121516e-20;0.004140664161051047;1.8883938067823702e+22;0.0;51;132
Sc-43;14007.6;1.44347821819687e-18;4.948365034409501e-05;6.9277110481733e+20;0.0;21;43
Sc-44;14292.0;1.50703636390854e-18;4.849896309543418e-05;6.635539950784399e+20;0.0;21;44
Sc-46;7239279.744;7.98052088652374e-16;9.574808614550831e-08;1.253051040426e+18;0.0;21;46
Sc-47;289526.4;3.26109969599043e-17;2.3940724595751725e-06;3.06645025673245e+19;0.0;21;47
Sc-48;157211.712;1.80844032376397e-17;4.409004721988813e-06;5.5296267554943e+19;0.0;21;48
Sc-49;3432.0;4.03015182119959e-19;0.00020196596170161577;2.48129610090556e+21;0.0;21;49
Se-70;2466.0;4.13684415213045e-19;0.00028108158173558204;2.41730160292601e+21;0.0;34;70
Se-71;284.4;4.83911550558909e-20;0.0024372263732768823;2.0664933474826497e+22;0.0;34;71
Se-72;725760.0;1.25228613632959e-16;9.5506390619481e-07;7.9853954379066e+18;0.0;34;72
Se-73;25740.0;4.50307780021791e-18;2.6928794893548767e-05;2.22070335971457e+20;0.0;34;73
Se-73m;2388.0;4.17768056989913e-19;0.00029026263842543774;2.39367271687827e+21;0.0;34;73
Se-75;10336900.32;1.85793124956323e-15;6.70556123307906e-08;5.38233048308479e+17;0.0;34;75
Se-79;11889072000000.0;2.2508839069743804e-09;5.830120135195963e-14;444269914099.743;0.0;34;79
Se-79m;234.0;4.4301761670886e-20;0.0029621674382903644;2.2572465795579697e+22;0.0;34;79
Se-81;1103.4;2.14188449098783e-19;0.000628192115787516;4.66878584819858e+21;0.0;34;81
Se-83;1338.0;2.66141287493161e-19;0.0005180472201494359;3.75740272927663e+21;0.0;34;83
Si-31;9432.0;7.00718419261804e-19;7.348888682781439e-05;1.42710677001111e+21;0.0;14;31
Si-32;4162837777.92;3.19240155121883e-13;1.6650833338653004e-10;3132438021834100.0;0.0;14;32
Sm-145;29376000.0;1.02079541205438e-14;2.3595696505989422e-08;9.79628227352113e+16;0.0;62;145
Sm-146;3153663072000000.0;1.10343357955635e-06;2.197911332742223e-16;906262070.0759029;0.0;62;146
Sm-147;3.342816e+18;0.00117762727188244;2.07354272732913e-19;849165.116906215;0.0;62;147
Sm-151;2838807648.0;1.02728503502807e-12;2.4416842086792395e-10;973439664652253.0;0.0;62;151
Sm-153;166622.4;6.10946054114546e-17;4.159987976166142e-06;1.63680572656995e+19;0.0;62;153
Sm-155;1338.0;4.97010838089638e-19;0.0005180472201494359;2.01202855825781e+21;0.0;62;155
Sm-156;33840.0;1.26512372569011e-17;2.0483072711582307e-05;7.90436523870035e+19;0.0;62;156
Sn-111;2118.0;5.63413154024773e-19;0.0003272649577714567;1.7748964376434e+21;0.0;50;111
Sn-113;9943780.32;2.69282426703475e-15;6.970660636637488e-08;3.71357318872192e+17;0.0;50;113
Sn-113m;1254.0;3.39589323395428e-19;0.0005527489478149484;2.94473333260707e+21;0.0;50;113
Sn-117m;1175040.0;3.29470519200999e-16;5.898924126497355e-07;3.03517292662514e+18;0.0;50;117
Sn-119m;25315200.0;7.219487552150101e-15;2.7380671713434824e-08;1.38513986315023e+17;0.0;50;119
Sn-121;97308.0;2.82170731788997e-17;7.1232291338836e-06;3.54395366826275e+19;0.0;50;121
Sn-121m;1734519104.64;5.02970490667021e-13;3.996192251245386e-10;1988188210950180.0;0.0;50;121
Sn-123;11162899.872;3.29048706866239e-15;6.209382763510873e-08;3.03906375905166e+17;0.0;50;123
Sn-123m;2403.6;7.08508972482604e-19;0.00028837875709766407;1.41141472986011e+21;0.0;50;123
Sn-125;832896.0;2.49504760958525e-16;8.322133622444402e-07;4.00793955256922e+18;0.0;50;125
Sn-125m;571.2;1.71110342058924e-19;0.0012134929631651703;5.84418211060346e+21;0.0;50;125
Sn-126;7253280000000.0;2.19019627385144e-09;9.556327352038599e-14;456580084597.4;0.0;50;126
Sn-127;7560.0;2.30093083498058e-18;9.168613499470175e-05;4.34606718636303e+20;0.0;50;127
Sn-128;3544.2;1.08719197638138e-18;0.00019557225341683464;9.198007543510499e+20;0.0;50;128
Sn-129m;432.0;1.33552340928007e-19;0.0016045073624072809;7.48770102456731e+21;0.0;50;129
Sr-80;6378.012;1.22279419044921e-18;0.00010867762251935954;8.177991094581799e+20;0.0;38;80
Sr-81;1338.0;2.59728244421037e-19;0.0005180472201494359;3.8501781053081497e+21;0.0;38;81
Sr-82;2207520.0;4.33806991439174e-16;3.13993612995554e-07;2.30517262223565e+18;0.0;38;82
Sr-83;116676.288;2.3208054938896e-17;5.9407716207079306e-06;4.3088488140556304e+19;0.0;38;83
Sr-85;5602950.144;1.14133656628445e-15;1.2371110981635486e-07;8.76165742464066e+17;0.0;38;85
Sr-85m;4056.588;8.26338286038244e-19;0.00017086950426317517;1.21015813607566e+21;0.0;38;85
Sr-87m;10137.6;2.11364697084201e-18;6.837389328440116e-05;4.73115905255282e+20;0.0;38;87
Sr-89;4369249.728;9.31912038927249e-16;1.5864215224823727e-07;1.07306264779145e+18;0.0;38;89
Sr-90;907921440.0;1.95825312808022e-13;7.634440051993323e-10;5106592123666640.0;0.0;38;90
Sr-91;34668.0;7.56046013730235e-18;1.999386121379789e-05;1.32267081875894e+20;0.0;38;91
Sr-92;9756.0;2.15098641086374e-18;7.10482964903593e-05;4.64902983556481e+20;0.0;38;92
Sr-93;445.38;9.92639852324498e-20;0.001556305133952906;1.0074147211179e+22;0.0;38;93
Ta-179;50769491.04;2.17787970737272e-14;1.3652829019180676e-08;4.59162182656244e+16;0.0;73;179
Ta-180;29088.0;1.25477083104453e-17;2.3829317263474466e-05;7.96958277367313e+19;0.0;73;180
Ta-182;9910080.0;4.32241633768762e-15;6.994365136910552e-08;2.31352077605503e+17;0.0;73;182
Ta-182m;950.4;4.14529901609101e-19;0.0007293215283669458;2.41237120921374e+21;0.0;73;182
Ta-183;439776.0;1.92868215510404e-16;1.5761368982389792e-06;5.18488750131074e+18;0.0;73;183
Ta-184;31320.0;1.38107614572063e-17;2.2131136033203872e-05;7.2407303760808305e+19;0.0;73;184
Ta-186;630.0;2.8082226726141e-19;0.0011002336199364211;3.5609711785039e+21;0.0;73;186
Tb-157;3122128333.44;1.17470400830005e-12;2.2201111118204006e-10;851278273449606.0;0.0;65;157
Tb-158;5676483468.96;2.1493864766717098e-12;1.2210855265415547e-10;465249042391149.0;0.0;65;158
Tb-160;6246720.0;2.39524570520184e-15;1.1096178163259204e-07;4.17493703392628e+17;0.0;65;160
Tb-161;595296.0;2.29687250027952e-16;1.1643739930386654e-06;4.35374623484023e+18;0.0;65;161
Tc-101;852.0;2.06223909731856e-19;0.0008135530288262268;4.84909825102365e+21;0.0;43;101
Tc-102;5.28;1.29066086581588e-21;0.13127787510605024;7.74796870723944e+23;0.0;43;102
Tc-104;1098.0;2.73661515131549e-19;0.000631281585209422;3.65414917592377e+21;0.0;43;104
Tc-105;456.0;1.14744582321866e-19;0.001520059606491108;8.71500841054902e+21;0.0;43;105
Tc-96;369792.0;8.50759470395341e-17;1.8744244887935522e-06;1.17542035651429e+19;0.0;43;96
Tc-97;81995492160000.0;1.9060740069277e-08;8.453479115746859e-15;52463860079.1712;0.0;43;97
Tc-98;132451200000000.0;3.11071354836871e-08;5.233226883259233e-15;32146965140.021;0.0;43;98
Tc-99;6748704000000.0;1.6011559095174802e-09;1.0270819116677e-13;624548798812.0759;0.0;43;99
Tc-99m;21636.0;5.13322398764566e-18;3.203675266037832e-05;1.9480934446007802e+20;0.0;43;99
Te-121;1655419.68;4.80033483910374e-16;4.1871386992327245e-07;2.08318801399843e+18;0.0;52;121
Te-121m;13305600.0;3.85831677651547e-15;5.209439488335327e-08;2.5918037784941e+17;0.0;52;121
Te-123;2.9013151536e+24;855.220426995067;2.3890792411843874e-25;1.1692891895878101;0.0;52;123
Te-123m;10324800.0;3.04344043896172e-15;6.713419926390297e-08;3.28575511844468e+17;0.0;52;123
Te-125m;4959360.0;1.48564038164101e-15;1.3976544968704536e-07;6.7311040569281e+17;0.0;52;125
Te-127;33660.0;1.02446206224136e-17;2.0592607859772586e-05;9.76122041856937e+19;0.0;52;127
Te-127m;9417600.0;2.86630241157581e-15;7.360125515629728e-08;3.48881540189693e+17;0.0;52;127
Te-128;6.93807768e+31;21282722152.2677;9.990478811703724e-33;4.69864706612941e-08;0.0;52;128
Te-129;4176.0;1.29100596230407e-18;0.00016598352024902905;7.745897611621361e+20;0.0;52;129
Te-129m;2903040.0;8.97471731036207e-16;2.387659765487025e-07;1.11424122389394e+18;0.0;52;129
Te-131;1500.0;4.70912916170567e-19;0.00046209812037329687;2.12353487377652e+21;0.0;52;131
Te-131m;108000.0;3.39057299642808e-17;6.418029449629123e-06;2.94935399135628e+19;0.0;52;131
Te-132;276825.6;8.75705805333335e-17;2.5039128626830225e-06;1.14193601767817e+19;0.0;52;132
Te-133;747.0;2.38095008317873e-19;0.0009279078722355358;4.20000405327664e+21;0.0;52;133
Te-133m;3324.0;1.0594749767719e-18;0.00020852803265943;9.43863726774262e+20;0.0;52;133
Te-134;2508.0;8.0539768734491e-19;0.0002763744739074742;1.2416226365097e+21;0.0;52;134
Th-226;1834.2;9.93420633129019e-19;0.00037790163589572853;1.00662294163375e+21;0.0;90;226
Th-227;1617240.384;8.79788908299553e-16;4.2859873363139146e-07;1.13663628918986e+18;0.0;90;227
Th-228;60318907.2;3.2958418156073404e-14;1.1491374972389175e-08;3.03412619885012e+16;0.0;90;228
Th-229;231479285760.0;1.27035664515438e-10;2.9944242236802435e-12;7871805164434.53;0.0;90;229
Th-230;2377861704000.0;1.31066733605404e-09;2.9150020768404844e-13;762970108807.814;0.0;90;230
Th-231;91871.712;5.08594708013082e-17;7.544729117053411e-06;1.96620213353513e+19;0.0;90;231
Th-232;4.430902608e+17;0.000246353216421905;1.5643475875738437e-18;4059212.2746528196;0.0;90;232
Th-234;2081380.32;1.16720018839383e-15;3.330228377291207e-07;8.5675106116637e+17;0.0;90;234
Ti-44;1892164415.04;1.9952145115862098e-13;3.663250270697498e-10;5011992415817940.0;0.0;22;44
Ti-45;11088.0;1.19575933156471e-18;6.251327386002392e-05;8.36288685860764e+20;0.0;22;45
Ti-51;348.0;4.25331421689324e-20;0.0019918022429883486;2.35110774564507e+22;0.0;22;51
Ti-52;102.0;1.271105398152e-20;0.006795560593724954;7.867168225812351e+22;0.0;22;52
Tl-201;262733.76;1.26558111657555e-16;2.6382113229755674e-06;7.90150853945916e+18;0.0;81;201
Tl-202;1057540.32;5.11948590350887e-16;6.55433336631501e-07;1.9533211319414e+18;0.0;81;202
Tl-204;119458683.36;5.8401760490395e-14;5.802400972988133e-09;1.71227714987199e+16;0.0;81;204
Tl-206;252.12;1.24466525554881e-19;0.002749274871330895;8.034288701656299e+21;0.0;81;206
Tl-207;286.2;1.41977008945849e-19;0.002421897905520424;7.04339390880819e+21;0.0;81;207
Tl-208;183.18;9.13102301307781e-20;0.0037839675759359388;1.09516753880454e+22;0.0;81;208
Tm-170;11106716.0256;4.52493804355177e-15;6.24079321882636e-08;2.20997501043145e+17;0.0;69;170
Tm-171;60440005.44;2.47684399276576e-14;1.1468350730842445e-08;4.03739598828488e+16;0.0;69;171
U-230;1797120.0;9.90564959689279e-16;3.856988851940579e-07;1.00952490820358e+18;0.0;92;230
U-231;362880.0;2.00887567702872e-16;1.91012781238962e-06;4.97790884440931e+18;0.0;92;231
U-232;2201259473.28;1.2238755833689899e-12;3.148866314824381e-10;817076517898396.0;0.0;92;232
U-233;5022202608000.0;2.8043240592657502e-09;1.3801657054930695e-13;356592169402.072;0.0;92;233
U-234;7748552880000.0;4.3452473795445204e-09;8.945504938722768e-14;230136494577.398;0.0;92;234
U-235;2.2195478304e+16;1.25000116655228e-05;3.122920673599669e-17;79999925.3407235;0.0;92;235
U-235m;1560.0;8.78558142840355e-19;0.0004443251157435547;1.1382285943728501e+21;0.0;92;235
U-236;747418968000000.0;4.2272133340463e-07;9.273877306254626e-16;2365624634.9005404;0.0;92;236
U-237;583200.0;3.31240864185394e-16;1.1885239721535413e-06;3.01895118665161e+18;0.0;92;237
U-238;1.4090253264e+17;8.03662685233302e-05;4.919337981886436e-18;12443031.365947999;0.0;92;238
U-239;1408.2;8.0656670169864e-19;0.0004922221137338057;1.23982306471862e+21;0.0;92;239
U-240;50760.0;2.9195162900541e-17;1.3655381807721538e-05;3.42522493677015e+19;0.0;92;240
V-47;1956.0;2.2031534966612e-19;0.00035436972421265094;4.53894838246842e+21;0.0;23;47
V-48;1380150.144;1.5876165595463e-16;5.022259234426782e-07;6.29875012317692e+18;0.0;23;48
V-49;28512000.0;3.3481261283812e-15;2.4310717612231527e-08;2.98674530664559e+17;0.0;23;49
V-52;224.7;2.80017042122309e-20;0.003084767158700246;3.57121121064913e+22;0.0;23;52
W-179;2223.0;9.53609439510654e-19;0.0003118070987674068;1.04864733775407e+21;0.0;74;179
W-179m;384.0;1.64726057027481e-19;0.0018050707827081908;6.07068497871693e+21;0.0;74;179
W-181;10452699.648;4.53403735587861e-15;6.631274253561574e-08;2.20553983460998e+17;0.0;74;181
W-183m;5.25;2.3024406321164e-21;0.13202803439237054;4.34321730624082e+23;0.0;74;183
W-185;6488640.0;2.87675883516785e-15;1.0682472452778167e-07;3.47613427922836e+17;0.0;74;185
W-185m;100.0002;4.4335401388974e-20;0.006931457942683567;2.25553388188946e+22;0.0;74;185
W-187;85860.0;3.84778270621359e-17;8.072993018401413e-06;2.59889935672602e+19;0.0;74;187
W-188;6028990.272;2.71631717772866e-15;1.1496903283773374e-07;3.68145520044233e+17;0.0;74;188
Xe-125;60840.0;1.82254082823265e-17;1.1392951685732172e-05;5.48684553184861e+19;0.0;36;125
Xe-127;3144960.0;9.57187227351923e-16;2.2039936296803306e-07;1.04472768902957e+18;0.0;54;127
Xe-129m;767232.0;2.3718895748814e-16;9.034388301842797e-07;4.21604787419331e+18;0.0;54;129
Xe-131m;1030741.632;3.2359303182902e-16;6.724742253934159e-07;3.09030140218959e+18;0.0;54;131
Xe-133;453081.6;1.44412941527008e-16;1.529850650655302e-06;6.92458715559768e+18;0.0;54;133
Xe-133m;189043.2;6.02546750688585e-17;3.666607318115358e-06;1.65962225977853e+19;0.0;54;133
Xe-134;3.469023072e+23;111.401242405699;1.998104844429081e-24;8.97656056974856;0.0;54;134
Xe-135;32904.0;1.06453639193196e-17;2.1065742176025568e-05;9.39376058516103e+19;0.0;54;135
Xe-135m;917.4;2.96804548370527e-19;0.0007555561157182748;3.36922060490668e+21;0.0;54;135
Xe-136;6.62271768e+27;2158505.69063711;1.0466204571171534e-28;0.000463283467047446;0.0;54;136
Xe-137;229.08;7.5211766537305e-20;0.0030257865398984865;1.3295791949042999e+22;0.0;54;137
Xe-138;844.8;2.79390116835438e-19;0.0008204867194128141;3.57922467453996e+21;0.0;54;138
Xe-139;39.68;1.32179623786111e-20;0.017468426929434105;7.565462598215351e+22;0.0;54;139
Xe-140;13.6;4.56294245490463e-21;0.050966704452937155;2.1915682914763e+23;0.0;54;140
Xe-141;1.73;5.84579071966852e-22;0.4006631101502574;1.71063256957769e+24;0.0;54;141
Y-86;53064.0;1.09364528071046e-17;1.3062475134930372e-05;9.143732594451261e+19;0.0;39;86
Y-86m;2880.0;5.93565959680031e-19;0.0002406761043610921;1.6847327305276402e+21;0.0;39;86
Y-87;287280.0;5.98966719720143e-17;2.412793026176362e-06;1.66954184110134e+19;0.0;39;87
Y-88;9212749.92;1.94289800462294e-15;7.52378156987838e-08;5.14695057393953e+17;0.0;39;88
Y-89m;15.663;3.34074250143605e-21;0.04425379432803073;2.9933465376937602e+23;0.0;39;89
Y-90;230759.712;4.97714788912673e-17;3.0037616815882717e-06;2.0091828136846e+19;0.0;39;90
Y-91;5055259.68;1.10246017348425e-15;1.3711406029293144e-07;9.07062245014777e+17;0.0;39;91
Y-91m;2982.6;6.50450802051401e-19;0.00023239696256955185;1.5373952908447302e+21;0.0;39;91
Y-92;12744.0;2.80977560681094e-18;5.439008008160274e-05;3.55900306620922e+20;0.0;39;92
Y-93;36648.0;8.16791623063187e-18;1.891364277886775e-05;1.22430246805144e+20;0.0;39;93
Y-94;1122.0;2.5275441955561e-19;0.0006177782357931777;3.9564095526329e+21;0.0;39;94
Y-95;618.0;1.40698714037527e-19;0.001121597379546837;7.10738549986522e+21;0.0;39;95
Yb-169;2766360.384;1.12040105454341e-15;2.505628639597903e-07;8.92537539075703e+17;0.0;70;169
Zn-60;142.8;2.05332410470708e-20;0.004853971852660681;4.87015175883622e+22;0.0;30;60
Zn-61;89.1;1.30252355759728e-20;0.007779429635914089;7.67740432921358e+22;0.0;30;61
Zn-62;33336.0;4.95316989493458e-18;2.0792751996638628e-05;2.01890914548007e+20;0.0;30;62
Zn-63;2304.0;3.47857260091553e-19;0.00030084513045136515;2.87474235764638e+21;0.0;30;63
Zn-65;21094599.744;3.28596318706548e-15;3.285898708540792e-08;3.04324772698701e+17;0.0;30;65
Zn-69;3384.0;5.59573955593703e-19;0.00020483072711582307;1.7870738800539898e+21;0.0;30;69
Zn-69m;49608.0;8.20311607242684e-18;1.3972487916463984e-05;1.21904894575526e+20;0.0;30;69
Zn-71m;14256.0;2.42568321545985e-18;4.862143522446305e-05;4.12254985987701e+20;0.0;30;71
Zr-86;59400.0;1.22422979184006e-17;1.1669144453871133e-05;8.16840111770979e+19;0.0;40;86
Zr-88;7171200.0;1.51235084982661e-15;9.665707002453499e-08;6.61222229031478e+17;0.0;40;88
Zr-89;282240.288;6.0198692826352e-17;2.455876109933481e-06;1.66116563840444e+19;0.0;40;89
Zr-89m;250.8;5.34928314729082e-20;0.0027637447390747418;1.8694093628348301e+22;0.0;40;89
Zr-93;48250080000000.0;1.07537276675749e-08;1.4365720856005735e-14;92991010272.2092;0.0;40;93
Zr-95;5532359.616;1.25954026466722e-15;1.2528961034190754e-07;7.93940478166614e+17;0.0;40;95
Zr-95+;5533004.16;1.25968700659593e-15;1.2527501525680135e-07;7.93847991416783e+17;0.0;40;95
Zr-97;60278.4;1.40123668256046e-17;1.149909719833216e-05;7.13655310659377e+19;0.0;40;97
