<?xml version="1.0" encoding="UTF-8" standalone="no"?>
<!-- Generator: Adobe Illustrator 17.0.0, SVG Export Plug-In . SVG Version: 6.00 Build 0)  -->

<svg
   xmlns:dc="http://purl.org/dc/elements/1.1/"
   xmlns:cc="http://creativecommons.org/ns#"
   xmlns:rdf="http://www.w3.org/1999/02/22-rdf-syntax-ns#"
   xmlns:svg="http://www.w3.org/2000/svg"
   xmlns="http://www.w3.org/2000/svg"
   xmlns:sodipodi="http://sodipodi.sourceforge.net/DTD/sodipodi-0.dtd"
   xmlns:inkscape="http://www.inkscape.org/namespaces/inkscape"
   version="1.1"
   id="Layer_1"
   x="0px"
   y="0px"
   width="64"
   height="64"
   viewBox="0 0 64.000003 64.000001"
   enable-background="new 0 0 500 500"
   xml:space="preserve"
   inkscape:version="0.91 r13725"
   sodipodi:docname="valider.svg"><metadata
     id="metadata9"><rdf:RDF><cc:Work
         rdf:about=""><dc:format>image/svg+xml</dc:format><dc:type
           rdf:resource="http://purl.org/dc/dcmitype/StillImage" /><dc:title></dc:title></cc:Work></rdf:RDF></metadata><defs
     id="defs7" /><sodipodi:namedview
     pagecolor="#ffffff"
     bordercolor="#666666"
     borderopacity="1"
     objecttolerance="10"
     gridtolerance="10"
     guidetolerance="10"
     inkscape:pageopacity="0"
     inkscape:pageshadow="2"
     inkscape:window-width="1138"
     inkscape:window-height="806"
     id="namedview5"
     showgrid="false"
     units="px"
     inkscape:zoom="4.3125"
     inkscape:cx="25.608206"
     inkscape:cy="37.097231"
     inkscape:window-x="2286"
     inkscape:window-y="212"
     inkscape:window-maximized="0"
     inkscape:current-layer="Layer_1" /><path
     d="m 32,62.999999 c -2.852,0 -5.60061,-0.372 -8.246,-1.116 -2.64539,-0.744179 -5.115,-1.787607 -7.409,-3.131 -2.294,-1.343393 -4.381393,-2.955393 -6.262,-4.836 -1.8806072,-1.880428 -3.4926072,-3.968 -4.8360002,-6.262 -1.343393,-2.294179 -2.387,-4.763606 -3.131,-7.408999 -0.744,-2.645393 -1.11599995,-5.394 -1.11599995,-8.246 0,-2.852 0.37199995,-5.600607 1.11599995,-8.246 0.744,-2.645393 1.787607,-5.115 3.131,-7.409 1.343393,-2.294 2.955393,-4.381393 4.8360002,-6.262 1.880607,-1.8806063 3.968,-3.4926063 6.262,-4.8359993 2.294,-1.343393 4.76361,-2.387 7.409,-3.131 2.64539,-0.744 5.394,-1.116 8.246,-1.116 4.25739,0 8.277,0.816393 12.059,2.449 3.782,1.632607 7.068,3.844 9.858,6.6339993 2.79,2.79 5.00139,6.076 6.634,9.858 C 62.18361,23.723 63,27.742607 63,32 c 0,2.852 -0.372,5.600607 -1.116,8.246 -0.74418,2.645213 -1.78761,5.11482 -3.131,7.408999 -1.34339,2.294 -2.95539,4.381393 -4.836,6.262 -1.88043,1.880607 -3.968,3.492786 -6.262,4.836 -2.29418,1.343393 -4.76361,2.387 -7.40918,3.131 -2.64521,0.744 -5.39382,1.116 -8.24582,1.116 z M 51.034,23.258 46.074,18.236 c -0.16539,-0.165393 -0.39261,-0.248 -0.68182,-0.248 -0.28939,0 -0.51679,0.08261 -0.682,0.248 L 25.242,37.704 19.29,31.69 c -0.454607,-0.372 -0.909393,-0.372 -1.364,0 l -4.96,5.022 c -0.165393,0.165393 -0.248,0.392607 -0.248,0.682 0,0.248 0.08261,0.454607 0.248,0.62 L 24.56,49.607999 c 0.20661,0.206607 0.434,0.310179 0.682,0.310179 l 0.062,0 c 0.28939,0 0.496,-0.103393 0.62,-0.310179 L 51.034,24.56 c 0.20661,-0.206607 0.31018,-0.434 0.31018,-0.682 C 51.344,23.63 51.24061,23.423393 51.034,23.258 Z"
     id="path3"
     style="fill:#49a018;stroke:#ffffff;stroke-width:2;stroke-miterlimit:4;stroke-dasharray:none;stroke-opacity:1"
     inkscape:connector-curvature="0" /></svg>
