<?xml version="1.0" encoding="UTF-8" standalone="no"?>
<!-- Created with Sodipodi ("http://www.sodipodi.com/") -->

<svg
   xmlns:dc="http://purl.org/dc/elements/1.1/"
   xmlns:cc="http://creativecommons.org/ns#"
   xmlns:rdf="http://www.w3.org/1999/02/22-rdf-syntax-ns#"
   xmlns:svg="http://www.w3.org/2000/svg"
   xmlns="http://www.w3.org/2000/svg"
   xmlns:sodipodi="http://sodipodi.sourceforge.net/DTD/sodipodi-0.dtd"
   xmlns:inkscape="http://www.inkscape.org/namespaces/inkscape"
   id="svg677"
   sodipodi:version="0.32"
   width="100"
   height="100"
   sodipodi:docname="bus_mauve.svg"
   inkscape:version="0.91 r13725"
   inkscape:export-filename="/home/srml/citymap/Bus.png"
   inkscape:export-xdpi="72.000000"
   inkscape:export-ydpi="72.000000"
   version="1.1">
  <metadata
     id="metadata2014">
    <rdf:RDF>
      <cc:Work
         rdf:about="">
        <dc:format>image/svg+xml</dc:format>
        <dc:type
           rdf:resource="http://purl.org/dc/dcmitype/StillImage" />
        <dc:title></dc:title>
      </cc:Work>
    </rdf:RDF>
  </metadata>
  <defs
     id="defs679" />
  <sodipodi:namedview
     id="base"
     snaptogrid="true"
     showgrid="true"
     inkscape:zoom="5.6568542"
     inkscape:cx="37.368217"
     inkscape:cy="59.137488"
     inkscape:window-width="1346"
     inkscape:window-height="991"
     inkscape:window-x="2194"
     inkscape:window-y="67"
     inkscape:current-layer="svg677"
     inkscape:window-maximized="0" />
  <rect
     style="font-size:12px;fill:#dd55ff;fill-opacity:1;stroke:#dd55ff;stroke-width:9.86703682;stroke-dashoffset:3.75;stroke-opacity:1"
     id="rect2024"
     width="65.82621"
     height="62.929985"
     x="17.086895"
     y="12.546686"
     rx="3.7680111"
     ry="3.4977298" />
  <rect
     ry="3.1927199"
     rx="3.3344035"
     y="57.776875"
     x="18.621815"
     height="9.3121014"
     width="13.1194"
     id="rect1295"
     style="font-size:12px;fill:#ffffff;stroke-width:7.5;stroke-dashoffset:3.75" />
  <rect
     ry="3.1927199"
     rx="3.3344035"
     y="57.776875"
     x="68.445999"
     height="9.3121014"
     width="13.1194"
     id="rect2056"
     style="font-size:12px;fill:#ffffff;stroke-width:7.5;stroke-dashoffset:3.75" />
  <rect
     rx="1.0634165"
     ry="1.0642405"
     y="20.939978"
     x="19.441017"
     height="26.289459"
     width="29.192955"
     id="rect611"
     style="font-size:12px;fill:#ffffff;fill-rule:evenodd" />
  <rect
     rx="1.0634165"
     ry="1.0642405"
     y="20.939978"
     x="51.553272"
     height="26.289459"
     width="29.192955"
     id="rect4844"
     style="font-size:12px;fill:#ffffff;fill-rule:evenodd" />
  <rect
     y="11.245691"
     height="7.0117388"
     ry="1.5581642"
     rx="1.5569578"
     x="23.738615"
     width="52.52277"
     id="rect620"
     style="font-size:12px;fill:#ffffff;fill-rule:evenodd" />
  <g
     transform="matrix(0.77847893,0,0,0.7790821,1.4322505,0.33854269)"
     id="g623"
     style="fill:#dd55ff;fill-opacity:1;stroke:#dd55ff;stroke-width:1.28405893;stroke-opacity:1">
    <rect
       width="12"
       ry="2.6666667"
       rx="2"
       y="98.580444"
       x="24.842272"
       height="18.927441"
       id="rect621"
       style="font-size:12px;fill:#dd55ff;fill-opacity:1;fill-rule:evenodd;stroke:#dd55ff;stroke-width:1.28405893;stroke-opacity:1" />
    <rect
       width="12"
       ry="2.6666667"
       rx="2"
       y="98.580444"
       x="87.933739"
       height="18.927441"
       id="rect622"
       style="font-size:12px;fill:#dd55ff;fill-opacity:1;fill-rule:evenodd;stroke:#dd55ff;stroke-width:1.28405893;stroke-opacity:1" />
  </g>
</svg>
