<?xml version="1.0" encoding="UTF-8" standalone="no"?>
<svg
   xmlns:dc="http://purl.org/dc/elements/1.1/"
   xmlns:cc="http://creativecommons.org/ns#"
   xmlns:rdf="http://www.w3.org/1999/02/22-rdf-syntax-ns#"
   xmlns:svg="http://www.w3.org/2000/svg"
   xmlns="http://www.w3.org/2000/svg"
   xmlns:sodipodi="http://sodipodi.sourceforge.net/DTD/sodipodi-0.dtd"
   xmlns:inkscape="http://www.inkscape.org/namespaces/inkscape"
   width="100"
   height="100"
   id="svg2"
   version="1.1"
   inkscape:version="0.48.5 r10040"
   sodipodi:docname="metro.svg">
  <defs
     id="defs12" />
  <sodipodi:namedview
     pagecolor="#ffffff"
     bordercolor="#666666"
     borderopacity="1"
     objecttolerance="10"
     gridtolerance="10"
     guidetolerance="10"
     inkscape:pageopacity="0"
     inkscape:pageshadow="2"
     inkscape:window-width="985"
     inkscape:window-height="802"
     id="namedview10"
     showgrid="false"
     inkscape:zoom="4.0028495"
     inkscape:cx="53.014171"
     inkscape:cy="52.650724"
     inkscape:window-x="2712"
     inkscape:window-y="92"
     inkscape:window-maximized="0"
     inkscape:current-layer="svg2" />
  <metadata
     id="metadata3">AIGA_Symbol_SignsEPS converted from  http://aiga.orgsymbolmapsymOpen Clip Art LibraryJean-Victor BalinJean-Victor Balinimage/svg+xmlen<rdf:RDF>
  <cc:Work
     rdf:about="">
    <dc:format>image/svg+xml</dc:format>
    <dc:type
       rdf:resource="http://purl.org/dc/dcmitype/StillImage" />
  </cc:Work>
</rdf:RDF>
</metadata>
  <path
     inkscape:connector-curvature="0"
     style="fill:#0000ff;fill-opacity:1"
     id="path2229"
     d="m 50.07913,2.1607325 -20.844684,0.013863 c -9.707808,0 -16.853343,6.134108 -16.853343,12.8166225 l 0,47.33086 c 0,6.474017 6.440804,11.78842 12.914733,12.609129 l -19.4116632,22.90806 11.2003852,0 13.890598,-16.01214 19.007266,0 0.01757,0 0.0176,0 19.007256,0 13.890602,16.01214 11.200377,0 -19.411659,-22.90806 c 6.473928,-0.820709 12.914746,-6.135112 12.914746,-12.609129 l 0,-47.33086 c 0,-6.6825149 -7.145544,-12.8166229 -16.853345,-12.8166229 L 50.079131,2.1607325 z m -8.25524,2.7459306 8.158532,0 0.01757,0 0.0176,0 8.158521,0 c 1.476963,0 2.760543,0.9752511 2.760543,2.1372473 l 0,3.7626806 c 0,1.162005 -1.21324,2.158005 -2.760543,2.158005 l -8.158521,0 -0.0176,0 -0.01757,0 -8.158532,0 c -1.547315,0 -2.760532,-0.996 -2.760532,-2.158005 l 0,-3.7626806 c 0,-1.1619962 1.283556,-2.1372473 2.760532,-2.1372473 z m -12.026793,10.6101959 20.185325,0 0.03517,0 20.185312,0 c 5.485907,0 8.395904,3.091749 8.395904,6.633099 l 0,8.521353 c 0.04274,4.094681 -3.753981,6.598514 -8.395904,6.598514 l -20.185312,0 -0.0176,0 -0.01757,0 -20.185325,0 c -4.641921,0 -8.438659,-2.503833 -8.3959,-6.598514 l 0,-8.521353 c 0,-3.54135 2.909997,-6.633099 8.3959,-6.633099 z m -0.914312,40.884524 c 4.08066,0 7.384869,2.599556 7.384869,5.810017 0,3.210221 -3.304209,5.810008 -7.384869,5.810008 -4.080671,0 -7.38488,-2.599787 -7.38488,-5.810008 0,-3.210461 3.304209,-5.810017 7.38488,-5.810017 z m 42.058613,0 c 4.080671,0 7.393667,2.599556 7.393667,5.810017 0,3.210221 -3.312996,5.810008 -7.393667,5.810008 -4.080671,0 -7.38488,-2.599787 -7.38488,-5.810008 0,-3.210461 3.304209,-5.810017 7.38488,-5.810017 z" />
</svg>
