<?xml version="1.0" encoding="UTF-8" standalone="no"?>
<!-- Created with Inkscape (http://www.inkscape.org/) -->

<svg
   xmlns:dc="http://purl.org/dc/elements/1.1/"
   xmlns:cc="http://creativecommons.org/ns#"
   xmlns:rdf="http://www.w3.org/1999/02/22-rdf-syntax-ns#"
   xmlns:svg="http://www.w3.org/2000/svg"
   xmlns="http://www.w3.org/2000/svg"
   xmlns:sodipodi="http://sodipodi.sourceforge.net/DTD/sodipodi-0.dtd"
   xmlns:inkscape="http://www.inkscape.org/namespaces/inkscape"
   width="64"
   height="64"
   id="svg2"
   version="1.1"
   inkscape:version="0.91 r13725"
   sodipodi:docname="apropos.svg">
  <defs
     id="defs4">
    <linearGradient
       id="linearGradient6545">
      <stop
         style="stop-color:#d3d7cf;stop-opacity:1"
         offset="0"
         id="stop6547" />
      <stop
         style="stop-color:#eeeeec;stop-opacity:1"
         offset="1"
         id="stop6549" />
    </linearGradient>
    <linearGradient
       id="linearGradient6707">
      <stop
         id="stop6709"
         offset="0"
         style="stop-color:#888a85;stop-opacity:1" />
      <stop
         id="stop6711"
         offset="1"
         style="stop-color:#555753;stop-opacity:1" />
    </linearGradient>
    <linearGradient
       id="linearGradient6791">
      <stop
         id="stop6793"
         offset="0"
         style="stop-color:#ffffff;stop-opacity:1;" />
      <stop
         id="stop6795"
         offset="1"
         style="stop-color:#ffffff;stop-opacity:0" />
    </linearGradient>
    <linearGradient
       id="linearGradient6525">
      <stop
         style="stop-color:#ffffff;stop-opacity:1;"
         offset="0"
         id="stop6527" />
      <stop
         style="stop-color:#babdb6;stop-opacity:1"
         offset="1"
         id="stop6529" />
    </linearGradient>
  </defs>
  <sodipodi:namedview
     id="base"
     pagecolor="#ffffff"
     bordercolor="#666666"
     borderopacity="1.0"
     inkscape:pageopacity="0.0"
     inkscape:pageshadow="2"
     inkscape:zoom="5.6000001"
     inkscape:cx="20.051228"
     inkscape:cy="27.827496"
     inkscape:document-units="px"
     inkscape:current-layer="layer1"
     showgrid="false"
     inkscape:window-width="1362"
     inkscape:window-height="836"
     inkscape:window-x="2130"
     inkscape:window-y="138"
     inkscape:window-maximized="0" />
  <metadata
     id="metadata7">
    <rdf:RDF>
      <cc:Work
         rdf:about="">
        <dc:format>image/svg+xml</dc:format>
        <dc:type
           rdf:resource="http://purl.org/dc/dcmitype/StillImage" />
        <dc:title />
      </cc:Work>
    </rdf:RDF>
  </metadata>
  <g
     inkscape:label="Calque 1"
     inkscape:groupmode="layer"
     id="layer1"
     transform="translate(0,-988.36218)">
    <path
       inkscape:connector-curvature="0"
       id="path4168"
       style="font-style:normal;font-variant:normal;font-weight:bold;font-stretch:normal;font-size:medium;line-height:125%;font-family:'Arial Narrow';-inkscape-font-specification:'Arial Narrow Bold';text-align:start;letter-spacing:0px;word-spacing:0px;writing-mode:lr-tb;text-anchor:start;fill:#ff5555;fill-opacity:1;stroke:none;stroke-width:2.04871058;stroke-miterlimit:4;stroke-dasharray:none"
       d="m 1.0322561,1020.7298 q 0,-10.7039 1.7540794,-17.6083 1.7768597,-6.94524 4.6243911,-10.33617 2.8475314,-3.39092 6.9024164,-3.39092 5.877304,0 9.567706,8.04834 3.713181,8.04835 3.713181,22.91935 0,15.0345 -3.918203,23.4914 -3.439819,7.4764 -9.339904,7.4764 -5.9456458,0 -9.3854636,-7.3947 -3.9182033,-8.4569 -3.9182033,-23.2054 z m 5.695063,-0.4085 q 0,10.3362 2.186904,15.5247 2.1869049,5.1477 5.4216999,5.1477 3.257576,0 5.39892,-5.1068 2.141343,-5.1477 2.141343,-15.7699 0,-10.4179 -2.095782,-15.4021 -2.073004,-4.98429 -5.444481,-4.98429 -3.371477,0 -5.4900407,5.02509 -2.1185632,5.0251 -2.1185632,15.5656 z" />
    <path
       inkscape:connector-curvature="0"
       id="path4165"
       style="font-style:normal;font-variant:normal;font-weight:bold;font-stretch:normal;font-size:medium;line-height:125%;font-family:'Arial Narrow';-inkscape-font-specification:'Arial Narrow Bold';text-align:start;letter-spacing:0px;word-spacing:0px;writing-mode:lr-tb;text-anchor:start;fill:#666666;fill-opacity:1;stroke:none;stroke-width:2.04871058;stroke-miterlimit:4;stroke-dasharray:none"
       d="m 27.256971,989.39441 3.872642,0 6.856856,61.93549 -3.940984,0 -6.788514,-61.93549 z" />
    <path
       inkscape:connector-curvature="0"
       id="path4162"
       style="font-style:normal;font-variant:normal;font-weight:bold;font-stretch:normal;font-size:medium;line-height:125%;font-family:'Arial Narrow';-inkscape-font-specification:'Arial Narrow Bold';text-align:start;letter-spacing:0px;word-spacing:0px;writing-mode:lr-tb;text-anchor:start;fill:#5599ff;fill-opacity:1;stroke:none;stroke-width:2.04871058;stroke-miterlimit:4;stroke-dasharray:none"
       d="m 40.005244,990.41576 10.091652,0 q 3.827082,0 5.763403,1.55248 1.959102,1.51162 3.59928,5.14767 1.640178,3.63609 2.574169,9.43739 0.93399,5.8014 0.93399,14.4217 0,7.7623 -0.979551,13.5228 -0.979551,5.7197 -2.483048,9.0697 -1.503496,3.3501 -3.64484,5.066 -2.118563,1.675 -5.46726,1.675 l -10.387795,0 0,-59.89274 z m 5.512821,10.13194 0,39.6698 4.146006,0 q 2.665289,0 3.849863,-0.8988 1.207353,-0.8988 1.959101,-2.6965 0.774529,-1.8384 1.275694,-5.7604 0.501166,-3.9221 0.501166,-10.3362 0,-6.6593 -0.523946,-10.4997 -0.501166,-3.8403 -1.594618,-6.0464 -1.070671,-2.2062 -2.619729,-2.9007 -1.161793,-0.5311 -4.487709,-0.5311 l -2.505828,0 z" />
    <path
       inkscape:connector-curvature="0"
       id="path4174"
       style="font-style:normal;font-variant:normal;font-weight:900;font-stretch:normal;font-size:72px;line-height:125%;font-family:'Arial Black';-inkscape-font-specification:'Arial Black, Heavy';text-align:start;letter-spacing:0px;word-spacing:0px;writing-mode:lr-tb;text-anchor:start;fill:#4d4d4d;fill-opacity:1;stroke:#ffffff;stroke-width:3.20000005;stroke-miterlimit:4;stroke-dasharray:none;stroke-opacity:1"
       d="m 24.484425,995.83141 15.031149,0 0,9.27019 -15.031149,0 0,-9.27019 z m 0,13.52039 15.031149,0 0,35.5412 -15.031149,0 0,-35.5412 z" />
    <rect
       style="color:#000000;fill:#ffffff;fill-opacity:1;fill-rule:nonzero;stroke:#ffffff;stroke-width:0;stroke-linecap:butt;stroke-linejoin:miter;stroke-miterlimit:0;stroke-opacity:1;stroke-dasharray:none;stroke-dashoffset:5.4688558;marker:none;visibility:visible;display:inline;overflow:visible;enable-background:accumulate"
       id="rect3775"
       width="18.214314"
       height="4.9244938"
       x="22.892843"
       y="1004.1274"
       rx="1.0341091"
       ry="0.99535924" />
  </g>
</svg>
