{
"type": "FeatureCollection",
"name": "adr_voie_lieu.adrgarefer",
"crs": { "type": "name", "properties": { "name": "urn:ogc:def:crs:EPSG::2154" } },
"features": [
{ "type": "Feature", "properties": { "nom": "Gare de Collonges-Fontaines", "theme": "DEPLACEMENT", "soustheme": "Gare ferroviaire", "identifiant": "S5127", "idexterne": "87721225", "siret": "", "datecreation": "2009-04-15T00:00:00Z", "gid": 3210 }, "geometry": { "type": "Polygon", "coordinates": [ [ [ 843342.427719269413501, 6527177.871544883586466 ], [ 843345.086287391604856, 6527174.464795074425638 ], [ 843357.589787541655824, 6527157.281006403267384 ], [ 843363.544247563928366, 6527161.229060663841665 ], [ 843351.240576022071764, 6527178.4728416018188 ], [ 843348.842800768907182, 6527176.913600830361247 ], [ 843346.204166417010128, 6527180.570155583322048 ], [ 843345.115183159941807, 6527179.830525489524007 ], [ 843342.427719269413501, 6527177.871544883586466 ] ] ] } },
{ "type": "Feature", "properties": { "nom": "Gare de Crépieux-la-Pape", "theme": "DEPLACEMENT", "soustheme": "Gare ferroviaire", "identifiant": "S5128", "idexterne": "87723502", "siret": "", "datecreation": "2009-04-15T00:00:00Z", "gid": 3211 }, "geometry": { "type": "Polygon", "coordinates": [ [ [ 846954.552569729043171, 6524452.954216852784157 ], [ 846958.121536994469352, 6524444.251853405497968 ], [ 846964.096250919508748, 6524446.910978868603706 ], [ 846960.497327977325767, 6524455.513415296562016 ], [ 846954.552569729043171, 6524452.954216852784157 ] ] ] } },
{ "type": "Feature", "properties": { "nom": "Gare de Lyon Part-Dieu", "theme": "DEPLACEMENT", "soustheme": "Gare ferroviaire", "identifiant": "S5129", "idexterne": "87723197", "siret": "55204944759820", "datecreation": "2009-04-15T00:00:00Z", "gid": 3212 }, "geometry": { "type": "Polygon", "coordinates": [ [ [ 844505.586136646801606, 6519566.280799249187112 ], [ 844681.138350446941331, 6519565.247249186970294 ], [ 844681.147091275430284, 6519571.412404724396765 ], [ 844681.345607818104327, 6519577.947308106347919 ], [ 844681.741760700242594, 6519595.353705501183867 ], [ 844681.980077472748235, 6519602.717964776791632 ], [ 844682.07888955285307, 6519608.183688128367066 ], [ 844506.565601562731899, 6519614.413160845637321 ], [ 844506.080868241726421, 6519590.331993249244988 ], [ 844505.586136646801606, 6519566.280799249187112 ] ] ] } },
{ "type": "Feature", "properties": { "nom": "Gare de Sathonay-Rillieux", "theme": "DEPLACEMENT", "soustheme": "Gare ferroviaire", "identifiant": "S5130", "idexterne": "87723700", "siret": "55204944760216", "datecreation": "2009-04-15T00:00:00Z", "gid": 3213 }, "geometry": { "type": "Polygon", "coordinates": [ [ [ 845583.006119085475802, 6526231.739723327569664 ], [ 845588.393103775335476, 6526225.535760183818638 ], [ 845609.782037421362475, 6526245.344381394796073 ], [ 845604.285142161766998, 6526251.53832967672497 ], [ 845583.006119085475802, 6526231.739723327569664 ] ] ] } },
{ "type": "Feature", "properties": { "nom": "Gare de Feyzin", "theme": "DEPLACEMENT", "soustheme": "Gare ferroviaire", "identifiant": "S5136", "idexterne": "87722538", "siret": "41228073716662", "datecreation": "2009-05-13T00:00:00Z", "gid": 3344 }, "geometry": { "type": "Polygon", "coordinates": [ [ [ 844271.589951047673821, 6509041.918672855943441 ], [ 844274.625197298708372, 6509053.850083530880511 ], [ 844267.58027803665027, 6509055.597311337478459 ], [ 844264.62497405288741, 6509043.645932288840413 ], [ 844271.589951047673821, 6509041.918672855943441 ] ] ] } },
{ "type": "Feature", "properties": { "nom": "Gare de Givors Canal", "theme": "DEPLACEMENT", "soustheme": "Gare ferroviaire", "identifiant": "S5137", "idexterne": "87722439", "siret": "55204944760570", "datecreation": "2009-05-13T00:00:00Z", "gid": 3345 }, "geometry": { "type": "Polygon", "coordinates": [ [ [ 838176.607459635473788, 6501106.920205530710518 ], [ 838208.154751420719549, 6501151.992033353075385 ], [ 838203.137473020935431, 6501157.64676246419549 ], [ 838199.149636007612571, 6501162.142572047188878 ], [ 838156.747503180522472, 6501133.076474718749523 ], [ 838153.430464372155257, 6501130.807558651082218 ], [ 838159.217516587115824, 6501123.29439106862992 ], [ 838158.33835521293804, 6501122.414889854378998 ], [ 838168.082977731712162, 6501111.904766536317766 ], [ 838168.882248173933476, 6501112.534442296251655 ], [ 838176.607459635473788, 6501106.920205530710518 ] ] ] } },
{ "type": "Feature", "properties": { "nom": "Gare de Givors Ville", "theme": "DEPLACEMENT", "soustheme": "Gare ferroviaire", "identifiant": "S5138", "idexterne": "87722405", "siret": "55204944762808", "datecreation": "2009-05-13T00:00:00Z", "gid": 3346 }, "geometry": { "type": "Polygon", "coordinates": [ [ [ 837735.947765034623444, 6499938.612567373551428 ], [ 837729.760428199311718, 6499949.153376421891153 ], [ 837691.343943368643522, 6499926.503159491345286 ], [ 837683.081147067248821, 6499921.655245806090534 ], [ 837689.188515231246129, 6499911.264306836761534 ], [ 837735.947765034623444, 6499938.612567373551428 ] ] ] } },
{ "type": "Feature", "properties": { "nom": "Gare de Saint-Priest", "theme": "DEPLACEMENT", "soustheme": "Gare ferroviaire", "identifiant": "S5141", "idexterne": "87723353", "siret": "55204944759945", "datecreation": "2009-05-14T00:00:00Z", "gid": 3416 }, "geometry": { "type": "Polygon", "coordinates": [ [ [ 850541.982452042750083, 6511513.943610960617661 ], [ 850544.290929602575488, 6511512.685073043219745 ], [ 850546.418467448675074, 6511516.542534225620329 ], [ 850544.099993422627449, 6511517.821054538711905 ], [ 850544.71927959669847, 6511518.930326033383608 ], [ 850534.645899553084746, 6511524.533859452232718 ], [ 850533.467265988932922, 6511522.385274955071509 ], [ 850531.469583215308376, 6511518.737678696401417 ], [ 850541.522983008879237, 6511513.114156452007592 ], [ 850541.982452042750083, 6511513.943610960617661 ] ] ] } },
{ "type": "Feature", "properties": { "nom": "Gare de Saint-Fons", "theme": "DEPLACEMENT", "soustheme": "Gare ferroviaire", "identifiant": "S5142", "idexterne": "87728501", "siret": "", "datecreation": "2009-05-14T00:00:00Z", "gid": 3417 }, "geometry": { "type": "Polygon", "coordinates": [ [ [ 844120.613084556418471, 6513512.38596508000046 ], [ 844127.434373038006015, 6513479.772703032940626 ], [ 844136.456955208210275, 6513481.762979436665773 ], [ 844129.705626065493561, 6513514.30630983505398 ], [ 844120.613084556418471, 6513512.38596508000046 ] ] ] } },
{ "type": "Feature", "properties": { "nom": "Halte Ferroviaire de Pierre-Bénite", "theme": "DEPLACEMENT", "soustheme": "Gare ferroviaire", "identifiant": "S5143", "idexterne": "87722231", "siret": "", "datecreation": "2009-05-14T00:00:00Z", "gid": 3418 }, "geometry": { "type": "Polygon", "coordinates": [ [ [ 841957.151177298044786, 6513533.865225032903254 ], [ 841942.530578824691474, 6513543.754623145796359 ], [ 841940.452785638161004, 6513540.786517807282507 ], [ 841955.0634137801826, 6513530.787203105166554 ], [ 841957.151177298044786, 6513533.865225032903254 ] ], [ [ 841958.317466997425072, 6513547.944507734850049 ], [ 841956.029831124702469, 6513545.006337305530906 ], [ 841969.841190459090285, 6513534.457291346974671 ], [ 841972.068878903519362, 6513537.365473250858486 ], [ 841958.317466997425072, 6513547.944507734850049 ] ] ] } },
{ "type": "Feature", "properties": { "nom": "Gare d'Oullins", "theme": "DEPLACEMENT", "soustheme": "Gare ferroviaire", "identifiant": "S5145", "idexterne": "87722207", "siret": "", "datecreation": "2009-05-14T00:00:00Z", "gid": 3449 }, "geometry": { "type": "Polygon", "coordinates": [ [ [ 841023.274025548947975, 6514713.941146468743682 ], [ 841029.884406608878635, 6514685.974250520579517 ], [ 841036.728777681477368, 6514687.464443294331431 ], [ 841030.058439142652787, 6514715.45131169538945 ], [ 841023.274025548947975, 6514713.941146468743682 ] ] ] } },
{ "type": "Feature", "properties": { "nom": "Gare de Lyon Saint-Paul", "theme": "DEPLACEMENT", "soustheme": "Gare ferroviaire", "identifiant": "S5146", "idexterne": "87721159", "siret": "55204944760471", "datecreation": "2009-05-14T00:00:00Z", "gid": 3450 }, "geometry": { "type": "Polygon", "coordinates": [ [ [ 841994.238690149970353, 6520126.315231155604124 ], [ 841993.037378457025625, 6520137.636082714423537 ], [ 841992.537781598861329, 6520137.586022505536675 ], [ 841991.626763421692885, 6520146.288991961628199 ], [ 841977.905237790197134, 6520157.947081777267158 ], [ 841977.58556507457979, 6520157.567316919565201 ], [ 841971.421846224460751, 6520150.391735249198973 ], [ 841978.217629264923744, 6520144.717555380426347 ], [ 841962.253967082826421, 6520125.779276749119163 ], [ 841959.035959851229563, 6520128.486504882574081 ], [ 841954.49059651629068, 6520123.169782847166061 ], [ 841945.496151462313719, 6520130.811976185999811 ], [ 841942.898743239464238, 6520128.063621324487031 ], [ 841941.810666942968965, 6520122.707619330845773 ], [ 841954.411262405454181, 6520120.142149590887129 ], [ 841960.426791248493828, 6520118.824385601095855 ], [ 841960.456739796558395, 6520118.964281482622027 ], [ 841985.347279155044816, 6520118.329742568545043 ], [ 841985.347303040791303, 6520118.209836929105222 ], [ 841994.630057562142611, 6520117.911922039464116 ], [ 841993.7390932837734, 6520126.265170942060649 ], [ 841994.238690149970353, 6520126.315231155604124 ] ] ] } },
{ "type": "Feature", "properties": { "nom": "Gare de Grigny le Sablon", "theme": "DEPLACEMENT", "soustheme": "Gare ferroviaire", "identifiant": "S5147", "idexterne": "87722298", "siret": "", "datecreation": "2009-05-14T00:00:00Z", "gid": 3451 }, "geometry": { "type": "Polygon", "coordinates": [ [ [ 840002.816261514672078, 6502446.725766559131444 ], [ 840018.958871478680521, 6502472.669155633077025 ], [ 840014.941456018015742, 6502475.106510193087161 ], [ 839998.968618628103286, 6502449.662773728370667 ], [ 840002.816261514672078, 6502446.725766559131444 ] ], [ [ 840003.798659493913874, 6502481.689308127388358 ], [ 839988.974851981271058, 6502456.725431579165161 ], [ 839992.542659138794988, 6502454.038179165683687 ], [ 840007.925979345338419, 6502479.311929351650178 ], [ 840003.798659493913874, 6502481.689308127388358 ] ] ] } },
{ "type": "Feature", "properties": { "nom": "Gare de Lyon Gorge-de-Loup", "theme": "DEPLACEMENT", "soustheme": "Gare ferroviaire", "identifiant": "S5149", "idexterne": "87721175", "siret": "55204944762675", "datecreation": "2009-05-15T00:00:00Z", "gid": 3452 }, "geometry": { "type": "Polygon", "coordinates": [ [ [ 840286.679234701558016, 6520092.053799140267074 ], [ 840283.878193580545485, 6520108.53028108086437 ], [ 840219.05154015973676, 6520096.696827531792223 ], [ 840221.762813745532185, 6520079.390980080701411 ], [ 840286.679234701558016, 6520092.053799140267074 ] ] ] } },
{ "type": "Feature", "properties": { "nom": "Gare de Lyon Vaise", "theme": "DEPLACEMENT", "soustheme": "Gare ferroviaire", "identifiant": "S5150", "idexterne": "87721001", "siret": "55204944759986", "datecreation": "2009-05-15T00:00:00Z", "gid": 3453 }, "geometry": { "type": "Polygon", "coordinates": [ [ [ 840160.555722239194438, 6521630.316766511648893 ], [ 840145.66572821023874, 6521639.176843953318894 ], [ 840140.191727604018524, 6521630.642501153983176 ], [ 840167.233595685451292, 6521614.350679914467037 ], [ 840168.292698939447291, 6521614.660643815994263 ], [ 840172.399183004628867, 6521616.060347732156515 ], [ 840173.058047373429872, 6521619.188009419478476 ], [ 840180.791246481705457, 6521622.736731568351388 ], [ 840179.111452744691633, 6521628.421914654783905 ], [ 840172.976437774254009, 6521627.691283406689763 ], [ 840167.16083240439184, 6521628.679358839057386 ], [ 840160.555722239194438, 6521630.316766511648893 ] ] ] } },
{ "type": "Feature", "properties": { "nom": "Halte Ferroviaire d'Alai", "theme": "DEPLACEMENT", "soustheme": "Gare ferroviaire", "identifiant": "S5151", "idexterne": "87722744", "siret": "", "datecreation": "2009-05-18T00:00:00Z", "gid": 3454 }, "geometry": { "type": "Polygon", "coordinates": [ [ [ 837739.968662834377028, 6518462.087680298835039 ], [ 837742.269857235369273, 6518498.289715042337775 ], [ 837737.773337942897342, 6518498.538650278933346 ], [ 837734.9924907584209, 6518462.486405284143984 ], [ 837739.968662834377028, 6518462.087680298835039 ] ], [ [ 837728.490517140366137, 6518499.086425644345582 ], [ 837726.728848407743499, 6518463.14429135248065 ], [ 837731.275349943200126, 6518462.785451939329505 ], [ 837732.647301127901301, 6518498.847416875883937 ], [ 837728.490517140366137, 6518499.086425644345582 ] ] ] } },
{ "type": "Feature", "properties": { "nom": "Gare d'Albigny-Neuville", "theme": "DEPLACEMENT", "soustheme": "Gare ferroviaire", "identifiant": "S5153", "idexterne": "87721266", "siret": "55204944762113", "datecreation": "2009-05-18T00:00:00Z", "gid": 3455 }, "geometry": { "type": "Polygon", "coordinates": [ [ [ 842154.551238702028058, 6532245.097373046912253 ], [ 842147.377827423508279, 6532240.989241202361882 ], [ 842160.241945214802399, 6532218.689741436392069 ], [ 842167.245523168472573, 6532222.647960087284446 ], [ 842154.551238702028058, 6532245.097373046912253 ] ] ] } },
{ "type": "Feature", "properties": { "nom": "Halte Ferroviaire du Casino-la-Croix-Laval", "theme": "DEPLACEMENT", "soustheme": "Gare ferroviaire", "identifiant": "S5154", "idexterne": "87208553", "siret": "", "datecreation": "2009-05-18T00:00:00Z", "gid": 3456 }, "geometry": { "type": "Polygon", "coordinates": [ [ [ 834465.46683307911735, 6522389.958484445698559 ], [ 834462.13994764641393, 6522387.389886195771396 ], [ 834468.716180430608802, 6522379.817113427445292 ], [ 834471.993054445716552, 6522382.655489069409668 ], [ 834465.46683307911735, 6522389.958484445698559 ] ] ] } },
{ "type": "Feature", "properties": { "nom": "Gare de Charbonnières-les-Bains", "theme": "DEPLACEMENT", "soustheme": "Gare ferroviaire", "identifiant": "S5155", "idexterne": "87721530", "siret": "55204944762485", "datecreation": "2009-05-18T00:00:00Z", "gid": 3457 }, "geometry": { "type": "Polygon", "coordinates": [ [ [ 834861.142816102830693, 6521763.278346745297313 ], [ 834870.438193477224559, 6521748.941425835713744 ], [ 834870.677970108110458, 6521749.121329229325056 ], [ 834872.237174481619149, 6521746.823438639752567 ], [ 834877.122696612030268, 6521750.101776036433876 ], [ 834875.833300040801987, 6521752.289804447442293 ], [ 834876.113031875458546, 6521752.53966018743813 ], [ 834866.677744071232155, 6521766.98646769952029 ], [ 834866.767654159804806, 6521767.086405833251774 ], [ 834862.509817711077631, 6521773.410606519319117 ], [ 834856.795107415411621, 6521769.30276714451611 ], [ 834860.923021805589087, 6521763.10843925178051 ], [ 834861.142816102830693, 6521763.278346745297313 ] ] ] } },
{ "type": "Feature", "properties": { "nom": "Gare de Couzon-au-Mont-d'Or", "theme": "DEPLACEMENT", "soustheme": "Gare ferroviaire", "identifiant": "S5156", "idexterne": "87721241", "siret": "", "datecreation": "2009-05-18T00:00:00Z", "gid": 3458 }, "geometry": { "type": "Polygon", "coordinates": [ [ [ 841973.690573182306252, 6529320.976113492622972 ], [ 841964.88729773031082, 6529322.563086658716202 ], [ 841961.962928177090362, 6529306.075690270401537 ], [ 841970.85601030709222, 6529305.098247434943914 ], [ 841973.690573182306252, 6529320.976113492622972 ] ] ] } },
{ "type": "Feature", "properties": { "nom": "Halte Ferroviaire de Dardilly-le-Jubin", "theme": "DEPLACEMENT", "soustheme": "Gare ferroviaire", "identifiant": "S5157", "idexterne": "87721449", "siret": "", "datecreation": "2009-05-18T00:00:00Z", "gid": 3459 }, "geometry": { "type": "Polygon", "coordinates": [ [ [ 836723.845727943000384, 6525545.947482759132981 ], [ 836742.992661782889627, 6525482.721406274475157 ], [ 836747.388862941297702, 6525484.310987977311015 ], [ 836729.650874255457893, 6525547.19760472048074 ], [ 836728.511825605179183, 6525546.957576606422663 ], [ 836723.845727943000384, 6525545.947482759132981 ] ], [ [ 836762.865484827198088, 6525489.929497729986906 ], [ 836745.837333990959451, 6525550.717917531728745 ], [ 836740.81153761211317, 6525549.627818035893142 ], [ 836757.640000359388068, 6525488.039994888007641 ], [ 836762.865484827198088, 6525489.929497729986906 ] ] ] } },
{ "type": "Feature", "properties": { "nom": "Halte Ferroviaire de Dardilly-les-Mouilles", "theme": "DEPLACEMENT", "soustheme": "Gare ferroviaire", "identifiant": "S5159", "idexterne": "87721480", "siret": "", "datecreation": "2009-05-18T00:00:00Z", "gid": 3460 }, "geometry": { "type": "Polygon", "coordinates": [ [ [ 836695.043021240504459, 6523492.550866670906544 ], [ 836698.010584951145574, 6523493.001080074347556 ], [ 836696.188567964360118, 6523511.016464670188725 ], [ 836692.841270499979146, 6523510.746035993099213 ], [ 836695.043021240504459, 6523492.550866670906544 ] ] ] } },
{ "type": "Feature", "properties": { "nom": "Gare d'Ecully-la-Demi-Lune", "theme": "DEPLACEMENT", "soustheme": "Gare ferroviaire", "identifiant": "S5160", "idexterne": "87721506", "siret": "55204944762634", "datecreation": "2009-05-18T00:00:00Z", "gid": 3461 }, "geometry": { "type": "Polygon", "coordinates": [ [ [ 838303.822901669074781, 6520024.089470664970577 ], [ 838287.626892765169032, 6520017.671376229263842 ], [ 838291.475933965062723, 6520007.010512636043131 ], [ 838307.921874467865564, 6520012.769174694083631 ], [ 838303.822901669074781, 6520024.089470664970577 ] ] ] } },
{ "type": "Feature", "properties": { "nom": "Halte Ferroviaire de Francheville", "theme": "DEPLACEMENT", "soustheme": "Gare ferroviaire", "identifiant": "S5161", "idexterne": "87722702", "siret": "", "datecreation": "2009-05-18T00:00:00Z", "gid": 3462 }, "geometry": { "type": "Polygon", "coordinates": [ [ [ 837563.381415767129511, 6516524.051794294267893 ], [ 837553.086843714350834, 6516537.63918124511838 ], [ 837549.080515111214481, 6516534.85058874078095 ], [ 837559.634912857785821, 6516521.113369008526206 ], [ 837563.381415767129511, 6516524.051794294267893 ] ] ] } },
{ "type": "Feature", "properties": { "nom": "Halte Ferroviaire de La Tour-de-Salvagny", "theme": "DEPLACEMENT", "soustheme": "Gare ferroviaire", "identifiant": "S5162", "idexterne": "87721548", "siret": "", "datecreation": "2009-05-18T00:00:00Z", "gid": 3567 }, "geometry": { "type": "Polygon", "coordinates": [ [ [ 833308.864632180891931, 6523705.440004989504814 ], [ 833331.331088885548525, 6523682.722210745327175 ], [ 833335.536886475747451, 6523687.369317103177309 ], [ 833313.050576511654072, 6523709.387661485932767 ], [ 833308.864632180891931, 6523705.440004989504814 ] ] ] } },
{ "type": "Feature", "properties": { "nom": "Halte Ferroviaire Le Méridien", "theme": "DEPLACEMENT", "soustheme": "Gare ferroviaire", "identifiant": "S5163", "idexterne": "87721522", "siret": "", "datecreation": "2009-05-18T00:00:00Z", "gid": 3603 }, "geometry": { "type": "Polygon", "coordinates": [ [ [ 835850.876363816205412, 6520322.372546765953302 ], [ 835878.262267436250113, 6520230.8198551395908 ], [ 835888.413512535742484, 6520234.81864379439503 ], [ 835863.216313142795116, 6520324.123522051610053 ], [ 835853.913884242298082, 6520322.832763817161322 ], [ 835850.876363816205412, 6520322.372546765953302 ] ] ] } },
{ "type": "Feature", "properties": { "nom": "Halte Ferroviaire Les Flachères", "theme": "DEPLACEMENT", "soustheme": "Gare ferroviaire", "identifiant": "S5164", "idexterne": "87721704", "siret": "", "datecreation": "2009-05-18T00:00:00Z", "gid": 3604 }, "geometry": { "type": "Polygon", "coordinates": [ [ [ 836302.243988112779334, 6521246.940187439322472 ], [ 836302.874850886058994, 6521292.074709320440888 ], [ 836295.76042447052896, 6521292.273190950974822 ], [ 836294.500090246321633, 6521246.968682681210339 ], [ 836297.587653069407679, 6521246.979265323840082 ], [ 836302.243988112779334, 6521246.940187439322472 ] ], [ [ 836284.579186827875674, 6521292.570816068910062 ], [ 836283.748572244425304, 6521246.956634336151183 ], [ 836288.564775454229675, 6521246.947563297115266 ], [ 836289.105641233036295, 6521292.441784200258553 ], [ 836284.579186827875674, 6521292.570816068910062 ] ] ] } },
{ "type": "Feature", "properties": { "nom": "Gare de Lyon Perrache", "theme": "DEPLACEMENT", "soustheme": "Gare ferroviaire", "identifiant": "S5166", "idexterne": "87722025", "siret": "55204944783481", "datecreation": "2009-05-18T00:00:00Z", "gid": 3605 }, "geometry": { "type": "Polygon", "coordinates": [ [ [ 841992.049697341397405, 6518073.077613196335733 ], [ 842005.584300909540616, 6518097.081489942036569 ], [ 842006.732991889701225, 6518099.130112592130899 ], [ 842020.257602290948853, 6518123.133986772969365 ], [ 842021.127020115265623, 6518122.634551707655191 ], [ 842021.256870485376567, 6518122.874389527365565 ], [ 842029.691212707664818, 6518118.079830458387733 ], [ 842040.838560770149343, 6518137.696670597419143 ], [ 842003.6035516934935, 6518158.802697312086821 ], [ 842001.216282224049792, 6518154.495599003508687 ], [ 841953.698206812608987, 6518181.285121198743582 ], [ 841956.425126476446167, 6518186.011957686394453 ], [ 841925.166128288023174, 6518203.641903844662011 ], [ 841923.597893687430769, 6518200.953699639067054 ], [ 841876.22972669324372, 6518227.643333313986659 ], [ 841877.458303427323699, 6518229.951767518185079 ], [ 841850.64632848999463, 6518245.034599114209414 ], [ 841839.389134779805318, 6518225.058025248348713 ], [ 841811.18122149806004, 6518175.001666175201535 ], [ 841992.049697341397405, 6518073.077613196335733 ] ] ] } },
{ "type": "Feature", "properties": { "nom": "Gare de Saint-Germain-au-Mont-d'Or", "theme": "DEPLACEMENT", "soustheme": "Gare ferroviaire", "identifiant": "S5167", "idexterne": "87721282", "siret": "55204944762618", "datecreation": "2009-05-18T00:00:00Z", "gid": 3606 }, "geometry": { "type": "Polygon", "coordinates": [ [ [ 839893.354653060203418, 6533690.874810469336808 ], [ 839911.1048987172544, 6533667.74694733414799 ], [ 839917.898322939872742, 6533673.333781690336764 ], [ 839899.858418883522972, 6533695.912030480802059 ], [ 839893.354653060203418, 6533690.874810469336808 ] ] ] } },
{ "type": "Feature", "properties": { "nom": "Gare de Tassin", "theme": "DEPLACEMENT", "soustheme": "Gare ferroviaire", "identifiant": "S5168", "idexterne": "87721514", "siret": "55204944760372", "datecreation": "2009-05-18T00:00:00Z", "gid": 3607 }, "geometry": { "type": "Polygon", "coordinates": [ [ [ 836653.918983467854559, 6519514.871543435379863 ], [ 836654.529938970925286, 6519507.387544938363135 ], [ 836664.90162670367863, 6519508.208889133296907 ], [ 836672.155848069232889, 6519508.599973572418094 ], [ 836672.315944598056376, 6519507.440915594808757 ], [ 836692.160098005086184, 6519508.71372289955616 ], [ 836692.099894135957584, 6519510.022682181559503 ], [ 836699.743782237637788, 6519510.553731637075543 ], [ 836699.142743672477081, 6519518.42742557451129 ], [ 836664.280677032889798, 6519515.702877843752503 ], [ 836653.918983467854559, 6519514.871543435379863 ] ] ] } },
{ "type": "Feature", "properties": { "nom": "Gare de Lyon Jean Macé", "theme": "DEPLACEMENT", "soustheme": "Gare ferroviaire", "identifiant": "S5169", "idexterne": "87282624", "siret": "55204944759689", "datecreation": "2009-05-18T00:00:00Z", "gid": 3608 }, "geometry": { "type": "Polygon", "coordinates": [ [ [ 843164.736568109015934, 6517842.642925864085555 ], [ 843161.760869915829971, 6517832.840010386891663 ], [ 843219.190037184394896, 6517812.077822934836149 ], [ 843222.165730673004873, 6517821.900723289698362 ], [ 843164.736568109015934, 6517842.642925864085555 ] ] ] } },
{ "type": "Feature", "properties": { "nom": "Halte ferroviaire de Quincieux", "theme": "DEPLACEMENT", "soustheme": "Gare ferroviaire", "identifiant": "S5806", "idexterne": "87721290", "siret": "", "datecreation": "2015-08-12T00:00:00Z", "gid": 4399 }, "geometry": { "type": "Polygon", "coordinates": [ [ [ 837833.723675135173835, 6535707.663661848753691 ], [ 837871.148730813059956, 6535680.193146772682667 ], [ 837874.195461289142258, 6535684.340383244678378 ], [ 837855.687711235950701, 6535698.365445813164115 ], [ 837851.900885290815495, 6535697.795172276906669 ], [ 837844.106018294463865, 6535703.838770632632077 ], [ 837846.263751110527664, 6535706.527014625258744 ], [ 837846.053378410637379, 6535709.324710540473461 ], [ 837838.198594962013885, 6535715.188442741520703 ], [ 837834.652359643951058, 6535710.57148967590183 ], [ 837835.571739931940101, 6535709.932185249403119 ], [ 837833.723675135173835, 6535707.663661848753691 ] ] ] } },
{ "type": "Feature", "properties": { "nom": "Halte ferroviaire d'Irigny-Yvours", "theme": "DEPLACEMENT", "soustheme": "Gare ferroviaire", "identifiant": "S8443", "idexterne": "", "siret": "", "datecreation": "2019-09-11T00:00:00Z", "gid": 6044 }, "geometry": { "type": "Polygon", "coordinates": [ [ [ 842555.55558196734637, 6511534.106979170814157 ], [ 842601.042026252252981, 6511525.652623356319964 ], [ 842615.306237979908474, 6511699.360855277627707 ], [ 842570.469458744395524, 6511707.025949507020414 ], [ 842555.55558196734637, 6511534.106979170814157 ] ] ] } },
{ "type": "Feature", "properties": { "nom": "Gare de Vernaison", "theme": "DEPLACEMENT", "soustheme": "Gare ferroviaire", "identifiant": "S5139", "idexterne": "87722264", "siret": "", "datecreation": "2009-05-13T00:00:00Z", "gid": 6545 }, "geometry": { "type": "Polygon", "coordinates": [ [ [ 841233.157500603701919, 6506748.985901899635792 ], [ 841227.291433846810833, 6506751.882515992969275 ], [ 841221.13852534245234, 6506739.930480223149061 ], [ 841226.884692189283669, 6506736.993873027153313 ], [ 841233.157500603701919, 6506748.985901899635792 ] ] ] } },
{ "type": "Feature", "properties": { "nom": "Gare de Vénissieux", "theme": "DEPLACEMENT", "soustheme": "Gare ferroviaire", "identifiant": "S5140", "idexterne": "87723320", "siret": "", "datecreation": "2009-05-13T00:00:00Z", "gid": 6546 }, "geometry": { "type": "Polygon", "coordinates": [ [ [ 846880.864225267665461, 6513476.637050869874656 ], [ 846894.535035318229347, 6513469.655295204371214 ], [ 846893.879531646845862, 6513498.842468287795782 ], [ 846893.969472009222955, 6513498.792525646276772 ], [ 846893.526549311820418, 6513514.650105253793299 ], [ 846899.451907079666853, 6513514.821193032898009 ], [ 846899.441803763387725, 6513515.360771426931024 ], [ 846901.360297634731978, 6513515.431112013757229 ], [ 846901.118673797580414, 6513524.22422549687326 ], [ 846901.007930225576274, 6513528.251071731559932 ], [ 846900.997835136950016, 6513528.750681194476783 ], [ 846900.887089508818462, 6513532.787519631907344 ], [ 846900.685693801497109, 6513540.321620121598244 ], [ 846901.135342104942538, 6513540.331704924814403 ], [ 846900.883717812830582, 6513549.164784964174032 ], [ 846896.087116168346256, 6513550.772546583786607 ], [ 846895.473097431939095, 6513572.595451267436147 ], [ 846892.775211848667823, 6513572.514958018437028 ], [ 846892.272029304760508, 6513589.861365848220885 ], [ 846888.315129036549479, 6513589.750636736862361 ], [ 846881.700310110114515, 6513589.569414897821844 ], [ 846881.609785596258007, 6513592.457150711677969 ], [ 846881.509857130469754, 6513592.487106833606958 ], [ 846877.602926251478493, 6513592.336419148370624 ], [ 846878.176636137650348, 6513572.162224755622447 ], [ 846876.727771047619171, 6513572.121957594528794 ], [ 846873.140581125277095, 6513572.02129689976573 ], [ 846874.831196955172345, 6513514.106676298193634 ], [ 846879.827281397068873, 6513514.257588172331452 ], [ 846879.947955374605954, 6513510.530510833486915 ], [ 846882.436004348797724, 6513510.610960843041539 ], [ 846882.47634145617485, 6513508.822359785437584 ], [ 846879.798433922464028, 6513508.771847385913134 ], [ 846879.889042762690224, 6513505.474429771304131 ], [ 846869.876876952825114, 6513505.232555327937007 ], [ 846870.540008699870668, 6513487.526458033360541 ], [ 846880.342430466902442, 6513487.318638895638287 ], [ 846880.864225267665461, 6513476.637050869874656 ] ] ] } },
{ "type": "Feature", "properties": { "nom": "Halte ferroviaire Les Échets", "theme": "DEPLACEMENT", "soustheme": "Gare ferroviaire", "identifiant": "S7849", "idexterne": "87723718", "siret": "", "datecreation": "2018-03-08T00:00:00Z", "gid": 6608 }, "geometry": { "type": "Polygon", "coordinates": [ [ [ 848200.106387368170545, 6532365.305532862432301 ], [ 848215.737655106117018, 6532298.962124389596283 ], [ 848218.035720233106986, 6532299.382265864871442 ], [ 848210.164780350518413, 6532334.232609837315977 ], [ 848208.034636475727893, 6532343.135009119287133 ], [ 848209.253689765348099, 6532342.97539162542671 ], [ 848213.739826907287352, 6532344.205338314175606 ], [ 848210.319505582563579, 6532358.9327855957672 ], [ 848204.504447346087545, 6532357.652602245099843 ], [ 848202.584255645982921, 6532365.97551089618355 ], [ 848200.106387368170545, 6532365.305532862432301 ] ] ] } }
]
}
