<?xml version="1.0" encoding="UTF-8" standalone="no"?>
<!-- Created with Inkscape (http://www.inkscape.org/) -->

<svg
   width="128"
   height="128"
   viewBox="0 0 33.866666 33.866666"
   version="1.1"
   id="svg1680"
   inkscape:version="1.2.2 (b0a8486541, 2022-12-01)"
   sodipodi:docname="icon_blog_v2.svg"
   xmlns:inkscape="http://www.inkscape.org/namespaces/inkscape"
   xmlns:sodipodi="http://sodipodi.sourceforge.net/DTD/sodipodi-0.dtd"
   xmlns="http://www.w3.org/2000/svg"
   xmlns:svg="http://www.w3.org/2000/svg">
  <sodipodi:namedview
     id="namedview1682"
     pagecolor="#ffffff"
     bordercolor="#000000"
     borderopacity="0.25"
     inkscape:showpageshadow="false"
     inkscape:pageopacity="0.0"
     inkscape:pagecheckerboard="0"
     inkscape:deskcolor="#d1d1d1"
     inkscape:document-units="mm"
     showgrid="false"
     borderlayer="true"
     inkscape:zoom="2.8284271"
     inkscape:cx="19.091883"
     inkscape:cy="28.107495"
     inkscape:window-width="1920"
     inkscape:window-height="1172"
     inkscape:window-x="1920"
     inkscape:window-y="0"
     inkscape:window-maximized="1"
     inkscape:current-layer="layer1" />
  <defs
     id="defs1677">
    <inkscape:path-effect
       effect="fillet_chamfer"
       id="path-effect4741"
       is_visible="true"
       lpeversion="1"
       nodesatellites_param="F,0,0,1,0,0,0,1 @ F,0,0,1,0,0,0,1 @ F,0,0,1,0,0,0,1 @ F,0,0,1,0,0,0,1 @ F,0,0,1,0,0,0,1 @ F,0,0,1,0,0,0,1 @ F,0,0,1,0,0,0,1 @ F,0,0,1,0,0,0,1 @ F,0,0,1,0,0,0,1 @ F,0,0,1,0,0,0,1 @ F,0,0,1,0,0.62923729,0,1 @ F,0,0,1,0,0.21397384,0,1 @ F,0,0,1,0,0,0,1"
       unit="px"
       method="auto"
       mode="F"
       radius="0"
       chamfer_steps="1"
       flexible="false"
       use_knot_distance="true"
       apply_no_radius="true"
       apply_with_radius="true"
       only_selected="false"
       hide_knots="false" />
  </defs>
  <g
     inkscape:label="Calque 1"
     inkscape:groupmode="layer"
     id="layer1">
    <g
       id="g2436"
       transform="matrix(1.0000071,0,0,1,-1.7357565e-6,0.5321789)">
      <path
         id="rect15896"
         style="fill:#3a74ac;fill-opacity:1;stroke:none;stroke-width:0.767356;stroke-linecap:round;stroke-linejoin:round;stroke-dasharray:none;stroke-opacity:1"
         d="m 3.1438123,2.2958211 c -1.606732,0 -2.90036031,1.2936283 -2.90036031,2.9003602 V 26.300861 c 0,1.606732 1.29362831,2.90036 2.90036031,2.90036 h 2.9910752 l -0.6614536,4.10802 6.7040821,-4.10802 h 18.545338 c 1.606732,0 2.90036,-1.293628 2.90036,-2.90036 V 5.1961813 c 0,-1.6067319 -1.293628,-2.9003602 -2.90036,-2.9003602 z"
         sodipodi:nodetypes="sssscccsssss" />
      <text
         xml:space="preserve"
         style="font-size:21.5967px;font-family:Conthrax;-inkscape-font-specification:'Conthrax, Normal';fill:#ffffff;stroke-width:0.860113;stroke-linecap:round;stroke-linejoin:round"
         x="10.036745"
         y="23.919592"
         id="text912"><tspan
           sodipodi:role="line"
           id="tspan910"
           style="font-style:normal;font-variant:normal;font-weight:bold;font-stretch:normal;font-size:21.5967px;font-family:'DejaVu Sans Mono';-inkscape-font-specification:'DejaVu Sans Mono, Bold';font-variant-ligatures:normal;font-variant-caps:normal;font-variant-numeric:normal;font-variant-east-asian:normal;fill:#ffffff;stroke-width:0.860113"
           x="10.036745"
           y="23.919592">i</tspan></text>
    </g>
  </g>
</svg>
