<?xml version="1.0" encoding="UTF-8" standalone="no"?>
<!-- Created with Inkscape (http://www.inkscape.org/) -->

<svg
   width="128"
   height="128"
   viewBox="0 0 33.866666 33.866666"
   version="1.1"
   id="svg1680"
   inkscape:version="1.4 (1:1.4+202410161351+e7c3feb100)"
   sodipodi:docname="ticket.svg"
   xmlns:inkscape="http://www.inkscape.org/namespaces/inkscape"
   xmlns:sodipodi="http://sodipodi.sourceforge.net/DTD/sodipodi-0.dtd"
   xmlns="http://www.w3.org/2000/svg"
   xmlns:svg="http://www.w3.org/2000/svg">
  <sodipodi:namedview
     id="namedview1682"
     pagecolor="#ffffff"
     bordercolor="#000000"
     borderopacity="0.25"
     inkscape:showpageshadow="false"
     inkscape:pageopacity="0.0"
     inkscape:pagecheckerboard="0"
     inkscape:deskcolor="#d1d1d1"
     inkscape:document-units="mm"
     showgrid="false"
     borderlayer="true"
     inkscape:zoom="4"
     inkscape:cx="124.125"
     inkscape:cy="80.625"
     inkscape:window-width="2560"
     inkscape:window-height="1368"
     inkscape:window-x="2560"
     inkscape:window-y="0"
     inkscape:window-maximized="1"
     inkscape:current-layer="layer1" />
  <defs
     id="defs1677">
    <inkscape:path-effect
       effect="fillet_chamfer"
       id="path-effect4741"
       is_visible="true"
       lpeversion="1"
       nodesatellites_param="F,0,0,1,0,0,0,1 @ F,0,0,1,0,0,0,1 @ F,0,0,1,0,0,0,1 @ F,0,0,1,0,0,0,1 @ F,0,0,1,0,0,0,1 @ F,0,0,1,0,0,0,1 @ F,0,0,1,0,0,0,1 @ F,0,0,1,0,0,0,1 @ F,0,0,1,0,0,0,1 @ F,0,0,1,0,0,0,1 @ F,0,0,1,0,0.62923729,0,1 @ F,0,0,1,0,0.21397384,0,1 @ F,0,0,1,0,0,0,1"
       unit="px"
       method="auto"
       mode="F"
       radius="0"
       chamfer_steps="1"
       flexible="false"
       use_knot_distance="true"
       apply_no_radius="true"
       apply_with_radius="true"
       only_selected="false"
       hide_knots="false" />
    <rect
       x="89.449013"
       y="133.99673"
       width="265.16504"
       height="227.33482"
       id="rect1" />
  </defs>
  <g
     inkscape:label="Calque 1"
     inkscape:groupmode="layer"
     id="layer1">
    <path
       id="rect15896-36"
       style="fill:#3a74ac;fill-opacity:1;stroke:none;stroke-width:0.766396;stroke-linecap:round;stroke-linejoin:round;stroke-dasharray:none;stroke-opacity:1"
       d="m 8.5761915,4.4571652 c -4.497411,0 -8.11806701,3.599098 -8.11806701,8.0694088 v 0.572132 10.160795 5.172677 c 0,1.604721 1.29201201,2.896732 2.89673301,2.896732 h 5.221334 16.5247115 0.577166 c 4.497409,0 8.118065,-3.599097 8.118065,-8.069409 V 21.989402 12.526574 7.3538972 c 0,-1.60472 -1.292012,-2.896732 -2.896732,-2.896732 h -5.221333 -14.69926 z" />
    <path
       id="rect15896-3-7"
       style="fill:#326595;fill-opacity:1;stroke:none;stroke-width:0.766396;stroke-linecap:round;stroke-linejoin:round;stroke-dasharray:none;stroke-opacity:1"
       d="m 0.45812449,12.526574 v 0.572132 10.160795 5.172677 c 0,1.604721 1.29201201,2.896732 2.89673301,2.896732 h 5.221334 16.5247115 0.577166 C 14.300559,30.195668 3.5645935,30.587244 0.45812449,12.526574 Z"
       sodipodi:nodetypes="cccsscccc" />
    <path
       id="rect15896-3-6-5"
       style="fill:#326595;fill-opacity:1;stroke:none;stroke-width:0.766396;stroke-linecap:round;stroke-linejoin:round;stroke-dasharray:none;stroke-opacity:1"
       d="M 33.796134,12.526574 V 7.3538972 c 0,-1.604721 -1.292012,-2.896732 -2.896732,-2.896732 h -5.221335 c 5.115055,0.673769 7.586565,3.438624 8.118067,8.0694088 z"
       sodipodi:nodetypes="csscc" />
    <path
       style="font-weight:900;font-size:133.333px;font-family:'Source Sans Pro';-inkscape-font-specification:'Source Sans Pro Heavy';white-space:pre;fill:#ffffff"
       d="m 100.64919,250.66246 h 13.06663 l 2.93333,-23.99994 h 12.26663 l -2.93332,23.99994 h 13.06663 l 2.93333,-23.99994 h 12.79997 v -14.39996 h -11.19998 l 1.6,-12.79997 h 12.26663 v -14.39996 h -10.39997 l 2.4,-21.06661 H 136.6491 l -2.66666,21.06661 H 121.7158 l 2.4,-21.06661 h -12.79997 l -2.66666,21.06661 H 96.6492 v 14.39996 h 10.13331 l -1.6,12.79997 H 93.98254 v 14.39996 h 9.59998 z m 17.59996,-38.3999 1.59999,-12.79997 h 12.26664 l -1.6,12.79997 z"
       id="text1"
       transform="matrix(0.26458333,0,0,0.26458333,-16.457096,-36.911101)"
       aria-label="#" />
  </g>
</svg>
